{"text_format":"1","workbook":"xlsx","n_sheets":5,"sheets":["Form","Annex 1 - Qualitative crite","Annex 2 -Processes","Back","Annex 3 - PKD code classificati"],"not_rendered":{"charts":0,"images":5,"macros":1,"external_links":0,"defined_names":59,"comments":1,"pivot_tables":0},"unopened":[],"bounds":{"document_bytes":16777216,"sheet_cells":100000,"rows_first":2000,"rows_last":500,"rows_between":2000,"halvings":0,"cell_chars":16384,"cell_head_chars":4096},"cells_cut":0,"cells_raw":0,"read":"whole","date_system":"1900"}

{"sheet":"Form","index":0,"n_rows":339,"n_cols":11,"rows_kept":339,"cut":false,"hidden":false,"merged":[[171,1,171,10],[324,1,324,8],[325,1,325,8],[324,9,324,10],[325,9,325,10],[323,0,323,10],[48,0,49,0],[64,1,68,3],[68,4,68,8],[261,1,261,5],[261,6,261,10],[313,1,313,10],[314,0,314,8],[315,0,315,8],[316,0,316,8],[317,0,317,8],[318,0,318,8],[319,0,319,8],[320,0,320,8],[321,0,321,8],[314,9,314,10],[315,9,315,10],[316,9,316,10],[317,9,317,10],[318,9,318,10],[319,9,319,10],[320,9,320,10],[321,9,321,10],[126,0,126,2],[127,0,127,2],[128,0,128,2],[128,4,128,9],[53,5,53,6],[283,1,283,5],[283,6,283,10],[284,1,284,5],[282,0,284,0],[284,6,284,10],[144,1,144,7],[173,6,173,7],[174,6,174,7],[175,6,175,7],[176,6,176,7],[140,1,140,7],[141,1,141,7],[142,1,142,7],[143,1,143,7],[54,5,54,6],[165,2,165,3],[50,1,50,10],[54,3,54,4],[54,1,54,2],[80,1,80,2],[130,1,130,2],[130,3,130,10],[86,0,86,2],[87,0,87,2],[125,0,125,2],[135,1,135,7],[136,1,136,7],[137,1,137,7],[138,1,138,7],[139,1,139,7],[51,0,55,0],[51,1,51,10],[56,0,57,0],[118,6,118,10],[114,1,114,7],[115,1,115,7],[116,1,116,7],[113,1,113,7],[105,1,105,7],[339,6,342,9],[166,4,166,9],[167,4,167,9],[168,4,168,9],[178,3,178,4],[177,6,177,7],[178,6,178,7],[179,6,179,7],[207,1,207,10],[183,1,183,5],[183,6,183,10],[184,1,184,5],[184,6,184,10],[166,2,166,3],[173,3,173,4],[174,3,174,4],[175,3,175,4],[176,3,176,4],[177,3,177,4],[169,4,169,9],[167,2,167,3],[168,2,168,3],[211,6,211,8],[211,9,211,10],[67,4,67,8],[63,1,63,10],[74,5,74,10],[104,1,104,7],[92,2,92,6],[93,2,93,6],[92,7,92,8],[93,7,93,8],[101,6,101,9],[78,1,78,2],[75,1,75,10],[74,1,74,4],[146,0,148,0],[46,4,46,5],[46,6,46,7],[43,0,47,0],[43,1,43,10],[70,0,71,0],[71,1,71,4],[71,5,71,10],[84,0,84,2],[85,0,85,2],[58,9,58,10],[59,9,59,10],[60,9,60,10],[61,9,61,10],[57,1,57,10],[124,0,124,3],[82,1,82,10],[124,4,124,9],[129,1,129,2],[125,4,125,9],[106,1,106,7],[107,1,107,7],[108,1,108,7],[109,1,109,7],[165,4,165,9],[145,1,145,10],[131,1,131,10],[134,1,134,7],[154,2,154,3],[155,2,155,3],[156,2,156,3],[157,2,157,3],[158,2,158,3],[161,1,161,10],[164,2,164,3],[164,4,164,9],[153,4,153,9],[146,9,146,10],[147,9,147,10],[153,2,153,3],[151,1,151,10],[159,2,159,7],[159,8,159,9],[154,4,154,9],[155,4,155,9],[156,4,156,9],[157,4,157,9],[158,4,158,9],[285,6,285,10],[285,1,285,5],[90,1,90,5],[90,6,90,10],[118,1,118,5],[110,1,110,7],[111,1,111,7],[112,1,112,7],[169,2,169,3],[181,2,181,10],[180,9,180,10],[180,6,180,7],[205,1,205,9],[179,3,179,4],[180,3,180,4],[210,3,210,5],[210,6,210,8],[210,9,210,10],[211,3,211,5],[190,1,190,3],[190,4,190,9],[198,1,198,7],[199,1,199,7],[200,1,200,7],[16,1,28,9],[75,0,81,0],[30,0,30,10],[48,1,48,4],[56,1,56,4],[35,2,35,3],[36,2,36,3],[35,4,35,5],[35,6,35,7],[36,4,36,5],[36,6,36,7],[77,1,77,2],[79,1,79,2],[31,1,31,4],[53,3,53,4],[58,1,58,8],[59,1,59,8],[60,1,60,8],[61,1,61,8],[31,5,31,10],[32,1,32,4],[32,5,32,10],[72,5,72,10],[73,5,73,10],[6,0,8,9],[0,0,0,10],[1,0,1,10],[3,1,3,10],[15,0,15,9],[12,0,12,9],[13,0,13,9],[4,0,5,10],[9,0,9,10],[10,0,10,9],[11,0,11,9],[14,0,14,9],[33,1,33,10],[33,0,37,0],[70,1,70,4],[72,1,72,4],[73,1,73,4],[38,0,42,0],[38,1,38,10],[40,2,40,3],[40,4,40,5],[40,6,40,7],[41,2,41,3],[41,4,41,5],[41,6,41,7],[54,7,54,8],[49,1,49,4],[49,5,49,10],[45,2,45,3],[45,4,45,5],[45,6,45,7],[46,2,46,3],[63,0,69,0],[64,4,64,8],[65,4,65,8],[66,4,66,8],[201,1,201,7],[202,1,203,9],[195,1,195,7],[196,1,196,7],[197,1,197,7],[194,1,194,9],[212,3,212,5],[212,6,212,8],[209,9,209,10],[209,6,209,8],[209,3,209,5],[218,3,218,5],[218,6,218,8],[218,9,218,10],[219,3,219,5],[219,6,219,8],[219,9,219,10],[212,9,212,10],[213,3,213,5],[213,6,213,8],[213,9,213,10],[216,3,216,5],[216,6,216,8],[216,9,216,10],[217,3,217,5],[217,6,217,8],[217,9,217,10],[214,3,214,5],[214,6,214,8],[214,9,214,10],[215,3,215,5],[215,6,215,8],[215,9,215,10],[222,3,222,5],[222,6,222,8],[222,9,222,10],[223,3,223,5],[223,6,223,8],[223,9,223,10],[220,3,220,5],[220,6,220,8],[220,9,220,10],[221,3,221,5],[221,6,221,8],[221,9,221,10],[279,2,279,3],[230,3,230,5],[230,6,230,8],[230,9,230,10],[231,3,231,5],[231,6,231,8],[231,9,231,10],[228,3,228,5],[228,6,228,8],[228,9,228,10],[229,3,229,5],[229,6,229,8],[229,9,229,10],[232,1,233,10],[243,2,243,3],[276,0,276,1],[276,2,276,3],[276,4,276,5],[240,6,240,7],[241,4,241,5],[241,6,241,7],[242,4,242,5],[242,6,242,7],[266,4,266,5],[337,7,337,9],[48,5,48,10],[56,5,56,10],[70,5,70,10],[150,0,150,10],[151,0,160,0],[161,0,170,0],[192,0,192,10],[333,2,333,3],[329,4,329,9],[330,4,330,9],[331,4,331,9],[332,4,332,9],[333,4,333,9],[329,2,329,3],[330,2,330,3],[331,2,331,3],[332,2,332,3],[292,0,297,0],[298,0,303,0],[282,1,282,5],[282,6,282,10],[253,1,253,10],[255,1,255,7],[327,0,327,10],[335,0,335,10],[102,0,117,0],[103,1,103,10],[102,1,102,10],[104,9,117,10],[117,1,117,8],[304,1,304,5],[309,1,309,5],[309,6,309,10],[252,0,252,10],[253,0,262,0],[295,2,295,7],[296,2,296,7],[298,1,298,10],[292,1,292,10],[294,2,294,7],[256,1,256,7],[263,1,264,5],[263,6,264,10],[257,1,257,7],[238,4,238,5],[122,1,122,10],[311,0,311,10],[306,0,306,10],[263,0,264,0],[248,2,248,3],[248,4,248,6],[248,7,248,8],[245,1,245,10],[247,7,247,8],[247,4,247,6],[247,2,247,3],[258,1,258,7],[259,1,260,7],[260,8,260,9],[286,1,286,5],[286,6,286,10],[265,1,265,10],[279,9,279,10],[275,0,275,1],[275,2,275,3],[275,4,275,5],[275,6,275,7],[275,9,275,10],[276,9,276,10],[291,1,291,5],[279,0,279,1],[304,6,304,10],[185,1,185,10],[187,2,187,3],[187,4,187,5],[187,6,187,7],[188,2,188,3],[188,4,188,5],[188,6,188,7],[234,1,234,5],[235,1,235,5],[236,1,236,10],[234,6,234,10],[235,6,235,10],[243,4,243,5],[243,6,243,7],[239,2,239,3],[240,2,240,3],[238,2,238,3],[241,2,241,3],[242,2,242,3],[238,6,238,7],[239,4,239,5],[239,6,239,7],[240,4,240,5],[291,6,291,10],[288,1,288,10],[276,6,276,7],[277,6,277,7],[278,6,278,7],[279,6,279,7],[280,6,280,7],[277,0,277,1],[277,2,277,3],[289,1,289,8],[290,1,290,8],[288,0,290,0],[289,9,289,10],[290,9,290,10],[280,0,280,1],[280,2,280,3],[279,4,279,5],[280,9,280,10],[277,4,277,5],[277,9,277,10],[278,0,278,1],[278,2,278,3],[278,4,278,5],[280,4,280,5],[266,6,266,10],[278,9,278,10],[119,1,121,5],[119,6,121,10],[119,0,121,0],[126,4,126,9],[127,4,127,9],[147,6,147,8],[146,6,146,8],[148,6,148,8],[148,9,148,10],[146,1,148,5],[226,3,226,5],[226,6,226,8],[226,9,226,10],[227,3,227,5],[227,6,227,8],[227,9,227,10],[224,3,224,5],[224,6,224,8],[224,9,224,10],[225,3,225,5],[225,6,225,8],[225,9,225,10],[268,0,268,1],[268,2,268,3],[268,4,268,5],[268,6,268,7],[268,8,268,10],[269,0,269,1],[269,2,269,3],[269,4,269,5],[269,6,269,7],[269,8,269,10],[270,0,270,1],[270,2,270,3],[270,4,270,5],[270,6,270,7],[270,8,270,10],[271,0,271,1],[271,2,271,3],[271,4,271,5],[271,6,271,7],[271,8,271,10],[272,0,272,1],[272,2,272,3],[272,4,272,5],[272,6,272,7],[272,8,272,10],[273,0,273,1],[273,2,273,3],[273,4,273,5],[273,6,273,7],[273,8,273,10]]}
["Programme for supporting investments of major importance to the Polish economy for the years 2011-2030"]
["Programme resolution no. 91/2023"]
[]
[null,"Application – information about investment project"]
["The English version of the form is for illustrative purposes only. Please complete the Polish version of the form in Polish."]
[]
["The information about investment project document is an application form on the basis of which the Polish Investment and Trade Agency (PAIH) analyses the data provided by the investor in terms of meeting the formal requirements of the Programme and the reliability and reality of the information provided about the investment project. In case verification or additional information is required, PAIH may ask the investor (alternatively in this form as \"beneficiary\")  to submit written explanations or corrections."]
[]
[]
["INSTRUCTION:\n1.\tThe form should be completed in Polish. \n2.\tThe form should be printed and signed by persons authorized to represent the investor and sent to the address of PAIH, Krucza 50, 00-025 Warsaw. Alternatively, the form can be prepared in PDF form signed with a qualified signature and sent to the following e-mail address: grant@paih.gov.pl. \n3.\tRegardless of submitting the form in one of the two forms indicated in the above point 2, the form should also be sent in XLS format to the e-mail address: grant@paih.gov.pl. \n4.\tLegend of coloring: \n-\tblue: selected list,\n-\tred: automatic summation of results – fields should not be filled,\n-\tgreen: fields containing additional explanations. \n"]
["5.\tA correctly submitted form must contain: (Please tick the attachments attached to the form).\n-\tsheet 'Annex 1 - Criteria',\n"]
["`-\tinformation from the State Aid Data Sharing System (SUDOP) on investments supported by state aid, initiated by the same beneficiary (at the group level) in the last 3 years, \t"]
["`-current excerpt from the National Court Register (KRS), printout from the Central Register and Information on Business (CEiDG), power of attorney, articles of association or other equivalent document from which the authorization of the person signing the form arises, \n"]
["`- Analysis of the incentive effect - in the case of having the status of a large entrepreneur or a growing entrepreneur. "]
["\nLegal basis:\n-\tResolution No. 91/2023 of the Council of Ministers with the Annex \"Program for supporting investments of significant importance for the Polish economy for the years 2011-2030\";\n-\tCommission Regulation (EU) No 651/2014 of 17 June 2014 declaring certain categories of aid compatible with the internal market in application of Articles 107 and 108 of the Treaty."]
[]
[]
[]
[]
[]
[]
[]
[]
[]
[]
[]
[]
[]
[]
[]
["I. Information about the new project"]
[1,"Name of the beneficiary of the state aid (if the company is not registered in Poland, the name of the company that applies on behalf of the beneficiary)"]
[2,"Size of the enterprise at the group level"]
[3,"Balance sheet total for the last 3 years - at group level"]
[]
[null,null,"Year",null,{"$f":"B_Start_3","v":"2020-09-01"},null,{"$f":"B_Start_2","v":"2021-09-01"},null,{"$f":"B_Start_1","v":"2022-09-01"}]
[null,null,"Balance sheet total (EUR)",null,0,null,0,null,0]
[]
[4,"Revenue for the last 3 years – at group level"]
[]
[null,null,"Year",null,{"$f":"B_Start_3","v":"2020-09-01"},null,{"$f":"B_Start_2","v":"2021-09-01"},null,{"$f":"B_Start_1","v":"2022-09-01"}]
[null,null,"Balance sheet total (EUR)",null,0,null,0,null,0]
[]
[5,"Number of jobs for the last 3 years – at group level"]
[]
[null,null,"Year",null,{"$f":"B_Start_3","v":"2020-09-01"},null,{"$f":"B_Start_2","v":"2021-09-01"},null,{"$f":"B_Start_1","v":"2022-09-01"}]
[null,null,"Balance sheet total (EUR)"]
[]
[6,"Type of investment"]
[null,"Eligible costs (PLN)"]
[null,{"$f":"Text_BusinessProcessesPrompt","v":""}]
[7,"Location "]
[]
[null,"Voivodeship:","Kujawsko-pomorskie","Region NUTS 3:",null,"Włocławski",null,"County:","Włocławek"]
[null,"Municipality",null,"Włocławek",null,"Locality:",null,"Włocławek"]
[]
[8,"Is the location at risk of exclusion? If \"Yes\" - Please indicate the ground for exclusion"]
[null,"Grounds for exclusion:"]
[null,"a) in a medium-sized city losing socio-economic functions, listed in Table No. 3 in Annex No. 1 to the Regulation of the Council of Ministers of 27 December 2022 on public aid granted to certain entrepreneurs for the implementation of new investments (Journal of laws no. 2861) "]
[null,"b) in the municipality in which the town referred to in point (a) is situated"]
[null,"c) in a municipality bordering a city referred to in point (a) or a municipality referred to in point (b)"]
[null,"d) in the area of counties or cities with county rights, where the unemployment rate is at least 160% of the average unemployment rate in the country"]
[]
[9,"Type of investment (more than one answer can be selected)"]
[null,"initial investment",null,null,{"$f":"EIT_1","v":"setting-up of a new establishment"}]
[null,null,null,null,{"$f":"EIT_2","v":"extending the capacity of an existing establishment"}]
[null,null,null,null,{"$f":"EIT_3","v":"diversification of the output of an establishment into products not previously produced in the establishment"}]
[null,null,null,null,{"$f":"EIT_4","v":"fundamental change in the overall production process of an existing establishment"}]
[null,null,null,null,{"$f":"EIT_5","v":"the acquisition of assets belonging to an establishment that has closed or would have closed had it not been purchased, and is bought by an investor unrelated to the seller"}]
[]
[10,"Is the project a reinvestment?"]
[null,"Number of existing jobs in the establishment in the 12 months before the date of submission of the application for public aid:"]
[11,"Date of beginning of the project",null,null,null,"2023-09-01"]
[12,"Date of project completion",null,null,null,"2026-12-01"]
[13,"Project duration (years)",null,null,null,{"$f":"ROUNDUP(IF((Project_End_Date-Project_Start_Date)/365=0,\" \",(Project_End_Date-Project_Start_Date)/365),0)","v":4}]
["14","Capital expenditures by type of eligible costs broken down by years (PLN)"]
[]
[null,"Year",null,{"$f":"IF(Project_Start_Date=0,\" \",Project_Start_Date)","v":"2023-09-01"},{"$f":"A_Start_1","v":"2024-08-31"},{"$f":"A_Start_2","v":"2025-08-31"},{"$f":"A_Start_3","v":"2026-08-31"},{"$f":"A_Start_4","v":""},{"$f":"A_Start_5","v":""},{"$f":"A_Start_6","v":""},"Total"]
[null,"Purchase price of tangible assets",null,0,0,0,0,0,0,0,{"$f":"SUM(B79:J80)","v":0}]
[null,"Purchase price of intangible assets",null,0,0,0,0,0,0,0,{"$f":"SUM(B80:J81)","v":0}]
[null,"Total",null,{"$f":"D79+D80","v":0},{"$f":"E79+E80","v":0},0,0,0,0,null,{"$f":"K79+K80","v":0}]
[]
[15,"New jobs"]
[]
["Year",null,null,{"$f":"IF(Project_Start_Date=0,\" \",Project_Start_Date)","v":"2023-09-01"},{"$f":"A_Start_1","v":"2024-08-31"},{"$f":"A_Start_2","v":"2025-08-31"},{"$f":"A_Start_3","v":"2026-08-31"},{"$f":"A_Start_4","v":""},{"$f":"A_Start_5","v":""},{"$f":"A_Start_6","v":""},"Total"]
["planned number of newly created jobs (FTEs) – employees without higher education",null,null,null,null,null,null,null,null,null,{"$f":"SUM(D86:J86)","v":0}]
["planned number of newly created jobs (FTEs) – employees with higher education ",null,null,null,null,null,null,null,null,null,{"$f":"SUM(D87:J87)","v":0}]
["Total",null,null,{"$f":"D86+D87","v":0},0,0,0,0,0,0,0]
[]
[]
[16,"Increased support for training"]
[]
[null,null,"Number of people participating in training, not greater than the number of jobs newly created as a result of investment execution"]
[null,null,"Value of training costs per one person"]
[]
[]
[]
[]
[]
[]
[]
[]
[19,"Qualitative criteria"]
[]
[null,"Criterion",null,null,null,null,null,null,"Declaration"]
[null,{"$f":"IF(Cost_Type=2,'Annex 1 - Qualitative crite'!A7,'Annex 1 - Qualitative crite'!A25)","v":"1.  Type of processes performed"}]
[null,{"$f":"IF(Cost_Type=2,'Annex 1 - Qualitative crite'!A8,'Annex 1 - Qualitative crite'!A26)","v":"2.  Conducting R+D activities"}]
[null,{"$f":"IF(Cost_Type=2,'Annex 1 - Qualitative crite'!A9,'Annex 1 - Qualitative crite'!A27)","v":"3.   Utilization of the potential of human resources"}]
[null,{"$f":"IF(Cost_Type=2,'Annex 1 - Qualitative crite'!A10,'Annex 1 - Qualitative crite'!A28)","v":"4.   Robotization and process automation"}]
[null,{"$f":"IF(Cost_Type=2,'Annex 1 - Qualitative crite'!A11,'Annex 1 - Qualitative crite'!A29)","v":"5.   Status of a micro, small or medium-sized entrepreneur"}]
[null,{"$f":"IF(Cost_Type=2,'Annex 1 - Qualitative crite'!A12,'Annex 1 - Qualitative crite'!A30)","v":"6.   Creating highly-paid and stable workplaces"}]
[null,{"$f":"IF(Cost_Type=2,'Annex 1 - Qualitative crite'!A13,'Annex 1 - Qualitative crite'!A31)","v":"7.   Investment in a building with low negative impact on the environment"}]
[null,{"$f":"IF(Cost_Type=2,'Annex 1 - Qualitative crite'!A14,'Annex 1 - Qualitative crite'!A32)","v":"8. Supporting the territorially balanced development of the country"}]
[null,{"$f":"IF(Cost_Type=2,'Annex 1 - Qualitative crite'!A15,'Annex 1 - Qualitative crite'!A33)","v":"9.   Supporting the acquisition of education and professional qualifications and cooperation with sectoral education"}]
[null,{"$f":"IF(Cost_Type=2,'Annex 1 - Qualitative crite'!A16,'Annex 1 - Qualitative crite'!A34)","v":"10. Taking care of employee welfare"}]
[null,{"$f":"IF(Cost_Type=2,\"\",'Annex 1 - Qualitative crite'!A35)","v":""}]
[null,"Number of qualitative criteria declared:",null,null,null,null,null,null,{"$f":"Quality_Points","v":0}]
[]
[20,"Start of production/service (date)"]
[21,"Brief description of the project (no more than 1800 characters)"]
[]
[]
[22,"Does the entrepreneur apply or intend to apply for another form of support for the same project (income tax exemption under PSI, exemption from RET, EU funds, other)"]
[]
["Form of support",null,null,null,"Details (e.g. support decision number, type of aid scheme)"]
["Income tax exemption within the Polish Investment Zone"]
["Real estate tax exemption"]
["European Union funds"]
["Others"]
[]
[23,"Is it possible to combine support instruments (if 'yes', on what basis)?"]
[24,"Does the project for which state aid is to be granted include activities in the following sectors?"]
[]
[null,{"$f":"IF(Control_Sectors<>10,TEXT_SECTOR_CONTROL,\"\")","v":"Please tick the declarations for each of the following sectors:"}]
[null,"Sector",null,null,null,null,null,null,"Yes","No"]
[null,"in the fisheries and aquaculture sector\t\t\t\t\t\t"]
[null,"in respect of primary production of agricultural products listed in Annex I to the Treaty on the Functioning of the European Union"]
[null,"processing and marketing of agricultural products listed in Annex I to the Treaty on the Functioning of the European Union"]
[null,"in the iron and steel sector"]
[null,"in the shipbuilding sector\t\t\t\t\t\t"]
[null,"in the synthetic fibres sector"]
[null,"in the transport sector or related infrastructure"]
[null,"in the energy generation, distribution and infrastructure sector"]
[null,"in the coal sector"]
[null,"in the financial sector"]
[null,{"$f":"IF(Sector_Eligibility>0,Text_Sector_Error,\"\")","v":""}]
[25,"Status of the application for state aid to the minister competent for economy",null,null,null,null,"Has the application been submitted?"]
[null,null,null,null,null,null,"Date of submission:"]
[null,null,null,null,null,null,"The cash grant amount declared in the application:"]
[]
["II.\tGeneral information about the entrepreneur at the group level in the world – fill in only in the case of entrepreneurs operating also outside Poland"]
[1,"Company’s headquarters and locations"]
[]
[null,null,"Country, city",null,"Sector of activity"]
[]
[]
[]
[]
[]
[null,null,"Country of origin of the group's capital:"]
[]
[2,"Ownership structure (5 largest shareholders)"]
[null,"The ownership structure of the Polish entity should be indicated, starting with the parent company at the group level"]
[]
[null,null,"Shareholder",null,"Information of the number of shares and percentage share"]
[]
[]
[]
[]
[]
[]
[3,"Sectors of activity (more than one answer can be selected):"]
[]
[null,"Household appliance",null,"Pharmaceutical",null,null,"Furniture",null,null,"Food"]
[null,"Biotechnology",null,"Waste management",null,null,"Medical",null,null,"Glass"]
[null,"BSS",null,"Components for RES",null,null,"Metal",null,null,"Textile"]
[null,"Chemical",null,"Cosmetic",null,null,"Automotive",null,null,"Tourism and Entertainment"]
[null,"Wood",null,"Logistic",null,null,"Real Estate",null,null,"Plastics"]
[null,"Electromobility",null,"Aviation",null,null,"Shipbuilding",null,null,"Tobacco"]
[null,"Electronics",null,"Machinery",null,null,"Means of transport",null,null,"Mining"]
[null,"Energy",null,"Building materials",null,null,"R&D"]
[null,"Other (indicate):"]
[]
[4,"Main customers"]
[5,"Main competitors"]
[6,"Other, e.g. general expenditure on R&D in the last 3 years, quality certificates held"]
[]
[null,null,"Year",null,{"$f":"B_Start_3","v":"2020-09-01"},null,{"$f":"B_Start_2","v":"2021-09-01"},null,{"$f":"B_Start_1","v":"2022-09-01"}]
[null,null,"Expenditure",null,0,null,0,null,0]
[]
[null,"Certificates and additional information"]
[]
["III.\t Previous activity of the entrepreneur at the group level in Poland – if the group has so far conducted business in Poland"]
[]
[null,"Questionnaire on the entity's past activities"]
[null,"Are there links between the entity and other entrepreneurs in the sense that:",null,null,null,null,null,null,"Yes","No"]
[null,"(a) one entrepreneur holds a majority of the voting rights in the other?"]
[null,"(b) one entrepreneur has the right to appoint or dismiss a majority of the members of the management or supervisory body of another entrepreneur?"]
[null,"(c) one entrepreneur is entitled to exercise a dominant influence over another entrepreneur in accordance with the contract concluded with that entrepreneur or its founding documents?\t\t\t\t\t"]
[null,"(d) one entrepreneur who is a shareholder or member of another entrepreneur, in accordance with an agreement with other shareholders, partners or members of that entrepreneur, independently controls the majority of the voting rights of that entrepreneur?"]
[null,"(e) the entrepreneur is in any of the relationships described in points (a) to (d) through one or more other entrepreneurs?"]
[null,"(f) the entrepreneur is in any of the relationships described in points (a) to (d) through a natural person or a group of natural persons acting jointly and carries out its activity or part of its activity in the same relevant market or in adjacent markets?"]
[null,"If at least one affirmative answer is selected in letters a) to f), the Polish tax ID of all entrepreneurs associated with the entity should be provided: \t\t\t\t\t\t\t\t\n\t\t\t\t\t\t\t\t"]
[]
[]
[null,{"$f":"IF(NIP_Status>0,TEXT_CompanyinPL,\"\")","v":""}]
[]
[1,"List of companies present in Poland (indicated in section III. point 1)\t\t\t\t\t\t\t\t\t\n\t\t\t\t"]
[]
["No","Company Name\n\t\t\t\t","NIP/KRS","Headquarters\t\t\t\t\n",null,null,"Locations\n",null,null,"The predominant subject of activity together with PKWiU codes\t\n"]
[1]
[2]
[3]
[4]
[5]
[6]
[7]
[8]
[9]
[10]
[11]
[12]
[13]
[14]
[15]
[16]
[17]
[18]
[19]
[20]
[21]
[22]
[null,{"$f":"IF(B219<>0,Text_10CompaniesinPL,\"\")","v":""}]
[]
[2,"Main customers"]
[3,"Main competitors"]
[4,"Total tax revenues in Poland (for the last 3 years) in PLN of all companies indicated in section III. point 1 \t\t\t\t\t\t\t\t\n\t\t\t\t"]
[]
[null,null,"Tax",null,{"$f":"B_Start_3","v":"2020-09-01"},null,{"$f":"B_Start_2","v":"2021-09-01"},null,{"$f":"B_Start_1","v":"2022-09-01"}]
[null,null,"PIT (advance)"]
[null,null,"CIT"]
[null,null,"VAT"]
[null,null,"Real Estate Tax"]
[null,null,"Other"]
[]
[5,"Total expenditure on research and development in the last 3 years of all companies indicated in section III. point 1 above\t\t\t\t\t\t\t\t\t\n\t\t\t\t"]
[]
[null,null,{"$f":"B_Start_3","v":"2020-09-01"},null,"2021-10-01",null,null,"2022-10-01"]
[]
[]
[]
[]
["IV. Details related to the new project"]
[1,"Details of the beneficiary of public aid"]
[]
[null,"Statement",null,null,null,null,null,null,"Yes","No"]
[null,"(1) Will the aid requested be used for a project for which the entity has received other aid?\t\t\t\t\t\t\n"]
[null,"(2) Will the aid requested be used to cover identifiable costs?\t\t\t\t\t\t\n"]
[null,"(3) If the answer is in the affirmative in point (2), has the entity received other aid to cover the same costs referred to in point (2)?\t\t\t\t\t\t\n"]
[null,"(4) Where rescue aid, restructuring aid or temporary restructuring aid are sought, has such aid been granted in the 10 years preceding the date of submission of the aid application, has the restructuring period supported by the aid been completed or the implementation of the restructuring plan supported by the aid suspended?\t\t\t\t\t\t\n\t\t\t\t\t\t"]
[]
[null,"Other forms of public aid obtained for the same eligible costs\t\t\t\t\n"]
[]
[2,"In case of an application for a grant by the same beneficiary in connection with the implementation of another investment project in the same location, please show the differences between the current and previous projects \t\t\t\t\n\t\t\t\t"]
[]
[3,"Information on investments supported by state aid, started by the same beneficiary (at group level) in the last 3 completed calendar years together with the period from the beginning of the calendar year in which the application form is submitted, from the date of its submission, in the same location (at NUTS level 3)\t\t\t\t\t\t\t\t\t\n\t\t\t\t"]
[null,"Beginning of the 3-year period:",null,null,{"$f":"B_Start_3","v":"2020-09-01"}]
[]
["Company name",null,"Company's address",null,"Date of the Start of the invstment project",null,"Main business activities according to PKD classification",null,"Does the investment conduct \"same or simmilar business activity\" defined as an conducting activities with the same first four digits of NACE classification (NACE Rev. 2)"]
[]
[]
[]
[]
[]
[]
["Legal basis\t\n",null,"Date of granting the aid, aid number",null,"Name of the aid provider",null,"Nominal value of the aid",null,"Form of aid","Purpose of the aid"]
[]
[]
[]
[]
[]
[]
[4,"Detailed description of the project (guidelines: project stages, schedule, type of eligible costs, PKWiU codes within projects, description of products or services)"]
[null,"Type of activities, products & services carried out under the project"]
[null,"Description of the products or services and processes carried out under the project (additionally Polish or European Classification of Activities codes)"]
[5,"Average monthly salary of newly created work places"]
[6,"Accident insurance rate (from 0,67% to 3,60%)"]
[]
[7,"Type of innovation"]
[null,"a) a new or improved product that differs significantly from the products manufactured so far in the Polish and which will be made available by the entrepreneur to potential users as a result of the investment (product innovation),"]
[null,"b) a new or improved process that is significantly different from the processes previously used in production on the Polish premises and which will be applied by the entrepreneur as a result of the investment (process innovation)"]
[8,"Description of Innovation (if applicable)\nAdditional documents must be attached in a separate file."]
[9,"Information on the plot and technical infrastructure for the new project"]
[]
[null,null,"Total plot area in sq. m."]
[null,null,"Total building area in sq. m."]
[null,null,"Value of other structures (roads, car parks, above-ground infrastructure, in PLN"]
[]
[10,"Financial projections and data for the new project"]
[]
[null,null,{"$f":"Project_Start_Date","v":"2023-09-01"},{"$f":"A_Start_1","v":"2024-08-31"},{"$f":"A_Start_2","v":"2025-08-31"},{"$f":"A_Start_3","v":"2026-08-31"},{"$f":"A_Start_4","v":""},{"$f":"A_Start_5","v":""},{"$f":"A_Start_6","v":""},{"$f":"A_Start_7","v":""},"Total"]
[null,"Annual project revenues",null,null,null,null,null,null,null,null,{"$f":"SUM(C302:J302)","v":0}]
[null,"Annual project costs",null,null,null,null,null,null,null,null,{"$f":"SUM(C303:J303)","v":0}]
[null,"Single produced unit price",null,null,null,null,null,null,null,null,{"$f":"SUM(C304:J304)","v":0}]
[11,"Will the project be financed at least 25% from own resources or from external financing without public financial support in accordance with EU state aid rules?"]
[]
["Information required from large and developing enterprises"]
[]
[]
[12,"Summary of incentive effect analysis\n(full text to be attached in a separate annex)  "]
[]
["Information required from large enterprises"]
[]
[13,"Forms of planned cooperation with secondary technical and vocational education institutions and with tertiary education institutions (more than one answer can be selected)"]
["commissioning scientific research or development work;"]
["sponsorship of scientific research;"]
["commissioning the implementation of education programs;"]
["participation in the programme of the minister responsible for higher education and science \"Implementation Doctorate\" and other programmes or undertakings of the minister responsible for higher education and science related to the implementation of doctoral schools;"]
["financing the participation of students and pupils in the practical education process, including, m.in in the form of dual education, through scholarships, organising internships or employment;"]
["participation in research consortia co-financed by the National Centre for Research and Development;"]
["purchase of patents and licenses from entities forming the higher education and science system or their special purpose vehicles;"]
["equipping entities forming the higher education and science system, within the meaning of Article 7(1)(1)-(7) of the Act of 20 July 2018 – Law on Higher Education and Science, with laboratory equipment necessary to conduct research and didactic tasks"]
[]
["Project Statements"]
[1,"On the basis of article 14 paragraph 16 of the Commission Regulation (EU) No 651/2014 of 17 June 2014 declaring certain categories of aid compatible with the internal market in application of Articles 107 and 108 of the Treaty, in connection with amendments introduced by Commission Regulation (EU) 2017/1084 of 14 June 2017 I hereby declare, that the Beneficiary  of state aid granted on the basis of Programme for supporting investments of major importance to the Polish economy for years 2011–2030:\n\n\n•\thas not carried out a relocation to the establishment in which the initial investment for which aid is requested is to take place, in the two years preceding the application for aid and give a commitment that it will not do so up to a period of two years after the initial investment for which aid is requested is completed.\n\n\n“Relocation” according to article 2 point 61 a) of the  Commission Regulation (EU) No 651/2014 means:\n„a transfer of the same or similar activity or part thereof from an establishment in one contracting party to the EEA Agreement (initial establishment) to the establishment in which the aided investment takes place in another contracting party to the EEA Agreement (aided establishment). There is a transfer if the product or service in the initial and in the aided establishments serves at least partly the same purposes and meets the demands or needs of the same type of customers and jobs are lost in the same or similar activity in one of the initial establishments of the beneficiary in the EEA.”\n"]
[2,"I agree to publish on Ministry of Development and Polish Investment and Trade Agency websites the following information, according to article 41 of the Act of 30 April 2004 on proceedings in matters related to state aid:\n1.\tThe name of investor’s company,\n2.\tLocation of planned investment,\n3.\tPlanned employment,\n4.\tPlanned capital expenditures,\n5.\tThe amount of cash grant support."]
[]
["Data to the person authorized to contact in the scope of the application for a targeted grant:"]
[]
[null,null,"Name and surname"]
[null,null,"Position"]
[null,null,"E-mail"]
[null,null,"Phone"]
[null,null,"Preferred language "]
[]
["Signature of the authorized person, in accordance with the document confirming the authorization attached to the form:"]
[]
[null,null,null,null,null,null,"Date"]
[null,null,null,null,null,null,"Signature"]

{"sheet":"Annex 1 - Qualitative crite","index":1,"n_rows":35,"n_cols":3,"rows_kept":35,"cut":false,"hidden":false,"merged":[[0,0,0,2],[1,1,1,2]]}
["Qualitative criteria for investment evaluation"]
[]
[null,"Qualitative criteria for investment evaluation in the case of applying for support for the costs of creating new jobs:"]
[]
[]
["Name of qualitative criterion","How to meet the qualitative criterion","Method of verification of compliance with the qualitative criterion"]
["1.  Type of processes performed","Conduct of activity including advanced or highly advanced processes listed in Appendix 2, where at least a half of newly created jobs are linked to the execution of advanced or highly advanced processes listed in Appendix 2.","The enterprise’s declaration made on the application form and verification that:\n-\tthe enterprise has conducted activity involving the advanced or highly advanced processes specified in the Contract throughout the investment-maintenance period; and\n-\tthe responsibilities of the number of employees specified in the Contract include the execution of advanced or highly advanced processes."]
["2.  Conducting R+D activities","Conduct of R&D activities where:\n(1)\t2% of the costs of the enterprise’s activity at the establishment in a given tax year are the costs of:\n(a)\tresearch-and-development activity within the meaning of, respectively, Article 5a(38) of the Act of 26 July 1991 on Personal Income Tax (Dz.U.2022 items 2647, 2687 and 2745; 2023 items 28, 185, 326, 605, 641, 658, 825 and 1059) or Article 4a(26) of the Act of 15 February 1992 on Corporate Income Tax (Dz.U.2022 items 2587, 2640 and 2745; 2023 items 185, 326, 412, 825 and 1059); or\n(b)\tbuying research-and-development services classified as services in the area of scientific/academic research and development works within the meanings of the provisions governing the Polish Classification of Goods and Services; or\n(2) 2% of the full-time equivalent of all employees at the establishment is linked to the conduct of development works within the meaning of Article 5a(40) of the Act of 26 July 1991 on Personal Income Tax or Article 4a(28) of the Act of 15 February 1992 on Corporate Income Tax.","With regard to item 1: Enterprise’s declaration made on the application form and verification that the enterprise incurred, throughout the investment-maintenance period, costs of research-and-development activities or purchase of research-and-development services, of at least 2% of the costs of activity incurred by the enterprise at the establishment.\nWith regard to item 2: Enterprise’s declaration made on the application form and verification that the enterprise has allocated, throughout the investment-maintenance period, at least 2% of the full-time equivalent of all employees at the establishment to development works."]
["3.   Utilization of the potential of human resources","Employment, in connection with the implementation of the investment, of at least 4% of employees with a disability certificate, disability-degree certificate or equivalent, out of all newly created jobs, though no fewer than one employee.","Enterprise’s declaration made on the application form and verification that throughout the entire investment-maintenance period the number of employees with a disability certificate, disability-degree certificate or equivalent has been maintained at the level specified in the Contract, though no fewer than one employee."]
["4.   Robotization and process automation","Introduction of solutions based on robotic process automation or artificial intelligence.","Enterprise’s declaration made on the application form and verification that during the investment-implementation or investment-maintenance period, in connection with the investment, the enterprise implemented (in particular by purchasing, acquiring a licence for or developing) robotic process automation or artificial-intelligence solutions — computer software simulating the work of a human being, with or without human operation, to perform predefined, structured and repeatable sets of business tasks or process, such RPA and AI not to have previously been used at the establishment."]
["5.   Status of a micro, small or medium-sized entrepreneur","Having the status of a micro-, small or medium enterprise as at the day of filing the application for public aid.","Criterion qualified as at the day of filing the application for public aid."]
["6.   Creating highly-paid and stable workplaces","Creation of high-paid jobs and offering of stable employment, including the creation of jobs linked to the new investment with an average gross salary of at least 110% of the average salary in the national economy according to the current communication of the President of Statistics Poland for an investment located in an area of the country in which the maximum intensity of regional aid is 50% or in an area threatened with exclusion, or at least 130% of the average salary for an investment located elsewhere in the country.","Enterprise’s declaration made on the application form and verification that throughout the investment-maintenance period the gross average annual salary of every employee employed as part of the investment, excluding members of the management board (for capital companies) or partners (for partnerships) constituted at least 110% of the average salary in the national economy according to the current communication of the President of Statistics Poland in each annual period within the investment-maintenance period for an investment located in an area of the country in which the maximum intensity of regional aid is 50% or in an area threatened with exclusion, or at least 130% of the average salary for an investment located elsewhere in the country."]
["7.   Investment in a building with low negative impact on the environment","Locating the investment in a building with low environmental impact, meeting at least 5 out of 8 conditions:\n(1)\tuse of an energy-management system in the building (monitoring and optimization of energy consumption);\n(2)\tuse of renewable energy sources;\n(3)\tuse of energy-storage installations\n(4)\tuse of smart energy-efficient lighting;\n(5)\treducing water consumption in the building, e.g. by use of rainwater or grey water;\n(6)\twaste sorting and composting;\n(7)\tuse of green walls and roofs;\n(8)\tuse of recycled construction products or aggregate","Enterprise’s declaration made on the application form and verification that, throughout the investment-maintenance period, the enterprise conducted the activity being the object of the investment in a low-environmental-impact building. The satisfaction of at least 5 out of the 8 conditions should be confirmed by adequate certificates or other equivalent documents or design and or design documentation and technical/executive (detailed-design) documentation of the systems."]
["8. Supporting the territorially balanced development of the country","Locating the investment:\n(1)\tin an area of the country in which the maximum intensity of regional aid is 50%; or\n(2)\tin an area threatened with exclusion.","Criterion qualified as at the day of filing the application for public aid."]
["9.   Supporting the acquisition of education and professional qualifications and cooperation with sectoral education","Support for the acquisition of education and vocational qualifications, and collaboration with vocational educational institutions, including:\n(1)\tproviding employees with training opportunities to acquire, supplement or refine their vocational or general qualifications needed in order to perform their work; or\n(2)\tco-financing for the costs of education; or\n(3)\tcollaboration with Level 1 Trade Schools, Level 2 Trade Schools, technical upper-secondary schools (technikum), postsecondary schools (szkoły policealne), vocational-education centres, continued-education centres, or institutions of higher learning, consisting in the organization of internships, on-the-job training, educational courses; or\n(4)\toffering out-of-school educational opportunities to acquire, supplement or refine their vocational or general qualifications needed in order to perform the work, including the skills to seek employment, financed by the enterprise; or\n(5) handing over machines and tools for the needs of a school, vocational-education centre, continued-education facility or institution of higher learning; or\n(6) creation of a patronage class or laboratory; or\n(7) dual education; or\n(8) conduct of an implementation doctorate by an employee.","Enterprise’s declaration made on the application form and verification that, in connection with the implementation of the investment, the enterprise has satisfied at least 4 out of the 8 conditions by:\nWith regard to items 1 and 2: incurring, throughout the entire investment-maintenance period, costs of educational/training courses provided by external providers or education in educational establishments or institutions of higher learning, of least PLN 1000 gross per average p.a. per job, for at least 50% of the employees employed at the establishment. For internal educational/training courses — employing, throughout the investment-maintenance period, an employee whose responsibilities include nothing else than the training or education of employees at the establishment.\nWith regard to item 3: entering into and performing a Contract with the body managing a school, vocational-education centre or continued-education facility or institution of higher learning for the delivery of internships, on-the-job training courses or educational/training courses for such enterprise in the investment-maintenance period, as well as admission during every year of the investment-maintenance period of at least one person to an internship, on-the-job-training or educational/training course at the establishment where the investment was implemented.\nWith regard to item 4: entering into and performing a Contract with the body managing a school, vocational-education centre or continued-education facility or institution of higher learning for the provision, in the investment-maintenance period, to students or teachers of vocational training of out-of-school educational classes financed by the enterprise for the purpose of acquiring, supplementing or refining their vocational and general skills and qualifications needed in order to perform the work, as well as having organized at least one such course during every year of the investment-maintenance period.\nWith regard to item 5: entering into and performing a Contract with the body managing a school, vocational-education centre or continued-education facility or institution of higher learning, to provide, during the investment-maintenance period, machines or tools for such a school, centre, facility or institution, as confirmed by a handover certificate.\nWith regard to item 6: entering into and performing a Contract with the body managing a school, vocational-education centre or continued-education facility or institution of higher learning to create a patronage class or laboratory there for the entire investment-maintenance period.\n\n\n\n\n\nWith regard to item 7: entering into and performing a Contract with the body managing a school, vocational-education centre or continued-education facility or institution of higher learning, to admit students during every year of the investment-maintenance period for the purpose of practical learning of a trade, or internship, or to admit dual-studies students for vocational internships or teachers for sector-specific training, at the establishment where the investment is pursued.\nWith regard to item 8: submission by at least one employee of the enterprise in the investment-maintenance period of an individual research plan to an entity managing a doctoral school."]
["10. Taking care of employee welfare","Undertaking activities in the area of provision of care to the employee, in particular by:\n(1) giving employees the opportunity to join additional health-care programmes beyond the statutory required benefits;\n(2) offering additional employee benefits in the scope of various forms of recreation, cultural-and-educational activities, sports-and-recreation activities, insurance; or\n(3) creating or contracting a third party to create and manage a nursery, children’s club or preschool associated with the establishment; or\n(4) paying 50% of the costs of staying at a nursery or children’s club for children up to the age of 3 or provision of care for children up to 3 years of age by a day carer, or staying at a preschool facility, preschool section of a primary school, preschool-education complex or preschool point for children up to 6 years of age, on condition of 20% of the employees of the establishment taking advantage of the benefit throughout the investment-maintenance period.","Entrepreneur's declaration submitted in the application form i verification whether the entrepreneur incurred the costs of services related to care activities during the investment maintenance period employee in the amount of at least PLN 1,000 gross per employee per year, for all employees employed as part of the new investment."]
[]
[]
[]
[]
[]
[null,"Qualitative criteria for investment evaluation in the case of applying for support for investment costs:"]
[]
["Name of qualitative criterion","How to meet the qualitative criterion","Method of verification of compliance with the qualitative criterion"]
["1.   Investment in a strategic sector","Investment in projects supporting sectors consistent with the country’s current development policy, in which the Republic of Poland stands to gain the competitive advantage, including investment in strategic sectors consistent with the Strategy for Responsible Development:\n(1) high-quality food (PKWiU: 10.3, 10.7, 10.8, 11.07, 17.21, 20.15.3, 20.15.4, 20.15.5, 20.15.6, 20.15.7, 20.15.8 and 20.2);\n(2) means of transport (PKWiU: 13.96, 20.16.5, 20.17, 22.11, 22.19.4, 24.42, 25.5, 25.61, 29.1, 29.2, 29.3, 30.2 and 33.17);\n(3) professional electrical and electronic devices (PKWiU: 20.11, 20.13.23, 20.13.5, 20.13.64, 23.43, 24.41, 24.45, 25.3, 26.1, 26.2, 26.3, 26.51, 26.70.23, 26.70.24, 27.11, 27.12, 27.20.2, 27.31, 27.32, 27.4 and 27.9);\n(4) aviation and space (PKWiU: 30.3 and 33.16);\n(5) hygienic products, medicines and medical products (PKWiU: 17.22, 20.42, 20.53, 21.1, 21.2, 26.6, 30.92 and 32.5);\n(6) machines (PKWiU: 25.73.5, 28.11, 28.12, 28.13, 28.21, 28.22.18, 28.25, 28.29.43, 28.3, 28.4, 28.9, 33.12.2 and 33.2);\n(7) material recovery of raw materials and modern materials (PKWiU: 20.16.4 and 38.3);\n(8) eco-buildings (PKWiU: 31.0, 27.5, 16.21, 16.22, 16.23.11, 17.24, 20.3, 20.52, 22.23.14, 23.11, 23.12, 23.31 and 23.42);\n(9) specialized services (PKWiU: 62.03, 63.11.11, 70.22.1, 71.1 and 72,74.1);\n(10) specialized IT and telecommunication services (PKWiU: 58.21, 62.01 excluding 62.01.2; PKWiU 62.02.2)\nor the smart specializations of the voivodeship in which the investment is to be pursued.","Enterprise’s declaration made on the application form and verification that, throughout the investment-maintenance period, the enterprise, at the establishment, provided services or produced goods specified in the Contract.\nIn the case of provision of services or production of goods within classes contained in groups specified in Qualitative Criterion no. 1, the specified criterion is to be deemed satisfied."]
["2.   Utilization of the potential of human resources","Employment, in connection with the implementation of the investment, of at least 4% of employees with a disability certificate, disability-degree certificate or equivalent, out of all newly created jobs, though no fewer than one employee.","Enterprise’s declaration made on the application form and verification that throughout the entire investment-maintenance period the number of employees with a disability certificate, disability-degree certificate or equivalent has been maintained at the level specified in the Contract, though no fewer than one employee."]
["3.   Robotization and process automation","Robotization and automation of processes executed as part of the investment Purchase, as part of the investment, of at least one industrial handling robot (definition conforming to PN-EN ISO 8373:2001) being an automatically controlled, programmable, multi-tasking manipulation machine with multiple degrees of freedom, having manipulation or locomotion properties, whether stationary or mobile, for important industrial applications, or at least one other device (according to KŚT — Polish Classification of Fixed Assets — item 493) constituting a set of reprogrammable manipulators and controls for the execution of motor functions, with the option of unrestricted programming of position changes and changes to the sequence of working operations.","Enterprise’s declaration made on the application form and verification that, throughout the investment-maintenance period, the enterprise maintained the appropriate number of industrial robots or other devices purchased as part of the investment, confirmed for conformity to the required standard by the appropriate certificate issued by the manufacturer of the relevant robot or other device.\n\n\nThe costs entailed by the purchase of the robot or device must be put on the fixed-assets register and remain there for the duration of the investment-maintenance period."]
["4.   Conducting R+D activities","Conduct of R&D activities where:\n(1)\t2% of the costs of the enterprise’s activity at the establishment in a given tax year are the costs of:\n(a) research-and-development activity within the meaning of, respectively, Article 5a(38) of the Act of 26 July 1991 on Personal Income Tax or Article 4a(26) of the Act of 15 February 1992 on Corporate Income Tax; or\n(b)\tbuying research-and-development services classified as services in the area of scientific/academic research and development works within the meanings of the provisions governing the Polish Classification of Goods and Services; or\n(2) 2% of the full-time equivalent of all employees at the establishment is linked to the conduct of development works within the meaning of Article 5a(40) of the Act of 26 July 1991 on Personal Income Tax or Article 4a(28) of the Act of 15 February 1992 on Corporate Income Tax.","With regard to item 1: Enterprise’s declaration made on the application form and verification that the enterprise incurred, throughout the investment-maintenance period, costs of research-and-development activities or purchase of research-and-development services, of at least 2% of the costs of activity incurred by the enterprise at the establishment.\nWith regard to item 2: Enterprise’s declaration made on the application form and verification that the enterprise has allocated, throughout the investment-maintenance period, at least 2% of the full-time equivalent of all employees at the establishment to development works."]
["5. Investment in RES","Investment in renewable sources of energy with the capacity to cover at least 15% of the establishment’s average annual energy consumption.","Enterprise’s declaration made on the application form and verification that, throughout the investment-maintenance period, at least 15% of the enterprise’s average annual energy consumption came from renewable energy sources and at least the same volume of electricity was produced by a RES system installed after the beginning of the investment."]
["6.   Status of a micro, small or medium-sized entrepreneur\nmikro-, małego albo średniego przedsiębiorcy","Having the status of a micro-, small or medium enterprise as at the day of filing the application for public aid.","Criterion qualified as at the day of filing the application for public aid."]
["7.   Creating specialised workplaces","Creating specialized jobs and offering stable employment as part of the investment, by creating at least 80% of new jobs requiring higher education, middle-tier education, vocational middle-tier, basic vocational or basic sectoral education confirmed by a diploma, certificate or other qualifying document for an occupation.Creating specialized jobs and offering stable employment as part of the investment, by creating at least 80% of new jobs requiring higher education, middle-tier education, vocational middle-tier, basic vocational or basic sectoral education confirmed by a diploma, certificate or other qualifying document for an occupation.","Enterprise’s declaration made on the application form and verification that, throughout the investment-maintenance period, at least 80% of the employees employed as part of the investment had higher education, middle-tier education, vocational middle-tier, basic vocational or basic sectoral education confirmed by a diploma, certificate or other qualifying document for an occupation."]
["8.Running a business with a low negative impact on the environment","Conduct of business with a low impact on the environment, as confirmed by an EMAS, ETV or ISO 14001 certificate or a document — substituting for the aforementioned certificates — confirming the status of a GreenEvo winner or Cleaner Production Certificate or entry in the Polish Cleaner Production and Responsible Business Register.Conduct of business with a low impact on the environment, as confirmed by an EMAS, ETV or ISO 14001 certificate or a document — substituting for the aforementioned certificates — confirming the status of a GreenEvo winner or Cleaner Production Certificate or entry in the Polish Cleaner Production and Responsible Business Register.","Enterprise’s declaration made on the application form and verification that the enterprise has maintained throughout the investment-maintenance period an EMAS, ETV or ISO 14001 certificate or a document — substituting for the aforementioned certificates — confirming the status of a GreenEvo winner or Cleaner Production Certificate or entry in the Polish Cleaner Production and Responsible Business Register applicable to the establishment in which the investment is located."]
["9.   Territorially balanced development","Locating the investment in an area at risk of exclusion.","Criterion qualified as at the day of filing the application for public aid."]
["10.   Supporting the acquisition of education and professional qualifications and cooperation with sectoral education","Support for the acquisition of education and vocational qualifications, and collaboration with vocational educational institutions, including:\n(1)\tproviding employees with training opportunities to acquire, supplement or refine their vocational or general qualifications needed in order to perform their work; or\n(2)\tco-financing for the costs of education; or\n(3)\tcollaboration with Level 1 Trade Schools, Level 2 Trade Schools, technical upper-secondary schools (technikum), postsecondary schools (szkoły policealne), vocational-education centres, continued-education centres, or institutions of higher learning, consisting in the organization of internships, on-the-job training, educational courses; or\n(4)\toffering out-of-school educational opportunities to acquire, supplement or refine their vocational or general qualifications needed in order to perform the work, including the skills to seek employment, financed by the enterprise; or\n(5) handing over machines and tools for the needs of a school, vocational-education centre, continued-education facility or institution of higher learning; or\n(6) creation of a patronage class or laboratory; or\n(7) dual education; or\n(8) conduct of an implementation doctorate by an employee","Enterprise’s declaration made on the application form and verification that, in connection with the implementation of the investment, the enterprise has satisfied at least 4 out of the 8 conditions by:\nWith regard to items 1 and 2: incurring, throughout the entire investment-maintenance period, costs of educational/training courses provided by external providers or education in educational establishments or institutions of higher learning, of least PLN 1000 gross per average p.a. per job, for at least 50% of the employees employed at the establishment. For internal educational/training courses — employing, throughout the investment-maintenance period, an employee whose responsibilities include nothing else than the training or education of employees at the establishment.\nWith regard to item 3: entering into and performing a Contract with the body managing a school, vocational-education centre or continued-education facility or institution of higher learning for the delivery of internships or on-the-job training courses for such enterprise in the investment-maintenance period, as well as admission during every year of the investment-maintenance period of at least one person to an internship or on-the-job-training course at the establishment where the investment was implemented.\nWith regard to item 4: entering into and performing a Contract with the body managing a school, vocational-education centre or continued-education facility or institution of higher learning for the provision, in the investment-maintenance period, to students or teachers of vocational training of out-of-school educational classes financed by the enterprise for the purpose of acquiring, supplementing or refining their vocational and general skills and qualifications needed in order to perform the work, as well as having organized at least one such course during every year of the investment-maintenance period.\nWith regard to item 5: entering into and performing a Contract with the body managing a school, vocational-education centre or continued-education facility or institution of higher learning, to provide, during the investment-maintenance period, machines or tools for such a school, centre, facility or institution, as confirmed by a handover certificate.\nWith regard to item 6: entering into and performing a Contract with the body managing a school, vocational-education centre or continued-education facility or institution of higher learning to create a patronage class or laboratory there throughout the investment-maintenance period.\nWith regard to item 7: entering into and performing a Contract with the body managing a school, vocational-education centre or continued-education facility or institution of higher learning, to admit students during every year of the investment-maintenance period for the purpose of practical learning of a trade, or internship, or to admit dual-studies students for vocational internships or teachers for sector-specific training, at the establishment where the investment is pursued.\nWith regard to item 8: submission by at least one employee of the enterprise in the investment-maintenance period of an individual research plan to an entity managing a doctoral school."]
["11. Taking care of employee welfare","Undertaking activities in the area of provision of care to the employee, in particular by:\n(1) giving employees the opportunity to join additional health-care programmes beyond the statutory required benefits;\n(2) offering additional employee benefits in the scope of various forms of recreation, cultural-and-educational activities, sports-and-recreation activities, insurance; or\n(3) creating or contracting a third party to create and manage a nursery, children’s club or preschool associated with the establishment; or\n(4) paying 50% of the costs of staying at a nursery or children’s club for children up to the age of 3 or provision of care for children up to 3 years of age by a day carer, or staying at a preschool facility, preschool section of a primary school, preschool-education complex or preschool point for children up to 6 years of age, on condition of 20% of the employees of the establishment taking advantage of the benefit throughout the investment-maintenance period.","Enterprise’s declaration made on the application form and verification that the enterprise, throughout the investment-maintenance period, paid the costs of benefits concerning employee-care activities, at least of PLN 1000 gross p.a. per employee, for all employees employed as part of the new investment."]

{"sheet":"Annex 2 -Processes","index":2,"n_rows":26,"n_cols":4,"rows_kept":26,"cut":false,"hidden":false,"merged":[[15,1,19,1],[0,2,2,3],[5,1,8,1],[9,1,12,1],[13,1,14,1]]}
[null,null,"Categories of processes supported in Business Service Centers, Research and Development Service Centers"]
[]
[]
[]
[null,"AREA","Process","Number of employees involved in the process"]
[null,"Finance & Accounting","Liabilities Management:\n•\tLiabilities\n•\tPayments\n•\tPayroll processing"]
[null,null,"Receivables Management:\n•\tReceivables\n•\tDebt recovery\n•\tSales invoicing"]
[null,null,"General Ledger Area\n•\tGeneral Ledger\n•\tFixed assets\n•\tIntra-group accounts\n•\tTax statements\n•\tDrafting of the balance sheet, P&L and other financial reports"]
[null,null,"•\tControlling\n•\tLiquidity Management / Treasury\n•\tAnalytics\n•\tManagement accounting"]
[null," IT Services","•\tMaster Data Management\n•\tUser Support:\n•\tSolving simple inquiries and application/workstation changes"]
[null,null,"\tApplication Management:\n•\tSpecialized application support;\n•\tRemote troubleshooting and configuration changes\n•\tApplication maintenance\n•\tLocalization and testing of applications"]
[null,null,"•\tIT Infrastructure Management\n•\tInfrastructure management\n•\tInfrastructural-project management\n•\tApplication and HW integration"]
[null,null,"IT Solution Deployments / IT Consulting:\n•\tSystem and application deployments based on client need\n•\tDeployment of AI/RPA solutions\n•\tSoftware development"]
[null,"HR Services","\t‘Hard’ HR services:\n•\tManagement and control of HR documentation\n•\tPayroll calculation\n•\tManagement of the salary grid and incentive system"]
[null,null,"‘Soft’ HR services:\n•\tTalent management\n•\tTraining opportunities\n•\tManagement of recruitment processes\n•\tMobility"]
[null,"Banking Insurance Financial Services (BIFS)","•\tAsset management — admin support\n•\tNet-asset valuation"]
[null,null,"•\tSpecific Banking / Investment Banking Processes\n•\tRisk management\n•\tAsset handling — middle office\n•\tProperty management\n•\tAsset management\n•\tNetting"]
[null,null,"•\tSpecific Insurance Processes:\n•\tRisk valuation\n•\tActuarial activities\n•\tValuations and market analyses"]
[null,null,"•\tSpecific Processes of the Capital Market\n•\tHedging\n•\tGlobal Markets / foreign-exchange operations\n•\tAlternative-investment services\n•\tDerivatives"]
[null,null,"•\tProduct creation\n•\tAsset-portfolio management"]
[null,"Research & Development Services","•\tProvision of research-and-development services referred under item 72 of the PKWiU or conduct of research or development works within the meaning of the Act of 20 July 2018 on Higher Education and Science."]
[null,"Supply Chain Management","•Plan to Deliver"]
[null,"Procurement","•\tPlanning\n•\tProcurement\n•\tContract management\n•\tVendor-portfolio management"]
[null,"Professional Services","•\tSupport for legal services\n•\tAudit services / Support for audit services\n•\tHealth-care support / Support for medical processes\n•\tMarketing services"]
[null,"Project Management and Business-Transformation Management","•\tManagement of finance and HR projects and other business processes\n•\tLeading business projects with full financial liability and responsibility for the quality\n•\tLeading Business-Transformation Programmes"]
[null,"Knowledge Management","•\tCentres providing complex holistic handling for KPO processes (e.g. knowledge management — making of high-risk decisions, highly specialized IT and finance processes with high ‘know-how’ on the provider’s part), project-portfolio management (PPM, PMO, risk management, change management)"]

{"sheet":"Back","index":3,"n_rows":2527,"n_cols":39,"rows_kept":2527,"cut":false,"hidden":true,"merged":[]}
[]
[null,"Cost_Type",null,null,null,null,"MediumCity_Type",null,null,null,"MediumCity_Reason",null,null,"MediumCity_Additional Inforatiom",null,null,null,"Named Range","Key project dates",null,null,365]
[null,{"$f":"IF(Selected_Investment_Type=3,\"\",\"Costs of new investment\")","v":"Costs of new investment"},1,null,null,null,"TAK",false,null,null,"The investment is located in one of 139 losing cities",null,null,{"$f":"IF(Form!$C$58=Back!K3,\"Miasto\",IF(Form!$C$58=Back!K4,\"Lokalizacja znajduje się w obszarze graniczącym z:\",\"\"))","v":""},null,null,null,"B_Start_3",-3,{"$f":"$T$6+(S3*$V$2)","v":"2020-09-01"}]
[null,{"$f":"IF(Selected_Investment_Type>2,\"Two-years labor costs\",\"\")","v":""},2,null,null,null,"NIE",false,{"$f":"IF(H4,1,0)","v":0},null,"The investment is located in the area bordering the losing city",null,null,null,null,null,null,"B_Start_2",-2,"2021-09-01"]
[null,"Selected Cost_Type",2,null,null,null,null,null,null,null,null,null,null,null,null,null,null,"B_Start_1",-1,{"$f":"$T$6+(S5*$V$2)","v":"2022-09-01"}]
[null,null,null,null,null,null,null,null,null,null,null,null,null,null,null,null,null,"Project_Start_Date","Start Date",{"$f":"IF(Project_Start_Date=0,TODAY(),Project_Start_Date)","v":"2023-09-01"}]
[null,"Qualitative criteria",null,null,null,null,"Questionnaire on affiliations with other entities",null,null,null,null,null,null,null,null,null,null,"A_Start_1",1,{"$f":"IF(Project_Start_Date+(S7*$V$2)<=Project_End_Date,Project_Start_Date+(S7*$V$2),\"\")","v":"2024-08-31"}]
[null,1,false,null,null,null,null,"Yes","No",null,null,null,null,null,null,null,null,"A_Start_2",2,"2025-08-31"]
[null,2,false,null,null,null,"a",false,false,null,null,null,null,null,null,null,null,"A_Start_3",3,"2026-08-31"]
[null,3,false,null,null,null,"b",false,null,null,null,null,null,null,null,null,null,"A_Start_4",4,""]
[null,4,false,null,null,null,"c",false,false,null,null,null,null,null,null,null,null,"A_Start_5",5,""]
[null,5,false,null,null,null,"d",false,false,null,null,null,null,null,null,null,null,"A_Start_6",6,""]
[null,6,false,null,null,null,"e",false,null,null,null,null,null,null,null,null,null,"A_Start_7",7,""]
[null,7,false,null,null,null,"f",false]
[null,8,false,null,null,null,null,{"$f":"COUNTIF(H9:H14,TRUE)","v":0},{"$f":"COUNTIF(I9:I14,TRUE)","v":0}]
[null,9,false]
[null,10,false]
[null,11,false]
[null,null,{"$f":"IF(Cost_Type=1,COUNTIF(C8:C18,TRUE),COUNTIF(C8:C17,TRUE))","v":0}]
[null,null,null,null,null,null,"Kwestionariusz o prowadzeniu działalności w niedozwolonych sektorach",null,null,null,null,null,null,null,null,null,null,"InnovativenessType_List"]
[null,null,null,null,null,null,null,"Tak","Nie",null,null,null,null,null,null,null,null,"a new or improved product that differs significantly from the products manufactured so far in the Polish and which will be made available by the entrepreneur to potential users as a result of the investment (product innovation),"]
[null,"Training Status",null,null,null,null,"a)",false,false,null,null,null,null,null,null,null,null,"a new or improved process that differs significantly from the processes previously used in production on the Polish premises and which will be used by the entrepreneur as a result of the investment (process innovation)"]
[null,"Yes",true,{"$f":"COUNTIF(Status_Training,TRUE)","v":1},null,null,"b)",false,false]
[null,"No",false,null,null,null,"c)",false,false,null,null,null,null,null,null,null,null,null,null,null,null,null,null,null,false,{"$f":"COUNTIF(Y24,\"TRUE\")","v":0}]
[null,null,null,null,null,null,"d)",false,false,null,null,null,null,null,null,null,null,null,null,null,null,null,null,null,false,0]
[null,null,null,null,null,null,"e)",false,false,null,null,null,null,null,null,null,null,null,null,null,null,null,null,"OtherPublicAid",false,{"$f":"COUNTIF(Y26,\"TRUE\")","v":0}]
[null,"Reinvestition",null,null,null,null,"f)",false,false,null,null,null,null,null,null,null,null,null,null,null,null,null,null,null,null,{"$f":"SUM(Z24:Z26)","v":0}]
[null,"Yes",true,{"$f":"COUNTIF(C28,TRUE)","v":1},null,null,"g)",false,false]
[null,"No",false,null,null,null,"h)",false,false,null,null,null,null,null,null,null,1,"Strategic","Costs of a new investment",null,null,{"$f":"_xlfn._xlws.FILTER(S29:S33,Q29:Q33=Selected_Investment_Type)","v":"Costs of a new investment"}]
[null,null,null,null,null,null,"i)",false,false,null,null,null,null,null,null,null,2,"Innovative","Costs of a new investment"]
[null,null,null,null,null,null,"j)",false,false,null,null,null,null,null,null,null,3,"Business Service Center","Two-year labour costs"]
[null,null,null,null,null,null,null,{"$f":"COUNTIF(H22:H31,TRUE)","v":0},{"$f":"COUNTIF(I22:I31,TRUE)","v":0},"Sum",{"$f":"H32+I32","v":0},null,null,null,null,null,4,"Research and Development Service Center","Costs of a new investment"]
[null,"Company_Size_List","Selected_Company_Size",4,null,null,"OtherIncentives_List",null,null,"Status:",3,null,null,null,null,null,4,"Research and Development Service Center","Two-year labour costs"]
[null,"micro-entrepreneur",null,null,null,null,"No",null,null,null,null,null,null,null,null,null,null,null,null,null,null,null,null,{"$f":"_xlfn.ANCHORARRAY(Expanded_InvestmentType_list)","v":"setting-up of a new establishment"}]
[null,"small entrepreneur",null,null,null,null,"Yes, the value of support under the Programme does not exceed PLN 3 million",null,null,null,null,null,null,null,null,null,null,null,null,null,null,null,null,"extending the capacity of an existing establishment"]
[null,"medium-sized entrepreneur",null,null,null,null,"Yes, a Strategic investment with investment costs of at least PLN 300 million",null,null,null,null,null,null,null,null,null,null,null,null,null,null,null,null,"diversification of the output of an establishment into products not previously produced in the establishment"]
[null,"growing entrepreneur",null,null,null,null,"Yes, an Innovative investment with investment costs of at least PLN 100 million",null,null,null,null,null,null,null,null,null,null,null,null,null,null,null,null,"fundamental change in the overall production process of an existing establishment"]
[null,"large entrepreneur",null,null,null,null,"Yes, an Investment in a Business Service Centre, under which the entrepreneur has pledged to create at least 500 new jobs",null,null,null,null,null,null,null,null,null,null,null,null,null,null,null,null,"the acquisition of assets belonging to an establishment that has closed or would have closed had it not been purchased, and is bought by an investor unrelated to the seller"]
[null,null,null,null,null,null,"Yes, Investment in the Research and Development Service Center"]
[]
[]
[]
[null,"Investment_Type","Selected_Investment_Type",2,null,null,"Basic_Investment_Type",null,null,null,null,null,null,null,null,null,null,"Expanded_Investment Type",null,null,null,null,null,"Expanded_InvestmentType_list"]
[null,"Strategic","Warning",{"$f":"IF(Selected_Investment_Type=3,B179,IF(Selected_Investment_Type=4,B179,\"\"))","v":""},null,null,"initial investment",null,null,null,null,null,null,null,null,null,"initial investment","setting-up of a new establishment",null,null,null,null,null,{"$f":"_xlfn._xlws.FILTER(R44:R51,Q44:Q51=K46)","v":"setting-up of a new establishment"},null,null,null,null,{"$f":"X44","v":"setting-up of a new establishment"}]
[null,"Innovative",null,null,null,null,"Initial investment for new business activity",null,null,null,null,null,null,null,null,null,"initial investment","extending the capacity of an existing establishment",null,null,null,null,null,"extending the capacity of an existing establishment",null,null,null,null,{"$f":"X45","v":"extending the capacity of an existing establishment"}]
[null,"Business Service Center",null,null,null,null,"Selected_Basic_Investment_Type",null,null,null,{"$f":"Form!B65","v":"initial investment"},null,null,null,null,null,"initial investment","diversification of the output of an establishment into products not previously produced in the establishment",null,null,null,null,null,"diversification of the output of an establishment into products not previously produced in the establishment",null,null,null,null,{"$f":"IF(X46=0,\"\",X46)","v":"diversification of the output of an establishment into products not previously produced in the establishment"}]
[null,"Research and Development Services Center",null,null,null,null,null,null,null,null,null,null,null,null,null,null,"initial investment","fundamental change in the overall production process of an existing establishment",null,null,null,null,null,"fundamental change in the overall production process of an existing establishment",null,null,null,null,{"$f":"IF(X47=0,\"\",X47)","v":"fundamental change in the overall production process of an existing establishment"}]
[null,null,null,null,null,null,null,null,null,null,null,null,null,null,null,null,"initial investment","the acquisition of assets belonging to an establishment that has closed or would have closed had it not been purchased, and is bought by an investor unrelated to the seller",null,null,null,null,null,"the acquisition of assets belonging to an establishment that has closed or would have closed had it not been purchased, and is bought by an investor unrelated to the seller",null,null,null,null,{"$f":"IF(X48=0,\"\",X48)","v":"the acquisition of assets belonging to an establishment that has closed or would have closed had it not been purchased, and is bought by an investor unrelated to the seller"}]
[null,null,null,null,null,null,null,null,null,null,null,null,null,null,null,null,"Initial investment for new business activity","setting-up of a new establishment\t"]
[null,null,null,null,null,null,null,null,null,null,null,null,null,null,null,null,"Initial investment for new business activity","diversification of the output of an establishment into products not previously produced in the establishment\t"]
[null,null,null,null,null,null,null,null,null,null,null,null,null,null,null,null,"Initial investment for new business activity","the acquisition of assets belonging to an establishment that has closed or would have closed had it not been purchased, and is bought by an investor unrelated to the seller"]
[]
[]
[null,null,null,"Lista województw i regionów NUTS 3",null,null,null,null,null,null,null,"Selected_Nuts3",{"$f":"Form!F54","v":"Włocławski"}]
[null,null,null,"Województwo","NUTS 3",null,null,null,"Voivodeships_list",null,null,"VoivodeshipNuts3_List",null,null,null,null,"Lista Nuts 3 i powiatów",null,null,"Nuts3","Nuts3Poviat_list",null,null,null,null,"Lista Powiatów i Gmin",null,null,null,"PoviatGmina_List"]
[null,null,null,"Małopolskie","Miasto Kraków",null,null,null,"Małopolskie",null,null,{"$f":"_xlfn._xlws.FILTER(Nuts3_List,$D$56:$D$128=Selected_Voivodeship)","v":"Bydgosko-toruński"},null,null,null,null,"Krakowski","bocheński",null,{"$f":"Selected_Nuts3","v":"Włocławski"},{"$f":"_xlfn._xlws.FILTER(poviat_list,Q56:Q435=Selected_Nuts3,\"\")","v":"aleksandrowski"},null,null,null,null,"bocheński","Bochnia",null,null,{"$f":"_xlfn._xlws.FILTER(Commune_List,Z56:Z2527=Selected_Poviat,\"\")","v":"Włocławek"}]
[null,null,null,"Małopolskie","Krakowski",null,null,null,"Śląskie",null,null,"Grudziądzki",null,null,null,null,"Krakowski","krakowski",null,null,"lipnowski",null,null,null,null,"bocheński","Drwinia"]
[null,null,null,"Małopolskie","Tarnowski",null,null,null,"Wielkopolskie",null,null,"Inowrocławski",null,null,null,null,"Krakowski","miechowski",null,null,"radziejowski",null,null,null,null,"bocheński","Lipnica Murowana"]
[null,null,null,"Małopolskie","Nowosądecki",null,null,null,"Zachodniopomorskie",null,null,"Świecki",null,null,null,null,"Krakowski","myślenicki",null,null,"włocławski",null,null,null,null,"bocheński","Łapanów"]
[null,null,null,"Małopolskie","Nowotarski",null,null,null,"Lubuskie",null,null,"Włocławski",null,null,null,null,"Krakowski","proszowicki",null,null,"Włocławek",null,null,null,null,"bocheński","Nowy Wiśnicz"]
[null,null,null,"Małopolskie","Oświęcimski",null,null,null,"Dolnośląskie",null,null,null,null,null,null,null,"Krakowski","wielicki",null,null,null,null,null,null,null,"bocheński","Rzezawa"]
[null,null,null,"Śląskie","Częstochowski",null,null,null,"Opolskie",null,null,null,null,null,null,null,"Miasto Kraków","Kraków",null,null,null,null,null,null,null,"bocheński","Trzciana"]
[null,null,null,"Śląskie","Bielski",null,null,null,"Kujawsko-pomorskie",null,null,null,null,null,null,null,"Nowosądecki","gorlicki",null,null,null,null,null,null,null,"bocheński","Żegocina"]
[null,null,null,"Śląskie","Rybnicki",null,null,null,"Warmińsko-mazurskie",null,null,null,null,null,null,null,"Nowosądecki","limanowski",null,null,null,null,null,null,null,"krakowski","Czernichów"]
[null,null,null,"Śląskie","Bytomski",null,null,null,"Pomorskie",null,null,null,null,null,null,null,"Nowosądecki","nowosądecki",null,null,null,null,null,null,null,"krakowski","Igołomia-Wawrzeńczyce"]
[null,null,null,"Śląskie","Gliwicki",null,null,null,"Łódzkie",null,null,null,null,null,null,null,"Nowosądecki","Nowy Sącz",null,null,null,null,null,null,null,"krakowski","Iwanowice"]
[null,null,null,"Śląskie","Katowicki",null,null,null,"Świętokrzyskie",null,null,null,null,null,null,null,"Oświęcimski","chrzanowski",null,null,null,null,null,null,null,"krakowski","Jerzmanowice-Przeginia"]
[null,null,null,"Śląskie","Sosnowiecki",null,null,null,"Lubelskie",null,null,null,null,null,null,null,"Oświęcimski","olkuski",null,null,null,null,null,null,null,"krakowski","Kocmyrzów-Luborzyca"]
[null,null,null,"Śląskie","Tyski",null,null,null,"Podkarpackie",null,null,null,null,null,null,null,"Oświęcimski","oświęcimski",null,null,null,null,null,null,null,"krakowski","Krzeszowice"]
[null,null,null,"Wielkopolskie","Pilski",null,null,null,"Podlaskie",null,null,null,null,null,null,null,"Oświęcimski","wadowicki",null,null,null,null,null,null,null,"krakowski","Liszki"]
[null,null,null,"Wielkopolskie","Koniński",null,null,null,"Mazowieckie",null,null,null,null,null,null,null,"Tarnowski","brzeski",null,null,null,null,null,null,null,"krakowski","Michałowice"]
[null,null,null,"Wielkopolskie","Miasto Poznań",null,null,null,null,null,null,null,null,null,null,null,"Tarnowski","dąbrowski",null,null,null,null,null,null,null,"krakowski","Mogilany"]
[null,null,null,"Wielkopolskie","Kaliski",null,null,null,null,null,null,null,null,null,null,null,"Tarnowski","tarnowski",null,null,null,null,null,null,null,"krakowski","Skała"]
[null,null,null,"Wielkopolskie","Leszczyński",null,null,null,null,null,null,null,null,null,null,null,"Tarnowski","Tarnów",null,null,null,null,null,null,null,"krakowski","Skawina"]
[null,null,null,"Wielkopolskie","Poznański",null,null,null,null,null,null,null,null,null,null,null,"Nowotarski","nowotarski",null,null,null,null,null,null,null,"krakowski","Słomniki"]
[null,null,null,"Zachodniopomorskie","Miasto Szczecin",null,null,null,null,null,null,null,null,null,null,null,"Nowotarski","suski",null,null,null,null,null,null,null,"krakowski","Sułoszowa"]
[null,null,null,"Zachodniopomorskie","Koszaliński",null,null,null,null,null,null,null,null,null,null,null,"Nowotarski","tatrzański",null,null,null,null,null,null,null,"krakowski","Świątniki Górne"]
[null,null,null,"Zachodniopomorskie","Szczecinecko-pyrzycki",null,null,null,null,null,null,null,null,null,null,null,"Bielski","bielski",null,null,null,null,null,null,null,"krakowski","Wielka Wieś"]
[null,null,null,"Zachodniopomorskie","Szczeciński",null,null,null,null,null,null,null,null,null,null,null,"Bielski","cieszyński",null,null,null,null,null,null,null,"krakowski","Zabierzów"]
[null,null,null,"Lubuskie","Gorzowski",null,null,null,null,null,null,null,null,null,null,null,"Bielski","żywiecki",null,null,null,null,null,null,null,"krakowski","Zielonki"]
[null,null,null,"Lubuskie","Zielonogórski",null,null,null,null,null,null,null,null,null,null,null,"Bielski","Bielsko-Biała",null,null,null,null,null,null,null,"miechowski","Charsznica"]
[null,null,null,"Dolnośląskie","Miasto Wrocław",null,null,null,null,null,null,null,null,null,null,null,"Bytomski","lubliniecki",null,null,null,null,null,null,null,"miechowski","Gołcza"]
[null,null,null,"Dolnośląskie","Jeleniogórski",null,null,null,null,null,null,null,null,null,null,null,"Bytomski","tarnogórski",null,"Selected_Poviat",{"$f":"Form!I54","v":"Włocławek"},null,null,null,null,"miechowski","Kozłów"]
[null,null,null,"Dolnośląskie","Legnicko-głogowski",null,null,null,null,null,null,null,null,null,null,null,"Bytomski","Bytom",null,null,null,null,null,null,null,"miechowski","Książ Wielki"]
[null,null,null,"Dolnośląskie","Wałbrzyski",null,null,null,null,null,null,null,null,null,null,null,"Bytomski","Piekary Śląskie",null,null,null,null,null,null,null,"miechowski","Miechów"]
[null,null,null,"Dolnośląskie","Wrocławski",null,null,null,null,null,null,null,null,null,null,null,"Częstochowski","częstochowski",null,null,null,null,null,null,null,"miechowski","Racławice"]
[null,null,null,"Opolskie","Nyski",null,null,null,null,null,null,null,null,null,null,null,"Częstochowski","kłobucki",null,null,null,null,null,null,null,"miechowski","Słaboszów"]
[null,null,null,"Opolskie","Opolski",null,null,null,null,null,null,null,null,null,null,null,"Częstochowski","myszkowski",null,null,null,null,null,null,null,"myślenicki","Dobczyce"]
[null,null,null,"Kujawsko-pomorskie","Bydgosko-toruński",null,null,null,null,null,null,null,null,null,null,null,"Częstochowski","Częstochowa",null,null,null,null,null,null,null,"myślenicki","Lubień"]
[null,null,null,"Kujawsko-pomorskie","Grudziądzki",null,null,null,null,null,null,null,null,null,null,null,"Gliwicki","gliwicki",null,null,null,null,null,null,null,"myślenicki","Myślenice"]
[null,null,null,"Kujawsko-pomorskie","Inowrocławski",null,null,null,null,null,null,null,null,null,null,null,"Gliwicki","Gliwice",null,null,null,null,null,null,null,"myślenicki","Pcim"]
[null,null,null,"Kujawsko-pomorskie","Świecki",null,null,null,null,null,null,null,null,null,null,null,"Gliwicki","Zabrze",null,null,null,null,null,null,null,"myślenicki","Raciechowice"]
[null,null,null,"Kujawsko-pomorskie","Włocławski",null,null,null,null,null,null,null,null,null,null,null,"Katowicki","Chorzów",null,null,null,null,null,null,null,"myślenicki","Siepraw"]
[null,null,null,"Warmińsko-mazurskie","Elbląski",null,null,null,null,null,null,null,null,null,null,null,"Katowicki","Katowice",null,null,null,null,null,null,null,"myślenicki","Sułkowice"]
[null,null,null,"Warmińsko-mazurskie","Olsztyński",null,null,null,null,null,null,null,null,null,null,null,"Katowicki","Mysłowice",null,null,null,null,null,null,null,"myślenicki","Tokarnia"]
[null,null,null,"Warmińsko-mazurskie","Ełcki",null,null,null,null,null,null,null,null,null,null,null,"Katowicki","Ruda Śląska",null,null,null,null,null,null,null,"myślenicki","Wiśniowa"]
[null,null,null,"Pomorskie","Trójmiejski",null,null,null,null,null,null,null,null,null,null,null,"Katowicki","Siemianowice Śląskie",null,null,null,null,null,null,null,"proszowicki","Koniusza"]
[null,null,null,"Pomorskie","Gdański",null,null,null,null,null,null,null,null,null,null,null,"Katowicki","Świętochłowice",null,null,null,null,null,null,null,"proszowicki","Koszyce"]
[null,null,null,"Pomorskie","Słupski",null,null,null,null,null,null,null,null,null,null,null,"Rybnicki","raciborski",null,null,null,null,null,null,null,"proszowicki","Nowe Brzesko"]
[null,null,null,"Pomorskie","Chojnicki",null,null,null,null,null,null,null,null,null,null,null,"Rybnicki","rybnicki",null,null,null,null,null,null,null,"proszowicki","Pałecznica"]
[null,null,null,"Pomorskie","Starogardzki",null,null,null,null,null,null,null,null,null,null,null,"Rybnicki","wodzisławski",null,null,null,null,null,null,null,"proszowicki","Proszowice",null,null,null,null,"AGD",null,"Farmaceutyczna",null,null,"Meblarska",null,"Spożywcza"]
[null,null,null,"Łódzkie","Miasto Łódź",null,null,null,null,null,null,null,null,null,null,null,"Rybnicki","Jastrzębie-Zdrój",null,null,null,null,null,null,null,"proszowicki","Radziemice",null,null,null,null,"Biotechnologiczna",null,"Gospodarka odpadami",null,null,"Medyczna",null,"Szklarska"]
[null,null,null,"Łódzkie","Łódzki",null,null,null,null,null,null,null,null,null,null,null,"Rybnicki","Rybnik",null,null,null,null,null,null,null,"wielicki","Biskupice",null,null,null,null,"BSS",null,"Komponenty dla OZE",null,null,"Metalowa",null,"Tekstylna"]
[null,null,null,"Łódzkie","Piotrkowski",null,null,null,null,null,null,null,null,null,null,null,"Rybnicki","Żory",null,null,null,null,null,null,null,"wielicki","Gdów",null,null,null,null,"Chemiczna",null,"Kosmetyczna",null,null,"Motoryzacyjna",null,"Turystyczno-rozrywkowa"]
[null,null,null,"Łódzkie","Sieradzki",null,null,null,null,null,null,null,null,null,null,null,"Sosnowiecki","będziński",null,null,null,null,null,null,null,"wielicki","Kłaj",null,null,null,null,"Drzewna",null,"Logistyczna",null,null,"Nieruchomości",null,"Tworzyw sztucznych"]
[null,null,null,"Łódzkie","Skierniewicki",null,null,null,null,null,null,null,null,null,null,null,"Sosnowiecki","zawierciański",null,null,null,null,null,null,null,"wielicki","Niepołomice",null,null,null,null,"Elektromobilność",null,"Lotnicza",null,null,"Okołostoczniowy",null,"Tytoniowa"]
[null,null,null,"Świętokrzyskie","Kielecki",null,null,null,null,null,null,null,null,null,null,null,"Sosnowiecki","Dąbrowa Górnicza",null,null,null,null,null,null,null,"wielicki","Wieliczka",null,null,null,null,"Elektroniczna",null,"Maszynowa",null,null,"Środków transportu",null,"Wydobywcza"]
[null,null,null,"Świętokrzyskie","Sandomiersko-jędrzejowski",null,null,null,null,null,null,null,null,null,null,null,"Sosnowiecki","Jaworzno",null,null,null,null,null,null,null,"Kraków","Kraków",null,null,null,null,"Energetyczna",null,"Materiały budowlane",null,null,"R&D",null,"Inna (wskazać):"]
[null,null,null,"Lubelskie","Bialski",null,null,null,null,null,null,null,null,null,null,null,"Sosnowiecki","Sosnowiec",null,null,null,null,null,null,null,"Kraków","Kraków-Krowodrza"]
[null,null,null,"Lubelskie","Chełmsko-zamojski",null,null,null,null,null,null,null,null,null,null,null,"Tyski","mikołowski",null,null,null,null,null,null,null,"Kraków","Kraków-Nowa Huta"]
[null,null,null,"Lubelskie","Lubelski",null,null,null,null,null,null,null,null,null,null,null,"Tyski","pszczyński",null,null,null,null,null,null,null,"Kraków","Kraków-Podgórze"]
[null,null,null,"Lubelskie","Puławski",null,null,null,null,null,null,null,null,null,null,null,"Tyski","bieruńsko-lędziński",null,null,null,null,null,null,null,"Kraków","Kraków-Śródmieście"]
[null,null,null,"Podkarpackie","Krośnieński",null,null,null,null,null,null,null,null,null,null,null,"Tyski","Tychy",null,null,null,null,null,null,null,"gorlicki","Gorlice"]
[null,null,null,"Podkarpackie","Przemyski",null,null,null,null,null,null,null,null,null,null,null,"Gorzowski","gorzowski",null,null,null,null,null,null,null,"gorlicki","Biecz"]
[null,null,null,"Podkarpackie","Rzeszowski",null,null,null,null,null,null,null,null,null,null,null,"Gorzowski","międzyrzecki",null,null,null,null,null,null,null,"gorlicki","Bobowa"]
[null,null,null,"Podkarpackie","Tarnobrzeski",null,null,null,null,null,null,null,null,null,null,null,"Gorzowski","słubicki",null,null,null,null,null,null,null,"gorlicki","Gorlice"]
[null,null,null,"Podlaskie","Białostocki",null,null,null,null,null,null,null,null,null,null,null,"Gorzowski","strzelecko-drezdenecki",null,null,null,null,null,null,null,"gorlicki","Lipinki"]
[null,null,null,"Podlaskie","Łomżyński",null,null,null,null,null,null,null,null,null,null,null,"Gorzowski","sulęciński",null,null,null,null,null,null,null,"gorlicki","Łużna"]
[null,null,null,"Podlaskie","Suwalski",null,null,null,null,null,null,null,null,null,null,null,"Gorzowski","Gorzów Wielkopolski",null,null,null,null,null,null,null,"gorlicki","Moszczenica"]
[null,null,null,"Mazowieckie","Miasto Warszawa",null,null,null,null,null,null,null,null,null,null,null,"Zielonogórski","krośnieński",null,null,null,null,null,null,null,"gorlicki","Ropa"]
[null,null,null,"Mazowieckie","Warszawski wschodni",null,null,null,null,null,null,null,null,null,null,null,"Zielonogórski","nowosolski",null,null,null,null,null,null,null,"gorlicki","Sękowa"]
[null,null,null,"Mazowieckie","Warszawski zachodni",null,null,null,null,null,null,null,null,null,null,null,"Zielonogórski","świebodziński",null,null,null,null,null,null,null,"gorlicki","Uście Gorlickie"]
[null,null,null,"Mazowieckie","Radomski",null,null,null,null,null,null,null,null,null,null,null,"Zielonogórski","zielonogórski",null,null,null,null,null,null,null,"limanowski","Limanowa"]
[null,null,null,"Mazowieckie","Ciechanowski",null,null,null,null,null,null,null,null,null,null,null,"Zielonogórski","żagański",null,null,null,null,null,null,null,"limanowski","Mszana Dolna"]
[null,null,null,"Mazowieckie","Płocki",null,null,null,null,null,null,null,null,null,null,null,"Zielonogórski","żarski",null,null,null,null,null,null,null,"limanowski","Dobra"]
[null,null,null,"Mazowieckie","Ostrołęcki",null,null,null,null,null,null,null,null,null,null,null,"Zielonogórski","wschowski",null,null,null,null,null,null,null,"limanowski","Jodłownik"]
[null,null,null,"Mazowieckie","Siedlecki",null,null,null,null,null,null,null,null,null,null,null,"Zielonogórski","Zielona Góra",null,null,null,null,null,null,null,"limanowski","Kamienica"]
[null,null,null,"Mazowieckie","Żyrardowski",null,null,null,null,null,null,null,null,null,null,null,"Kaliski","jarociński",null,null,null,null,null,null,null,"limanowski","Laskowa"]
[null,null,null,"Selected_Voivodeship",{"$f":"Form!C54","v":"Kujawsko-pomorskie"},null,null,null,null,null,null,null,null,null,null,null,"Kaliski","kaliski",null,null,null,null,null,null,null,"limanowski","Łukowica"]
[null,null,null,null,null,null,null,null,null,null,null,null,null,null,null,null,"Kaliski","kępiński",null,null,null,null,null,null,null,"limanowski","Mszana Dolna"]
[null,null,null,null,null,null,null,null,null,null,null,null,null,null,null,null,"Kaliski","krotoszyński",null,null,null,null,null,null,null,"limanowski","Niedźwiedź"]
[null,null,null,null,null,null,null,null,null,null,null,null,null,null,null,null,"Kaliski","ostrowski",null,null,null,null,null,null,null,"limanowski","Słopnice"]
[null,null,null,null,null,null,null,null,null,null,null,null,null,null,null,null,"Kaliski","ostrzeszowski",null,null,null,null,null,null,null,"limanowski","Tymbark"]
[null,null,null,null,null,null,null,null,null,null,null,null,null,null,null,null,"Kaliski","pleszewski",null,null,null,null,null,null,null,"nowosądecki","Grybów"]
[null,null,null,null,null,null,null,null,null,null,null,null,null,null,null,null,"Kaliski","Kalisz",null,null,null,null,null,null,null,"nowosądecki","Chełmiec"]
[null,null,null,null,null,null,null,null,null,null,null,null,null,null,null,null,"Koniński","gnieźnieński",null,null,null,null,null,null,null,"nowosądecki","Gródek nad Dunajcem"]
[null,null,null,null,null,null,null,null,null,null,null,null,null,null,null,null,"Koniński","kolski",null,null,null,null,null,null,null,"nowosądecki","Grybów"]
[null,null,null,null,null,null,null,null,null,null,null,null,null,null,null,null,"Koniński","koniński",null,null,null,null,null,null,null,"nowosądecki","Kamionka Wielka"]
[null,null,null,null,null,null,null,null,null,null,null,null,null,null,null,null,"Koniński","słupecki",null,null,null,null,null,null,null,"nowosądecki","Korzenna"]
[null,null,null,null,null,null,null,null,null,null,null,null,null,null,null,null,"Koniński","turecki",null,null,null,null,null,null,null,"nowosądecki","Krynica-Zdrój"]
[null,null,null,null,null,null,null,null,null,null,null,null,null,null,null,null,"Koniński","wrzesiński",null,null,null,null,null,null,null,"nowosądecki","Łabowa"]
[null,null,null,null,null,null,null,null,null,null,null,null,null,null,null,null,"Koniński","Konin",null,null,null,null,null,null,null,"nowosądecki","Łącko"]
[null,null,null,null,null,null,null,null,null,null,null,null,null,null,null,null,"Leszczyński","gostyński",null,null,null,null,null,null,null,"nowosądecki","Łososina Dolna"]
[null,null,null,null,null,null,null,null,null,null,null,null,null,null,null,null,"Leszczyński","grodziski",null,null,null,null,null,null,null,"nowosądecki","Muszyna"]
[null,null,null,null,null,null,null,null,null,null,null,null,null,null,null,null,"Leszczyński","kościański",null,null,null,null,null,null,null,"nowosądecki","Nawojowa"]
[null,null,null,null,null,null,null,null,null,null,null,null,null,null,null,null,"Leszczyński","leszczyński",null,null,null,null,null,null,null,"nowosądecki","Piwniczna-Zdrój"]
[null,null,null,null,null,null,null,null,null,null,null,null,null,null,null,null,"Leszczyński","międzychodzki",null,null,null,null,null,null,null,"nowosądecki","Podegrodzie"]
[null,null,null,null,null,null,null,null,null,null,null,null,null,null,null,null,"Leszczyński","nowotomyski",null,null,null,null,null,null,null,"nowosądecki","Rytro"]
[null,null,null,null,null,null,null,null,null,null,null,null,null,null,null,null,"Leszczyński","rawicki",null,null,null,null,null,null,null,"nowosądecki","Stary Sącz"]
[null,null,null,null,null,null,null,null,null,null,null,null,null,null,null,null,"Leszczyński","wolsztyński",null,null,null,null,null,null,null,"Nowy Sącz","Nowy Sącz"]
[null,null,null,null,null,null,null,null,null,null,null,null,null,null,null,null,"Leszczyński","Leszno",null,null,null,null,null,null,null,"chrzanowski","Alwernia"]
[null,null,null,null,null,null,null,null,null,null,null,null,null,null,null,null,"Pilski","chodzieski",null,null,null,null,null,null,null,"chrzanowski","Babice"]
[null,null,null,null,null,null,null,null,null,null,null,null,null,null,null,null,"Pilski","czarnkowsko-trzcianecki",null,null,null,null,null,null,null,"chrzanowski","Chrzanów"]
[null,null,null,null,null,null,null,null,null,null,null,null,null,null,null,null,"Pilski","pilski",null,null,null,null,null,null,null,"chrzanowski","Libiąż"]
[null,null,null,null,null,null,null,null,null,null,null,null,null,null,null,null,"Pilski","wągrowiecki",null,null,null,null,null,null,null,"chrzanowski","Trzebinia"]
[null,null,null,null,null,null,null,null,null,null,null,null,null,null,null,null,"Pilski","złotowski",null,null,null,null,null,null,null,"olkuski","Bukowno"]
[null,null,null,null,null,null,null,null,null,null,null,null,null,null,null,null,"Poznański","obornicki",null,null,null,null,null,null,null,"olkuski","Bolesław"]
[null,null,null,null,null,null,null,null,null,null,null,null,null,null,null,null,"Poznański","poznański",null,null,null,null,null,null,null,"olkuski","Klucze"]
[null,null,null,null,null,null,null,null,null,null,null,null,null,null,null,null,"Poznański","szamotulski",null,null,null,null,null,null,null,"olkuski","Olkusz"]
[null,null,null,null,null,null,null,null,null,null,null,null,null,null,null,null,"Poznański","średzki",null,null,null,null,null,null,null,"olkuski","Trzyciąż"]
[null,null,null,null,null,null,null,null,null,null,null,null,null,null,null,null,"Poznański","śremski",null,null,null,null,null,null,null,"olkuski","Wolbrom"]
[null,null,null,null,null,null,null,null,null,null,null,null,null,null,null,null,"Miasto Poznań","Poznań",null,null,null,null,null,null,null,"oświęcimski","Oświęcim"]
[null,null,null,null,null,null,null,null,null,null,null,null,null,null,null,null,"Koszaliński","białogardzki",null,null,null,null,null,null,null,"oświęcimski","Brzeszcze"]
[null,null,null,null,null,null,null,null,null,null,null,null,null,null,null,null,"Koszaliński","kołobrzeski",null,null,null,null,null,null,null,"oświęcimski","Chełmek"]
[null,null,null,null,null,null,null,null,null,null,null,null,null,null,null,null,"Koszaliński","koszaliński",null,null,null,null,null,null,null,"oświęcimski","Kęty"]
[null,null,null,null,null,null,null,null,null,null,null,null,null,null,null,null,"Koszaliński","sławieński",null,null,null,null,null,null,null,"oświęcimski","Osiek"]
[null,null,null,null,null,null,null,null,null,null,null,null,null,null,null,null,"Koszaliński","Koszalin",null,null,null,null,null,null,null,"oświęcimski","Oświęcim"]
[null,null,null,null,null,null,null,null,null,null,null,null,null,null,null,null,"Szczecinecko-pyrzycki","choszczeński",null,null,null,null,null,null,null,"oświęcimski","Polanka Wielka"]
[null,null,null,null,null,null,null,null,null,null,null,null,null,null,null,null,"Szczecinecko-pyrzycki","drawski",null,null,null,null,null,null,null,"oświęcimski","Przeciszów"]
[null,null,null,null,null,null,null,null,null,null,null,null,null,null,null,null,"Szczecinecko-pyrzycki","myśliborski",null,null,null,null,null,null,null,"oświęcimski","Zator"]
[null,null,null,null,null,null,null,null,null,null,null,null,null,null,null,null,"Szczecinecko-pyrzycki","pyrzycki",null,null,null,null,null,null,null,"wadowicki","Andrychów"]
[null,null,null,null,null,null,null,null,null,null,null,null,null,null,null,null,"Szczecinecko-pyrzycki","szczecinecki",null,null,null,null,null,null,null,"wadowicki","Brzeźnica"]
[null,null,null,null,null,null,null,null,null,null,null,null,null,null,null,null,"Szczecinecko-pyrzycki","świdwiński",null,null,null,null,null,null,null,"wadowicki","Kalwaria Zebrzydowska"]
[null,"Text prompts",null,null,null,null,null,null,null,null,null,null,null,null,null,null,"Szczecinecko-pyrzycki","wałecki",null,null,null,null,null,null,null,"wadowicki","Lanckorona"]
[null,"In the part of the form intended for the company's presence in Poland, the tax ID of all entrepreneurs associated with the entity should be provided",null,null,null,null,null,null,null,null,null,null,null,null,null,null,"Szczecinecko-pyrzycki","łobeski",null,null,null,null,null,null,null,"wadowicki","Mucharz"]
[null,"In the case of more than 10 companies present in Poland, the hidden part of the file should be discovered and additional data should be completed",null,null,null,null,null,null,null,null,null,null,null,null,null,null,"Miasto Szczecin","Szczecin",null,null,null,null,null,null,null,"wadowicki","Spytkowice"]
[null,"Please tick the declarations for each of the following sectors:",null,null,null,null,null,null,null,null,null,null,null,null,null,null,"Szczeciński","goleniowski",null,null,null,null,null,null,null,"wadowicki","Stryszów"]
[null,"In the case of one of the indicated sectors, there are restrictions on the availability of state aid. Necessary additional consultations with the PAIH team",null,null,null,null,null,null,null,null,null,null,null,null,null,null,"Szczeciński","gryficki",null,null,null,null,null,null,null,"wadowicki","Tomice"]
[null,"In connection with the selected type of investment, the processes that will be carried out in the enterprise should be indicated in Annex 2",null,null,null,null,null,null,null,null,null,null,null,null,null,null,"Szczeciński","gryfiński",null,null,null,null,null,null,null,"wadowicki","Wadowice"]
[null,null,null,null,null,null,null,null,null,null,null,null,null,null,null,null,"Szczeciński","kamieński",null,null,null,null,null,null,null,"wadowicki","Wieprz"]
[null,null,null,null,null,null,null,null,null,null,null,null,null,null,null,null,"Szczeciński","policki",null,null,null,null,null,null,null,"brzeski","Borzęcin"]
[null,null,null,null,null,null,null,null,null,null,null,null,null,null,null,null,"Szczeciński","stargardzki",null,null,null,null,null,null,null,"brzeski","Brzesko"]
[null,null,null,null,null,null,null,null,null,null,null,null,null,null,null,null,"Szczeciński","Świnoujście",null,null,null,null,null,null,null,"brzeski","Czchów"]
[null,null,null,null,null,null,null,null,null,null,null,null,null,null,null,null,"Jeleniogórski","bolesławiecki",null,null,null,null,null,null,null,"brzeski","Dębno"]
[null,null,null,null,null,null,null,null,null,null,null,null,null,null,null,null,"Jeleniogórski","jaworski",null,null,null,null,null,null,null,"brzeski","Gnojnik"]
[null,null,null,null,null,null,null,null,null,null,null,null,null,null,null,null,"Jeleniogórski","karkonoski",null,null,null,null,null,null,null,"brzeski","Iwkowa"]
[null,null,null,null,null,null,null,null,null,null,null,null,null,null,null,null,"Jeleniogórski","kamiennogórski",null,null,null,null,null,null,null,"brzeski","Szczurowa"]
[null,null,null,null,null,null,null,null,null,null,null,null,null,null,null,null,"Jeleniogórski","lubański",null,null,null,null,null,null,null,"dąbrowski","Bolesław"]
[null,null,null,null,null,null,null,null,null,null,null,null,null,null,null,null,"Jeleniogórski","lwówecki",null,null,null,null,null,null,null,"dąbrowski","Dąbrowa Tarnowska"]
[null,null,null,null,null,null,null,null,null,null,null,null,null,null,null,null,"Jeleniogórski","zgorzelecki",null,null,null,null,null,null,null,"dąbrowski","Gręboszów"]
[null,null,null,null,null,null,null,null,null,null,null,null,null,null,null,null,"Jeleniogórski","złotoryjski",null,null,null,null,null,null,null,"dąbrowski","Mędrzechów"]
[null,null,null,null,null,null,null,null,null,null,null,null,null,null,null,null,"Jeleniogórski","Jelenia Góra",null,null,null,null,null,null,null,"dąbrowski","Olesno"]
[null,null,null,null,null,null,null,null,null,null,null,null,null,null,null,null,"Legnicko-głogowski","głogowski",null,null,null,null,null,null,null,"dąbrowski","Radgoszcz"]
[null,null,null,null,null,null,null,null,null,null,null,null,null,null,null,null,"Legnicko-głogowski","górowski",null,null,null,null,null,null,null,"dąbrowski","Szczucin"]
[null,null,null,null,null,null,null,null,null,null,null,null,null,null,null,null,"Legnicko-głogowski","legnicki",null,null,null,null,null,null,null,"tarnowski","Ciężkowice"]
[null,null,null,null,null,null,null,null,null,null,null,null,null,null,null,null,"Legnicko-głogowski","lubiński",null,null,null,null,null,null,null,"tarnowski","Gromnik"]
[null,null,null,null,null,null,null,null,null,null,null,null,null,null,null,null,"Legnicko-głogowski","polkowicki",null,null,null,null,null,null,null,"tarnowski","Lisia Góra"]
[null,null,null,null,null,null,null,null,null,null,null,null,null,null,null,null,"Legnicko-głogowski","Legnica",null,null,null,null,null,null,null,"tarnowski","Pleśna"]
[null,null,null,null,null,null,null,null,null,null,null,null,null,null,null,null,"Wałbrzyski","dzierżoniowski",null,null,null,null,null,null,null,"tarnowski","Radłów"]
[null,null,null,null,null,null,null,null,null,null,null,null,null,null,null,null,"Wałbrzyski","kłodzki",null,null,null,null,null,null,null,"tarnowski","Ryglice"]
[null,null,null,null,null,null,null,null,null,null,null,null,null,null,null,null,"Wałbrzyski","świdnicki",null,null,null,null,null,null,null,"tarnowski","Rzepiennik Strzyżewski"]
[null,null,null,null,null,null,null,null,null,null,null,null,null,null,null,null,"Wałbrzyski","wałbrzyski",null,null,null,null,null,null,null,"tarnowski","Skrzyszów"]
[null,null,null,null,null,null,null,null,null,null,null,null,null,null,null,null,"Wałbrzyski","ząbkowicki",null,null,null,null,null,null,null,"tarnowski","Tarnów"]
[null,null,null,null,null,null,null,null,null,null,null,null,null,null,null,null,"Wałbrzyski","Wałbrzych",null,null,null,null,null,null,null,"tarnowski","Tuchów"]
[null,null,null,null,null,null,null,null,null,null,null,null,null,null,null,null,"Wrocławski","milicki",null,null,null,null,null,null,null,"tarnowski","Wierzchosławice"]
[null,null,null,null,null,null,null,null,null,null,null,null,null,null,null,null,"Wrocławski","oleśnicki",null,null,null,null,null,null,null,"tarnowski","Wietrzychowice"]
[null,null,null,null,null,null,null,null,null,null,null,null,null,null,null,null,"Wrocławski","oławski",null,null,null,null,null,null,null,"tarnowski","Wojnicz"]
[null,null,null,null,null,null,null,null,null,null,null,null,null,null,null,null,"Wrocławski","strzeliński",null,null,null,null,null,null,null,"tarnowski","Zakliczyn"]
[null,null,null,null,null,null,null,null,null,null,null,null,null,null,null,null,"Wrocławski","średzki",null,null,null,null,null,null,null,"tarnowski","Żabno"]
[null,null,null,null,null,null,null,null,null,null,null,null,null,null,null,null,"Wrocławski","trzebnicki",null,null,null,null,null,null,null,"tarnowski","Szerzyny"]
[null,null,null,null,null,null,null,null,null,null,null,null,null,null,null,null,"Wrocławski","wołowski",null,null,null,null,null,null,null,"Tarnów","Tarnów"]
[null,null,null,null,null,null,null,null,null,null,null,null,null,null,null,null,"Wrocławski","wrocławski",null,null,null,null,null,null,null,"nowotarski","Nowy Targ"]
[null,null,null,null,null,null,null,null,null,null,null,null,null,null,null,null,"Miasto Wrocław","Wrocław",null,null,null,null,null,null,null,"nowotarski","Szczawnica"]
[null,null,null,null,null,null,null,null,null,null,null,null,null,null,null,null,"Nyski","brzeski",null,null,null,null,null,null,null,"nowotarski","Czarny Dunajec"]
[null,null,null,null,null,null,null,null,null,null,null,null,null,null,null,null,"Nyski","głubczycki",null,null,null,null,null,null,null,"nowotarski","Czorsztyn"]
[null,null,null,null,null,null,null,null,null,null,null,null,null,null,null,null,"Nyski","namysłowski",null,null,null,null,null,null,null,"nowotarski","Jabłonka"]
[null,null,null,null,null,null,null,null,null,null,null,null,null,null,null,null,"Nyski","nyski",null,null,null,null,null,null,null,"nowotarski","Krościenko nad Dunajcem"]
[null,null,null,null,null,null,null,null,null,null,null,null,null,null,null,null,"Nyski","prudnicki",null,null,null,null,null,null,null,"nowotarski","Lipnica Wielka"]
[null,null,null,null,null,null,null,null,null,null,null,null,null,null,null,null,"Opolski","kędzierzyńsko-kozielski",null,null,null,null,null,null,null,"nowotarski","Łapsze Niżne"]
[null,null,null,null,null,null,null,null,null,null,null,null,null,null,null,null,"Opolski","kluczborski",null,null,null,null,null,null,null,"nowotarski","Nowy Targ"]
[null,null,null,null,null,null,null,null,null,null,null,null,null,null,null,null,"Opolski","krapkowicki",null,null,null,null,null,null,null,"nowotarski","Ochotnica Dolna"]
[null,null,null,null,null,null,null,null,null,null,null,null,null,null,null,null,"Opolski","oleski",null,null,null,null,null,null,null,"nowotarski","Raba Wyżna"]
[null,null,null,null,null,null,null,null,null,null,null,null,null,null,null,null,"Opolski","opolski",null,null,null,null,null,null,null,"nowotarski","Rabka-Zdrój"]
[null,null,null,null,null,null,null,null,null,null,null,null,null,null,null,null,"Opolski","strzelecki",null,null,null,null,null,null,null,"nowotarski","Spytkowice"]
[null,null,null,null,null,null,null,null,null,null,null,null,null,null,null,null,"Opolski","Opole",null,null,null,null,null,null,null,"nowotarski","Szaflary"]
[null,null,null,null,null,null,null,null,null,null,null,null,null,null,null,null,"Bydgosko-toruński","bydgoski",null,null,null,null,null,null,null,"suski","Jordanów"]
[null,null,null,null,null,null,null,null,null,null,null,null,null,null,null,null,"Bydgosko-toruński","toruński",null,null,null,null,null,null,null,"suski","Sucha Beskidzka"]
[null,null,null,null,null,null,null,null,null,null,null,null,null,null,null,null,"Bydgosko-toruński","Bydgoszcz",null,null,null,null,null,null,null,"suski","Budzów"]
[null,null,null,null,null,null,null,null,null,null,null,null,null,null,null,null,"Bydgosko-toruński","Toruń",null,null,null,null,null,null,null,"suski","Bystra-Sidzina"]
[null,null,null,null,null,null,null,null,null,null,null,null,null,null,null,null,"Grudziądzki","brodnicki",null,null,null,null,null,null,null,"suski","Jordanów"]
[null,null,null,null,null,null,null,null,null,null,null,null,null,null,null,null,"Grudziądzki","chełmiński",null,null,null,null,null,null,null,"suski","Maków Podhalański"]
[null,null,null,null,null,null,null,null,null,null,null,null,null,null,null,null,"Grudziądzki","golubsko-dobrzyński",null,null,null,null,null,null,null,"suski","Stryszawa"]
[null,null,null,null,null,null,null,null,null,null,null,null,null,null,null,null,"Grudziądzki","grudziądzki",null,null,null,null,null,null,null,"suski","Zawoja"]
[null,null,null,null,null,null,null,null,null,null,null,null,null,null,null,null,"Grudziądzki","rypiński",null,null,null,null,null,null,null,"suski","Zembrzyce"]
[null,null,null,null,null,null,null,null,null,null,null,null,null,null,null,null,"Grudziądzki","wąbrzeski",null,null,null,null,null,null,null,"tatrzański","Zakopane"]
[null,null,null,null,null,null,null,null,null,null,null,null,null,null,null,null,"Grudziądzki","Grudziądz",null,null,null,null,null,null,null,"tatrzański","Biały Dunajec"]
[null,null,null,null,null,null,null,null,null,null,null,null,null,null,null,null,"Włocławski","aleksandrowski",null,null,null,null,null,null,null,"tatrzański","Bukowina Tatrzańska"]
[null,null,null,null,null,null,null,null,null,null,null,null,null,null,null,null,"Włocławski","lipnowski",null,null,null,null,null,null,null,"tatrzański","Kościelisko"]
[null,null,null,null,null,null,null,null,null,null,null,null,null,null,null,null,"Włocławski","radziejowski",null,null,null,null,null,null,null,"tatrzański","Poronin"]
[null,null,null,null,null,null,null,null,null,null,null,null,null,null,null,null,"Włocławski","włocławski",null,null,null,null,null,null,null,"bielski","Szczyrk"]
[null,null,null,null,null,null,null,null,null,null,null,null,null,null,null,null,"Włocławski","Włocławek",null,null,null,null,null,null,null,"bielski","Bestwina"]
[null,null,null,null,null,null,null,null,null,null,null,null,null,null,null,null,"Inowrocławski","inowrocławski",null,null,null,null,null,null,null,"bielski","Buczkowice"]
[null,null,null,null,null,null,null,null,null,null,null,null,null,null,null,null,"Inowrocławski","mogileński",null,null,null,null,null,null,null,"bielski","Czechowice-Dziedzice"]
[null,null,null,null,null,null,null,null,null,null,null,null,null,null,null,null,"Inowrocławski","nakielski",null,null,null,null,null,null,null,"bielski","Jasienica"]
[null,null,null,null,null,null,null,null,null,null,null,null,null,null,null,null,"Inowrocławski","żniński",null,null,null,null,null,null,null,"bielski","Jaworze"]
[null,null,null,null,null,null,null,null,null,null,null,null,null,null,null,null,"Świecki","sępoleński",null,null,null,null,null,null,null,"bielski","Kozy"]
[null,null,null,null,null,null,null,null,null,null,null,null,null,null,null,null,"Świecki","świecki",null,null,null,null,null,null,null,"bielski","Porąbka"]
[null,null,null,null,null,null,null,null,null,null,null,null,null,null,null,null,"Świecki","tucholski",null,null,null,null,null,null,null,"bielski","Wilamowice"]
[null,null,null,null,null,null,null,null,null,null,null,null,null,null,null,null,"Gdański","gdański",null,null,null,null,null,null,null,"bielski","Wilkowice"]
[null,null,null,null,null,null,null,null,null,null,null,null,null,null,null,null,"Gdański","kartuski",null,null,null,null,null,null,null,"cieszyński","Cieszyn"]
[null,null,null,null,null,null,null,null,null,null,null,null,null,null,null,null,"Gdański","nowodworski",null,null,null,null,null,null,null,"cieszyński","Ustroń"]
[null,null,null,null,null,null,null,null,null,null,null,null,null,null,null,null,"Gdański","pucki",null,null,null,null,null,null,null,"cieszyński","Wisła"]
[null,null,null,null,null,null,null,null,null,null,null,null,null,null,null,null,"Gdański","wejherowski",null,null,null,null,null,null,null,"cieszyński","Brenna"]
[null,null,null,null,null,null,null,null,null,null,null,null,null,null,null,null,"Słupski","bytowski",null,null,null,null,null,null,null,"cieszyński","Chybie"]
[null,null,null,null,null,null,null,null,null,null,null,null,null,null,null,null,"Słupski","lęborski",null,null,null,null,null,null,null,"cieszyński","Dębowiec"]
[null,null,null,null,null,null,null,null,null,null,null,null,null,null,null,null,"Słupski","słupski",null,null,null,null,null,null,null,"cieszyński","Goleszów"]
[null,null,null,null,null,null,null,null,null,null,null,null,null,null,null,null,"Słupski","Słupsk",null,null,null,null,null,null,null,"cieszyński","Hażlach"]
[null,null,null,null,null,null,null,null,null,null,null,null,null,null,null,null,"Starogardzki","kwidzyński",null,null,null,null,null,null,null,"cieszyński","Istebna"]
[null,null,null,null,null,null,null,null,null,null,null,null,null,null,null,null,"Starogardzki","malborski",null,null,null,null,null,null,null,"cieszyński","Skoczów"]
[null,null,null,null,null,null,null,null,null,null,null,null,null,null,null,null,"Starogardzki","starogardzki",null,null,null,null,null,null,null,"cieszyński","Strumień"]
[null,null,null,null,null,null,null,null,null,null,null,null,null,null,null,null,"Starogardzki","tczewski",null,null,null,null,null,null,null,"cieszyński","Zebrzydowice"]
[null,null,null,null,null,null,null,null,null,null,null,null,null,null,null,null,"Starogardzki","sztumski",null,null,null,null,null,null,null,"żywiecki","Żywiec"]
[null,null,null,null,null,null,null,null,null,null,null,null,null,null,null,null,"Trójmiejski","Gdańsk",null,null,null,null,null,null,null,"żywiecki","Czernichów"]
[null,null,null,null,null,null,null,null,null,null,null,null,null,null,null,null,"Trójmiejski","Gdynia",null,null,null,null,null,null,null,"żywiecki","Gilowice"]
[null,null,null,null,null,null,null,null,null,null,null,null,null,null,null,null,"Trójmiejski","Sopot",null,null,null,null,null,null,null,"żywiecki","Jeleśnia"]
[null,null,null,null,null,null,null,null,null,null,null,null,null,null,null,null,"Chojnicki","chojnicki",null,null,null,null,null,null,null,"żywiecki","Koszarawa"]
[null,null,null,null,null,null,null,null,null,null,null,null,null,null,null,null,"Chojnicki","człuchowski",null,null,null,null,null,null,null,"żywiecki","Lipowa"]
[null,null,null,null,null,null,null,null,null,null,null,null,null,null,null,null,"Chojnicki","kościerski",null,null,null,null,null,null,null,"żywiecki","Łękawica"]
[null,null,null,null,null,null,null,null,null,null,null,null,null,null,null,null,"Elbląski","braniewski",null,null,null,null,null,null,null,"żywiecki","Łodygowice"]
[null,null,null,null,null,null,null,null,null,null,null,null,null,null,null,null,"Elbląski","działdowski",null,null,null,null,null,null,null,"żywiecki","Milówka"]
[null,null,null,null,null,null,null,null,null,null,null,null,null,null,null,null,"Elbląski","elbląski",null,null,null,null,null,null,null,"żywiecki","Radziechowy-Wieprz"]
[null,null,null,null,null,null,null,null,null,null,null,null,null,null,null,null,"Elbląski","iławski",null,null,null,null,null,null,null,"żywiecki","Rajcza"]
[null,null,null,null,null,null,null,null,null,null,null,null,null,null,null,null,"Elbląski","nowomiejski",null,null,null,null,null,null,null,"żywiecki","Ślemień"]
[null,null,null,null,null,null,null,null,null,null,null,null,null,null,null,null,"Elbląski","ostródzki",null,null,null,null,null,null,null,"żywiecki","Świnna"]
[null,null,null,null,null,null,null,null,null,null,null,null,null,null,null,null,"Elbląski","Elbląg",null,null,null,null,null,null,null,"żywiecki","Ujsoły"]
[null,null,null,null,null,null,null,null,null,null,null,null,null,null,null,null,"Ełcki","ełcki",null,null,null,null,null,null,null,"żywiecki","Węgierska Górka"]
[null,null,null,null,null,null,null,null,null,null,null,null,null,null,null,null,"Ełcki","giżycki",null,null,null,null,null,null,null,"Bielsko-Biała","Bielsko-Biała"]
[null,null,null,null,null,null,null,null,null,null,null,null,null,null,null,null,"Ełcki","olecki",null,null,null,null,null,null,null,"lubliniecki","Lubliniec"]
[null,null,null,null,null,null,null,null,null,null,null,null,null,null,null,null,"Ełcki","piski",null,null,null,null,null,null,null,"lubliniecki","Boronów"]
[null,null,null,null,null,null,null,null,null,null,null,null,null,null,null,null,"Ełcki","gołdapski",null,null,null,null,null,null,null,"lubliniecki","Ciasna"]
[null,null,null,null,null,null,null,null,null,null,null,null,null,null,null,null,"Ełcki","węgorzewski",null,null,null,null,null,null,null,"lubliniecki","Herby"]
[null,null,null,null,null,null,null,null,null,null,null,null,null,null,null,null,"Olsztyński","bartoszycki",null,null,null,null,null,null,null,"lubliniecki","Kochanowice"]
[null,null,null,null,null,null,null,null,null,null,null,null,null,null,null,null,"Olsztyński","kętrzyński",null,null,null,null,null,null,null,"lubliniecki","Koszęcin"]
[null,null,null,null,null,null,null,null,null,null,null,null,null,null,null,null,"Olsztyński","lidzbarski",null,null,null,null,null,null,null,"lubliniecki","Pawonków"]
[null,null,null,null,null,null,null,null,null,null,null,null,null,null,null,null,"Olsztyński","mrągowski",null,null,null,null,null,null,null,"lubliniecki","Woźniki"]
[null,null,null,null,null,null,null,null,null,null,null,null,null,null,null,null,"Olsztyński","nidzicki",null,null,null,null,null,null,null,"tarnogórski","Kalety"]
[null,null,null,null,null,null,null,null,null,null,null,null,null,null,null,null,"Olsztyński","olsztyński",null,null,null,null,null,null,null,"tarnogórski","Miasteczko Śląskie"]
[null,null,null,null,null,null,null,null,null,null,null,null,null,null,null,null,"Olsztyński","szczycieński",null,null,null,null,null,null,null,"tarnogórski","Radzionków"]
[null,null,null,null,null,null,null,null,null,null,null,null,null,null,null,null,"Olsztyński","Olsztyn",null,null,null,null,null,null,null,"tarnogórski","Tarnowskie Góry"]
[null,null,null,null,null,null,null,null,null,null,null,null,null,null,null,null,"Łódzki","łódzki wschodni",null,null,null,null,null,null,null,"tarnogórski","Krupski Młyn"]
[null,null,null,null,null,null,null,null,null,null,null,null,null,null,null,null,"Łódzki","pabianicki",null,null,null,null,null,null,null,"tarnogórski","Ożarowice"]
[null,null,null,null,null,null,null,null,null,null,null,null,null,null,null,null,"Łódzki","zgierski",null,null,null,null,null,null,null,"tarnogórski","Świerklaniec"]
[null,null,null,null,null,null,null,null,null,null,null,null,null,null,null,null,"Łódzki","brzeziński",null,null,null,null,null,null,null,"tarnogórski","Tworóg"]
[null,null,null,null,null,null,null,null,null,null,null,null,null,null,null,null,"M. Łódź","Łódź",null,null,null,null,null,null,null,"tarnogórski","Zbrosławice"]
[null,null,null,null,null,null,null,null,null,null,null,null,null,null,null,null,"Piotrkowski","bełchatowski",null,null,null,null,null,null,null,"Bytom","Bytom"]
[null,null,null,null,null,null,null,null,null,null,null,null,null,null,null,null,"Piotrkowski","opoczyński",null,null,null,null,null,null,null,"Piekary Śląskie","Piekary Śląskie"]
[null,null,null,null,null,null,null,null,null,null,null,null,null,null,null,null,"Piotrkowski","piotrkowski",null,null,null,null,null,null,null,"częstochowski","Blachownia"]
[null,null,null,null,null,null,null,null,null,null,null,null,null,null,null,null,"Piotrkowski","radomszczański",null,null,null,null,null,null,null,"częstochowski","Dąbrowa Zielona"]
[null,null,null,null,null,null,null,null,null,null,null,null,null,null,null,null,"Piotrkowski","tomaszowski",null,null,null,null,null,null,null,"częstochowski","Janów"]
[null,null,null,null,null,null,null,null,null,null,null,null,null,null,null,null,"Piotrkowski","Piotrków Trybunalski",null,null,null,null,null,null,null,"częstochowski","Kamienica Polska"]
[null,null,null,null,null,null,null,null,null,null,null,null,null,null,null,null,"Sieradzki","łaski",null,null,null,null,null,null,null,"częstochowski","Kłomnice"]
[null,null,null,null,null,null,null,null,null,null,null,null,null,null,null,null,"Sieradzki","pajęczański",null,null,null,null,null,null,null,"częstochowski","Koniecpol"]
[null,null,null,null,null,null,null,null,null,null,null,null,null,null,null,null,"Sieradzki","poddębicki",null,null,null,null,null,null,null,"częstochowski","Konopiska"]
[null,null,null,null,null,null,null,null,null,null,null,null,null,null,null,null,"Sieradzki","sieradzki",null,null,null,null,null,null,null,"częstochowski","Kruszyna"]
[null,null,null,null,null,null,null,null,null,null,null,null,null,null,null,null,"Sieradzki","wieluński",null,null,null,null,null,null,null,"częstochowski","Lelów"]
[null,null,null,null,null,null,null,null,null,null,null,null,null,null,null,null,"Sieradzki","wieruszowski",null,null,null,null,null,null,null,"częstochowski","Mstów"]
[null,null,null,null,null,null,null,null,null,null,null,null,null,null,null,null,"Sieradzki","zduńskowolski",null,null,null,null,null,null,null,"częstochowski","Mykanów"]
[null,null,null,null,null,null,null,null,null,null,null,null,null,null,null,null,"Skierniewicki","kutnowski",null,null,null,null,null,null,null,"częstochowski","Olsztyn"]
[null,null,null,null,null,null,null,null,null,null,null,null,null,null,null,null,"Skierniewicki","łęczycki",null,null,null,null,null,null,null,"częstochowski","Poczesna"]
[null,null,null,null,null,null,null,null,null,null,null,null,null,null,null,null,"Skierniewicki","łowicki",null,null,null,null,null,null,null,"częstochowski","Przyrów"]
[null,null,null,null,null,null,null,null,null,null,null,null,null,null,null,null,"Skierniewicki","rawski",null,null,null,null,null,null,null,"częstochowski","Rędziny"]
[null,null,null,null,null,null,null,null,null,null,null,null,null,null,null,null,"Skierniewicki","skierniewicki",null,null,null,null,null,null,null,"częstochowski","Starcza"]
[null,null,null,null,null,null,null,null,null,null,null,null,null,null,null,null,"Skierniewicki","Skierniewice",null,null,null,null,null,null,null,"kłobucki","Kłobuck"]
[null,null,null,null,null,null,null,null,null,null,null,null,null,null,null,null,"Kielecki","kielecki",null,null,null,null,null,null,null,"kłobucki","Krzepice"]
[null,null,null,null,null,null,null,null,null,null,null,null,null,null,null,null,"Kielecki","konecki",null,null,null,null,null,null,null,"kłobucki","Lipie"]
[null,null,null,null,null,null,null,null,null,null,null,null,null,null,null,null,"Kielecki","ostrowiecki",null,null,null,null,null,null,null,"kłobucki","Miedźno"]
[null,null,null,null,null,null,null,null,null,null,null,null,null,null,null,null,"Kielecki","skarżyski",null,null,null,null,null,null,null,"kłobucki","Opatów"]
[null,null,null,null,null,null,null,null,null,null,null,null,null,null,null,null,"Kielecki","starachowicki",null,null,null,null,null,null,null,"kłobucki","Panki"]
[null,null,null,null,null,null,null,null,null,null,null,null,null,null,null,null,"Kielecki","Kielce",null,null,null,null,null,null,null,"kłobucki","Popów"]
[null,null,null,null,null,null,null,null,null,null,null,null,null,null,null,null,"Sandomiersko-jędrzejowski","buski",null,null,null,null,null,null,null,"kłobucki","Przystajń"]
[null,null,null,null,null,null,null,null,null,null,null,null,null,null,null,null,"Sandomiersko-jędrzejowski","jędrzejowski",null,null,null,null,null,null,null,"kłobucki","Wręczyca Wielka"]
[null,null,null,null,null,null,null,null,null,null,null,null,null,null,null,null,"Sandomiersko-jędrzejowski","kazimierski",null,null,null,null,null,null,null,"myszkowski","Myszków"]
[null,null,null,null,null,null,null,null,null,null,null,null,null,null,null,null,"Sandomiersko-jędrzejowski","opatowski",null,null,null,null,null,null,null,"myszkowski","Koziegłowy"]
[null,null,null,null,null,null,null,null,null,null,null,null,null,null,null,null,"Sandomiersko-jędrzejowski","pińczowski",null,null,null,null,null,null,null,"myszkowski","Niegowa"]
[null,null,null,null,null,null,null,null,null,null,null,null,null,null,null,null,"Sandomiersko-jędrzejowski","sandomierski",null,null,null,null,null,null,null,"myszkowski","Poraj"]
[null,null,null,null,null,null,null,null,null,null,null,null,null,null,null,null,"Sandomiersko-jędrzejowski","staszowski",null,null,null,null,null,null,null,"myszkowski","Żarki"]
[null,null,null,null,null,null,null,null,null,null,null,null,null,null,null,null,"Sandomiersko-jędrzejowski","włoszczowski",null,null,null,null,null,null,null,"Częstochowa","Częstochowa"]
[null,null,null,null,null,null,null,null,null,null,null,null,null,null,null,null,"Bialski","bialski",null,null,null,null,null,null,null,"gliwicki","Knurów"]
[null,null,null,null,null,null,null,null,null,null,null,null,null,null,null,null,"Bialski","parczewski",null,null,null,null,null,null,null,"gliwicki","Pyskowice"]
[null,null,null,null,null,null,null,null,null,null,null,null,null,null,null,null,"Bialski","radzyński",null,null,null,null,null,null,null,"gliwicki","Gierałtowice"]
[null,null,null,null,null,null,null,null,null,null,null,null,null,null,null,null,"Bialski","włodawski",null,null,null,null,null,null,null,"gliwicki","Pilchowice"]
[null,null,null,null,null,null,null,null,null,null,null,null,null,null,null,null,"Bialski","Biała Podlaska",null,null,null,null,null,null,null,"gliwicki","Rudziniec"]
[null,null,null,null,null,null,null,null,null,null,null,null,null,null,null,null,"Chełmsko-zamojski","biłgorajski",null,null,null,null,null,null,null,"gliwicki","Sośnicowice"]
[null,null,null,null,null,null,null,null,null,null,null,null,null,null,null,null,"Chełmsko-zamojski","chełmski",null,null,null,null,null,null,null,"gliwicki","Toszek"]
[null,null,null,null,null,null,null,null,null,null,null,null,null,null,null,null,"Chełmsko-zamojski","hrubieszowski",null,null,null,null,null,null,null,"gliwicki","Wielowieś"]
[null,null,null,null,null,null,null,null,null,null,null,null,null,null,null,null,"Chełmsko-zamojski","krasnostawski",null,null,null,null,null,null,null,"Gliwice","Gliwice"]
[null,null,null,null,null,null,null,null,null,null,null,null,null,null,null,null,"Chełmsko-zamojski","tomaszowski",null,null,null,null,null,null,null,"Zabrze","Zabrze"]
[null,null,null,null,null,null,null,null,null,null,null,null,null,null,null,null,"Chełmsko-zamojski","zamojski",null,null,null,null,null,null,null,"Chorzów","Chorzów"]
[null,null,null,null,null,null,null,null,null,null,null,null,null,null,null,null,"Chełmsko-zamojski","Chełm",null,null,null,null,null,null,null,"Katowice","Katowice"]
[null,null,null,null,null,null,null,null,null,null,null,null,null,null,null,null,"Chełmsko-zamojski","Zamość",null,null,null,null,null,null,null,"Mysłowice","Mysłowice"]
[null,null,null,null,null,null,null,null,null,null,null,null,null,null,null,null,"Lubelski","lubartowski",null,null,null,null,null,null,null,"Ruda Śląska","Ruda Śląska"]
[null,null,null,null,null,null,null,null,null,null,null,null,null,null,null,null,"Lubelski","lubelski",null,null,null,null,null,null,null,"Siemianowice Śląskie","Siemianowice Śląskie"]
[null,null,null,null,null,null,null,null,null,null,null,null,null,null,null,null,"Lubelski","łęczyński",null,null,null,null,null,null,null,"Świętochłowice","Świętochłowice"]
[null,null,null,null,null,null,null,null,null,null,null,null,null,null,null,null,"Lubelski","świdnicki",null,null,null,null,null,null,null,"raciborski","Racibórz"]
[null,null,null,null,null,null,null,null,null,null,null,null,null,null,null,null,"Lubelski","Lublin",null,null,null,null,null,null,null,"raciborski","Kornowac"]
[null,null,null,null,null,null,null,null,null,null,null,null,null,null,null,null,"Puławski","janowski",null,null,null,null,null,null,null,"raciborski","Krzanowice"]
[null,null,null,null,null,null,null,null,null,null,null,null,null,null,null,null,"Puławski","kraśnicki",null,null,null,null,null,null,null,"raciborski","Krzyżanowice"]
[null,null,null,null,null,null,null,null,null,null,null,null,null,null,null,null,"Puławski","łukowski",null,null,null,null,null,null,null,"raciborski","Kuźnia Raciborska"]
[null,null,null,null,null,null,null,null,null,null,null,null,null,null,null,null,"Puławski","opolski",null,null,null,null,null,null,null,"raciborski","Nędza"]
[null,null,null,null,null,null,null,null,null,null,null,null,null,null,null,null,"Puławski","puławski",null,null,null,null,null,null,null,"raciborski","Pietrowice Wielkie"]
[null,null,null,null,null,null,null,null,null,null,null,null,null,null,null,null,"Puławski","rycki",null,null,null,null,null,null,null,"raciborski","Rudnik"]
[null,null,null,null,null,null,null,null,null,null,null,null,null,null,null,null,"Krośnieński","bieszczadzki",null,null,null,null,null,null,null,"rybnicki","Czerwionka-Leszczyny"]
[null,null,null,null,null,null,null,null,null,null,null,null,null,null,null,null,"Krośnieński","brzozowski",null,null,null,null,null,null,null,"rybnicki","Gaszowice"]
[null,null,null,null,null,null,null,null,null,null,null,null,null,null,null,null,"Krośnieński","jasielski",null,null,null,null,null,null,null,"rybnicki","Jejkowice"]
[null,null,null,null,null,null,null,null,null,null,null,null,null,null,null,null,"Krośnieński","krośnieński",null,null,null,null,null,null,null,"rybnicki","Lyski"]
[null,null,null,null,null,null,null,null,null,null,null,null,null,null,null,null,"Krośnieński","sanocki",null,null,null,null,null,null,null,"rybnicki","Świerklany"]
[null,null,null,null,null,null,null,null,null,null,null,null,null,null,null,null,"Krośnieński","leski",null,null,null,null,null,null,null,"wodzisławski","Pszów"]
[null,null,null,null,null,null,null,null,null,null,null,null,null,null,null,null,"Krośnieński","Krosno",null,null,null,null,null,null,null,"wodzisławski","Radlin"]
[null,null,null,null,null,null,null,null,null,null,null,null,null,null,null,null,"Przemyski","jarosławski",null,null,null,null,null,null,null,"wodzisławski","Rydułtowy"]
[null,null,null,null,null,null,null,null,null,null,null,null,null,null,null,null,"Przemyski","lubaczowski",null,null,null,null,null,null,null,"wodzisławski","Wodzisław Śląski"]
[null,null,null,null,null,null,null,null,null,null,null,null,null,null,null,null,"Przemyski","przemyski",null,null,null,null,null,null,null,"wodzisławski","Godów"]
[null,null,null,null,null,null,null,null,null,null,null,null,null,null,null,null,"Przemyski","przeworski",null,null,null,null,null,null,null,"wodzisławski","Gorzyce"]
[null,null,null,null,null,null,null,null,null,null,null,null,null,null,null,null,"Przemyski","Przemyśl",null,null,null,null,null,null,null,"wodzisławski","Lubomia"]
[null,null,null,null,null,null,null,null,null,null,null,null,null,null,null,null,"Rzeszowski","kolbuszowski",null,null,null,null,null,null,null,"wodzisławski","Marklowice"]
[null,null,null,null,null,null,null,null,null,null,null,null,null,null,null,null,"Rzeszowski","łańcucki",null,null,null,null,null,null,null,"wodzisławski","Mszana"]
[null,null,null,null,null,null,null,null,null,null,null,null,null,null,null,null,"Rzeszowski","ropczycko-sędziszowski",null,null,null,null,null,null,null,"Jastrzębie-Zdrój","Jastrzębie-Zdrój"]
[null,null,null,null,null,null,null,null,null,null,null,null,null,null,null,null,"Rzeszowski","rzeszowski",null,null,null,null,null,null,null,"Rybnik","Rybnik"]
[null,null,null,null,null,null,null,null,null,null,null,null,null,null,null,null,"Rzeszowski","strzyżowski",null,null,null,null,null,null,null,"Żory","Żory"]
[null,null,null,null,null,null,null,null,null,null,null,null,null,null,null,null,"Rzeszowski","Rzeszów",null,null,null,null,null,null,null,"będziński","Będzin"]
[null,null,null,null,null,null,null,null,null,null,null,null,null,null,null,null,"Tarnobrzeski","dębicki",null,null,null,null,null,null,null,"będziński","Czeladź"]
[null,null,null,null,null,null,null,null,null,null,null,null,null,null,null,null,"Tarnobrzeski","leżajski",null,null,null,null,null,null,null,"będziński","Wojkowice"]
[null,null,null,null,null,null,null,null,null,null,null,null,null,null,null,null,"Tarnobrzeski","mielecki",null,null,null,null,null,null,null,"będziński","Bobrowniki"]
[null,null,null,null,null,null,null,null,null,null,null,null,null,null,null,null,"Tarnobrzeski","niżański",null,null,null,null,null,null,null,"będziński","Mierzęcice"]
[null,null,null,null,null,null,null,null,null,null,null,null,null,null,null,null,"Tarnobrzeski","stalowowolski",null,null,null,null,null,null,null,"będziński","Psary"]
[null,null,null,null,null,null,null,null,null,null,null,null,null,null,null,null,"Tarnobrzeski","tarnobrzeski",null,null,null,null,null,null,null,"będziński","Siewierz"]
[null,null,null,null,null,null,null,null,null,null,null,null,null,null,null,null,"Tarnobrzeski","Tarnobrzeg",null,null,null,null,null,null,null,"będziński","Sławków"]
[null,null,null,null,null,null,null,null,null,null,null,null,null,null,null,null,"Białostocki","białostocki",null,null,null,null,null,null,null,"zawierciański","Poręba"]
[null,null,null,null,null,null,null,null,null,null,null,null,null,null,null,null,"Białostocki","sokólski",null,null,null,null,null,null,null,"zawierciański","Zawiercie"]
[null,null,null,null,null,null,null,null,null,null,null,null,null,null,null,null,"Białostocki","Białystok",null,null,null,null,null,null,null,"zawierciański","Irządze"]
[null,null,null,null,null,null,null,null,null,null,null,null,null,null,null,null,"Łomżyński","bielski",null,null,null,null,null,null,null,"zawierciański","Kroczyce"]
[null,null,null,null,null,null,null,null,null,null,null,null,null,null,null,null,"Łomżyński","hajnowski",null,null,null,null,null,null,null,"zawierciański","Łazy"]
[null,null,null,null,null,null,null,null,null,null,null,null,null,null,null,null,"Łomżyński","kolneński",null,null,null,null,null,null,null,"zawierciański","Ogrodzieniec"]
[null,null,null,null,null,null,null,null,null,null,null,null,null,null,null,null,"Łomżyński","łomżyński",null,null,null,null,null,null,null,"zawierciański","Pilica"]
[null,null,null,null,null,null,null,null,null,null,null,null,null,null,null,null,"Łomżyński","siemiatycki",null,null,null,null,null,null,null,"zawierciański","Szczekociny"]
[null,null,null,null,null,null,null,null,null,null,null,null,null,null,null,null,"Łomżyński","wysokomazowiecki",null,null,null,null,null,null,null,"zawierciański","Włodowice"]
[null,null,null,null,null,null,null,null,null,null,null,null,null,null,null,null,"Łomżyński","zambrowski",null,null,null,null,null,null,null,"zawierciański","Żarnowiec"]
[null,null,null,null,null,null,null,null,null,null,null,null,null,null,null,null,"Łomżyński","Łomża",null,null,null,null,null,null,null,"Dąbrowa Górnicza","Dąbrowa Górnicza"]
[null,null,null,null,null,null,null,null,null,null,null,null,null,null,null,null,"Suwalski","augustowski",null,null,null,null,null,null,null,"Jaworzno","Jaworzno"]
[null,null,null,null,null,null,null,null,null,null,null,null,null,null,null,null,"Suwalski","grajewski",null,null,null,null,null,null,null,"Sosnowiec","Sosnowiec"]
[null,null,null,null,null,null,null,null,null,null,null,null,null,null,null,null,"Suwalski","moniecki",null,null,null,null,null,null,null,"mikołowski","Łaziska Górne"]
[null,null,null,null,null,null,null,null,null,null,null,null,null,null,null,null,"Suwalski","sejneński",null,null,null,null,null,null,null,"mikołowski","Mikołów"]
[null,null,null,null,null,null,null,null,null,null,null,null,null,null,null,null,"Suwalski","suwalski",null,null,null,null,null,null,null,"mikołowski","Orzesze"]
[null,null,null,null,null,null,null,null,null,null,null,null,null,null,null,null,"Suwalski","Suwałki",null,null,null,null,null,null,null,"mikołowski","Ornontowice"]
[null,null,null,null,null,null,null,null,null,null,null,null,null,null,null,null,"Miasto Warszawa","Warszawa",null,null,null,null,null,null,null,"mikołowski","Wyry"]
[null,null,null,null,null,null,null,null,null,null,null,null,null,null,null,null,"Warszawski wschodni","legionowski",null,null,null,null,null,null,null,"pszczyński","Goczałkowice-Zdrój"]
[null,null,null,null,null,null,null,null,null,null,null,null,null,null,null,null,"Warszawski wschodni","miński",null,null,null,null,null,null,null,"pszczyński","Kobiór"]
[null,null,null,null,null,null,null,null,null,null,null,null,null,null,null,null,"Warszawski wschodni","otwocki",null,null,null,null,null,null,null,"pszczyński","Miedźna"]
[null,null,null,null,null,null,null,null,null,null,null,null,null,null,null,null,"Warszawski wschodni","wołomiński",null,null,null,null,null,null,null,"pszczyński","Pawłowice"]
[null,null,null,null,null,null,null,null,null,null,null,null,null,null,null,null,"Warszawski zachodni","grodziski",null,null,null,null,null,null,null,"pszczyński","Pszczyna"]
[null,null,null,null,null,null,null,null,null,null,null,null,null,null,null,null,"Warszawski zachodni","nowodworski",null,null,null,null,null,null,null,"pszczyński","Suszec"]
[null,null,null,null,null,null,null,null,null,null,null,null,null,null,null,null,"Warszawski zachodni","piaseczyński",null,null,null,null,null,null,null,"bieruńsko-lędziński","Bieruń"]
[null,null,null,null,null,null,null,null,null,null,null,null,null,null,null,null,"Warszawski zachodni","pruszkowski",null,null,null,null,null,null,null,"bieruńsko-lędziński","Imielin"]
[null,null,null,null,null,null,null,null,null,null,null,null,null,null,null,null,"Warszawski zachodni","warszawski zachodni",null,null,null,null,null,null,null,"bieruńsko-lędziński","Lędziny"]
[null,null,null,null,null,null,null,null,null,null,null,null,null,null,null,null,"Ciechanowski","ciechanowski",null,null,null,null,null,null,null,"bieruńsko-lędziński","Bojszowy"]
[null,null,null,null,null,null,null,null,null,null,null,null,null,null,null,null,"Ciechanowski","mławski",null,null,null,null,null,null,null,"bieruńsko-lędziński","Chełm Śląski"]
[null,null,null,null,null,null,null,null,null,null,null,null,null,null,null,null,"Ciechanowski","płoński",null,null,null,null,null,null,null,"Tychy","Tychy"]
[null,null,null,null,null,null,null,null,null,null,null,null,null,null,null,null,"Ciechanowski","pułtuski",null,null,null,null,null,null,null,"gorzowski","Kostrzyn nad Odrą"]
[null,null,null,null,null,null,null,null,null,null,null,null,null,null,null,null,"Ciechanowski","żuromiński",null,null,null,null,null,null,null,"gorzowski","Bogdaniec"]
[null,null,null,null,null,null,null,null,null,null,null,null,null,null,null,null,"Ostrołęcki","makowski",null,null,null,null,null,null,null,"gorzowski","Deszczno"]
[null,null,null,null,null,null,null,null,null,null,null,null,null,null,null,null,"Ostrołęcki","ostrołęcki",null,null,null,null,null,null,null,"gorzowski","Kłodawa"]
[null,null,null,null,null,null,null,null,null,null,null,null,null,null,null,null,"Ostrołęcki","ostrowski",null,null,null,null,null,null,null,"gorzowski","Lubiszyn"]
[null,null,null,null,null,null,null,null,null,null,null,null,null,null,null,null,"Ostrołęcki","przasnyski",null,null,null,null,null,null,null,"gorzowski","Santok"]
[null,null,null,null,null,null,null,null,null,null,null,null,null,null,null,null,"Ostrołęcki","wyszkowski",null,null,null,null,null,null,null,"gorzowski","Witnica"]
[null,null,null,null,null,null,null,null,null,null,null,null,null,null,null,null,"Ostrołęcki","Ostrołęka",null,null,null,null,null,null,null,"międzyrzecki","Bledzew"]
[null,null,null,null,null,null,null,null,null,null,null,null,null,null,null,null,"Radomski","białobrzeski",null,null,null,null,null,null,null,"międzyrzecki","Międzyrzecz"]
[null,null,null,null,null,null,null,null,null,null,null,null,null,null,null,null,"Radomski","kozienicki",null,null,null,null,null,null,null,"międzyrzecki","Przytoczna"]
[null,null,null,null,null,null,null,null,null,null,null,null,null,null,null,null,"Radomski","lipski",null,null,null,null,null,null,null,"międzyrzecki","Pszczew"]
[null,null,null,null,null,null,null,null,null,null,null,null,null,null,null,null,"Radomski","przysuski",null,null,null,null,null,null,null,"międzyrzecki","Skwierzyna"]
[null,null,null,null,null,null,null,null,null,null,null,null,null,null,null,null,"Radomski","radomski",null,null,null,null,null,null,null,"międzyrzecki","Trzciel"]
[null,null,null,null,null,null,null,null,null,null,null,null,null,null,null,null,"Radomski","szydłowiecki",null,null,null,null,null,null,null,"słubicki","Cybinka"]
[null,null,null,null,null,null,null,null,null,null,null,null,null,null,null,null,"Radomski","zwoleński",null,null,null,null,null,null,null,"słubicki","Górzyca"]
[null,null,null,null,null,null,null,null,null,null,null,null,null,null,null,null,"Radomski","Radom",null,null,null,null,null,null,null,"słubicki","Ośno Lubuskie"]
[null,null,null,null,null,null,null,null,null,null,null,null,null,null,null,null,"Płocki","gostyniński",null,null,null,null,null,null,null,"słubicki","Rzepin"]
[null,null,null,null,null,null,null,null,null,null,null,null,null,null,null,null,"Płocki","płocki",null,null,null,null,null,null,null,"słubicki","Słubice"]
[null,null,null,null,null,null,null,null,null,null,null,null,null,null,null,null,"Płocki","sierpecki",null,null,null,null,null,null,null,"strzelecko-drezdenecki","Dobiegniew"]
[null,null,null,null,null,null,null,null,null,null,null,null,null,null,null,null,"Płocki","Płock",null,null,null,null,null,null,null,"strzelecko-drezdenecki","Drezdenko"]
[null,null,null,null,null,null,null,null,null,null,null,null,null,null,null,null,"Siedlecki","garwoliński",null,null,null,null,null,null,null,"strzelecko-drezdenecki","Stare Kurowo"]
[null,null,null,null,null,null,null,null,null,null,null,null,null,null,null,null,"Siedlecki","łosicki",null,null,null,null,null,null,null,"strzelecko-drezdenecki","Strzelce Krajeńskie"]
[null,null,null,null,null,null,null,null,null,null,null,null,null,null,null,null,"Siedlecki","siedlecki",null,null,null,null,null,null,null,"strzelecko-drezdenecki","Zwierzyn"]
[null,null,null,null,null,null,null,null,null,null,null,null,null,null,null,null,"Siedlecki","sokołowski",null,null,null,null,null,null,null,"sulęciński","Krzeszyce"]
[null,null,null,null,null,null,null,null,null,null,null,null,null,null,null,null,"Siedlecki","węgrowski",null,null,null,null,null,null,null,"sulęciński","Lubniewice"]
[null,null,null,null,null,null,null,null,null,null,null,null,null,null,null,null,"Siedlecki","Siedlce",null,null,null,null,null,null,null,"sulęciński","Słońsk"]
[null,null,null,null,null,null,null,null,null,null,null,null,null,null,null,null,"Żyrardowski","grójecki",null,null,null,null,null,null,null,"sulęciński","Sulęcin"]
[null,null,null,null,null,null,null,null,null,null,null,null,null,null,null,null,"Żyrardowski","sochaczewski",null,null,null,null,null,null,null,"sulęciński","Torzym"]
[null,null,null,null,null,null,null,null,null,null,null,null,null,null,null,null,"Żyrardowski","żyrardowski",null,null,null,null,null,null,null,"Gorzów Wielkopolski","Gorzów Wielkopolski"]
[null,null,null,null,null,null,null,null,null,null,null,null,null,null,null,null,null,null,null,null,null,null,null,null,null,"krośnieński","Gubin"]
[null,null,null,null,null,null,null,null,null,null,null,null,null,null,null,null,null,null,null,null,null,null,null,null,null,"krośnieński","Bobrowice"]
[null,null,null,null,null,null,null,null,null,null,null,null,null,null,null,null,null,null,null,null,null,null,null,null,null,"krośnieński","Bytnica"]
[null,null,null,null,null,null,null,null,null,null,null,null,null,null,null,null,null,null,null,null,null,null,null,null,null,"krośnieński","Dąbie"]
[null,null,null,null,null,null,null,null,null,null,null,null,null,null,null,null,null,null,null,null,null,null,null,null,null,"krośnieński","Krosno Odrzańskie"]
[null,null,null,null,null,null,null,null,null,null,null,null,null,null,null,null,null,null,null,null,null,null,null,null,null,"krośnieński","Maszewo"]
[null,null,null,null,null,null,null,null,null,null,null,null,null,null,null,null,null,null,null,null,null,null,null,null,null,"nowosolski","Nowa Sól"]
[null,null,null,null,null,null,null,null,null,null,null,null,null,null,null,null,null,null,null,null,null,null,null,null,null,"nowosolski","Bytom Odrzański"]
[null,null,null,null,null,null,null,null,null,null,null,null,null,null,null,null,null,null,null,null,null,null,null,null,null,"nowosolski","Kolsko"]
[null,null,null,null,null,null,null,null,null,null,null,null,null,null,null,null,null,null,null,null,null,null,null,null,null,"nowosolski","Kożuchów"]
[null,null,null,null,null,null,null,null,null,null,null,null,null,null,null,null,null,null,null,null,null,null,null,null,null,"nowosolski","Nowa Sól"]
[null,null,null,null,null,null,null,null,null,null,null,null,null,null,null,null,null,null,null,null,null,null,null,null,null,"nowosolski","Nowe Miasteczko"]
[null,null,null,null,null,null,null,null,null,null,null,null,null,null,null,null,null,null,null,null,null,null,null,null,null,"nowosolski","Otyń"]
[null,null,null,null,null,null,null,null,null,null,null,null,null,null,null,null,null,null,null,null,null,null,null,null,null,"nowosolski","Siedlisko"]
[null,null,null,null,null,null,null,null,null,null,null,null,null,null,null,null,null,null,null,null,null,null,null,null,null,"świebodziński","Lubrza"]
[null,null,null,null,null,null,null,null,null,null,null,null,null,null,null,null,null,null,null,null,null,null,null,null,null,"świebodziński","Łagów"]
[null,null,null,null,null,null,null,null,null,null,null,null,null,null,null,null,null,null,null,null,null,null,null,null,null,"świebodziński","Skąpe"]
[null,null,null,null,null,null,null,null,null,null,null,null,null,null,null,null,null,null,null,null,null,null,null,null,null,"świebodziński","Szczaniec"]
[null,null,null,null,null,null,null,null,null,null,null,null,null,null,null,null,null,null,null,null,null,null,null,null,null,"świebodziński","Świebodzin"]
[null,null,null,null,null,null,null,null,null,null,null,null,null,null,null,null,null,null,null,null,null,null,null,null,null,"świebodziński","Zbąszynek"]
[null,null,null,null,null,null,null,null,null,null,null,null,null,null,null,null,null,null,null,null,null,null,null,null,null,"zielonogórski","Babimost"]
[null,null,null,null,null,null,null,null,null,null,null,null,null,null,null,null,null,null,null,null,null,null,null,null,null,"zielonogórski","Bojadła"]
[null,null,null,null,null,null,null,null,null,null,null,null,null,null,null,null,null,null,null,null,null,null,null,null,null,"zielonogórski","Czerwieńsk"]
[null,null,null,null,null,null,null,null,null,null,null,null,null,null,null,null,null,null,null,null,null,null,null,null,null,"zielonogórski","Kargowa"]
[null,null,null,null,null,null,null,null,null,null,null,null,null,null,null,null,null,null,null,null,null,null,null,null,null,"zielonogórski","Nowogród Bobrzański"]
[null,null,null,null,null,null,null,null,null,null,null,null,null,null,null,null,null,null,null,null,null,null,null,null,null,"zielonogórski","Sulechów"]
[null,null,null,null,null,null,null,null,null,null,null,null,null,null,null,null,null,null,null,null,null,null,null,null,null,"zielonogórski","Świdnica"]
[null,null,null,null,null,null,null,null,null,null,null,null,null,null,null,null,null,null,null,null,null,null,null,null,null,"zielonogórski","Trzebiechów"]
[null,null,null,null,null,null,null,null,null,null,null,null,null,null,null,null,null,null,null,null,null,null,null,null,null,"zielonogórski","Zabór"]
[null,null,null,null,null,null,null,null,null,null,null,null,null,null,null,null,null,null,null,null,null,null,null,null,null,"żagański","Gozdnica"]
[null,null,null,null,null,null,null,null,null,null,null,null,null,null,null,null,null,null,null,null,null,null,null,null,null,"żagański","Żagań"]
[null,null,null,null,null,null,null,null,null,null,null,null,null,null,null,null,null,null,null,null,null,null,null,null,null,"żagański","Brzeźnica"]
[null,null,null,null,null,null,null,null,null,null,null,null,null,null,null,null,null,null,null,null,null,null,null,null,null,"żagański","Iłowa"]
[null,null,null,null,null,null,null,null,null,null,null,null,null,null,null,null,null,null,null,null,null,null,null,null,null,"żagański","Małomice"]
[null,null,null,null,null,null,null,null,null,null,null,null,null,null,null,null,null,null,null,null,null,null,null,null,null,"żagański","Niegosławice"]
[null,null,null,null,null,null,null,null,null,null,null,null,null,null,null,null,null,null,null,null,null,null,null,null,null,"żagański","Szprotawa"]
[null,null,null,null,null,null,null,null,null,null,null,null,null,null,null,null,null,null,null,null,null,null,null,null,null,"żagański","Wymiarki"]
[null,null,null,null,null,null,null,null,null,null,null,null,null,null,null,null,null,null,null,null,null,null,null,null,null,"żagański","Żagań"]
[null,null,null,null,null,null,null,null,null,null,null,null,null,null,null,null,null,null,null,null,null,null,null,null,null,"żarski","Łęknica"]
[null,null,null,null,null,null,null,null,null,null,null,null,null,null,null,null,null,null,null,null,null,null,null,null,null,"żarski","Żary"]
[null,null,null,null,null,null,null,null,null,null,null,null,null,null,null,null,null,null,null,null,null,null,null,null,null,"żarski","Brody"]
[null,null,null,null,null,null,null,null,null,null,null,null,null,null,null,null,null,null,null,null,null,null,null,null,null,"żarski","Jasień"]
[null,null,null,null,null,null,null,null,null,null,null,null,null,null,null,null,null,null,null,null,null,null,null,null,null,"żarski","Lipinki Łużyckie"]
[null,null,null,null,null,null,null,null,null,null,null,null,null,null,null,null,null,null,null,null,null,null,null,null,null,"żarski","Lubsko"]
[null,null,null,null,null,null,null,null,null,null,null,null,null,null,null,null,null,null,null,null,null,null,null,null,null,"żarski","Przewóz"]
[null,null,null,null,null,null,null,null,null,null,null,null,null,null,null,null,null,null,null,null,null,null,null,null,null,"żarski","Trzebiel"]
[null,null,null,null,null,null,null,null,null,null,null,null,null,null,null,null,null,null,null,null,null,null,null,null,null,"żarski","Tuplice"]
[null,null,null,null,null,null,null,null,null,null,null,null,null,null,null,null,null,null,null,null,null,null,null,null,null,"żarski","Żary"]
[null,null,null,null,null,null,null,null,null,null,null,null,null,null,null,null,null,null,null,null,null,null,null,null,null,"wschowski","Sława"]
[null,null,null,null,null,null,null,null,null,null,null,null,null,null,null,null,null,null,null,null,null,null,null,null,null,"wschowski","Szlichtyngowa"]
[null,null,null,null,null,null,null,null,null,null,null,null,null,null,null,null,null,null,null,null,null,null,null,null,null,"wschowski","Wschowa"]
[null,null,null,null,null,null,null,null,null,null,null,null,null,null,null,null,null,null,null,null,null,null,null,null,null,"Zielona Góra","Zielona Góra"]
[null,null,null,null,null,null,null,null,null,null,null,null,null,null,null,null,null,null,null,null,null,null,null,null,null,"jarociński","Jaraczewo"]
[null,null,null,null,null,null,null,null,null,null,null,null,null,null,null,null,null,null,null,null,null,null,null,null,null,"jarociński","Jarocin"]
[null,null,null,null,null,null,null,null,null,null,null,null,null,null,null,null,null,null,null,null,null,null,null,null,null,"jarociński","Kotlin"]
[null,null,null,null,null,null,null,null,null,null,null,null,null,null,null,null,null,null,null,null,null,null,null,null,null,"jarociński","Żerków"]
[null,null,null,null,null,null,null,null,null,null,null,null,null,null,null,null,null,null,null,null,null,null,null,null,null,"kaliski","Blizanów"]
[null,null,null,null,null,null,null,null,null,null,null,null,null,null,null,null,null,null,null,null,null,null,null,null,null,"kaliski","Brzeziny"]
[null,null,null,null,null,null,null,null,null,null,null,null,null,null,null,null,null,null,null,null,null,null,null,null,null,"kaliski","Ceków-Kolonia"]
[null,null,null,null,null,null,null,null,null,null,null,null,null,null,null,null,null,null,null,null,null,null,null,null,null,"kaliski","Godziesze Wielkie"]
[null,null,null,null,null,null,null,null,null,null,null,null,null,null,null,null,null,null,null,null,null,null,null,null,null,"kaliski","Koźminek"]
[null,null,null,null,null,null,null,null,null,null,null,null,null,null,null,null,null,null,null,null,null,null,null,null,null,"kaliski","Lisków"]
[null,null,null,null,null,null,null,null,null,null,null,null,null,null,null,null,null,null,null,null,null,null,null,null,null,"kaliski","Mycielin"]
[null,null,null,null,null,null,null,null,null,null,null,null,null,null,null,null,null,null,null,null,null,null,null,null,null,"kaliski","Opatówek"]
[null,null,null,null,null,null,null,null,null,null,null,null,null,null,null,null,null,null,null,null,null,null,null,null,null,"kaliski","Stawiszyn"]
[null,null,null,null,null,null,null,null,null,null,null,null,null,null,null,null,null,null,null,null,null,null,null,null,null,"kaliski","Szczytniki"]
[null,null,null,null,null,null,null,null,null,null,null,null,null,null,null,null,null,null,null,null,null,null,null,null,null,"kaliski","Żelazków"]
[null,null,null,null,null,null,null,null,null,null,null,null,null,null,null,null,null,null,null,null,null,null,null,null,null,"kępiński","Baranów"]
[null,null,null,null,null,null,null,null,null,null,null,null,null,null,null,null,null,null,null,null,null,null,null,null,null,"kępiński","Bralin"]
[null,null,null,null,null,null,null,null,null,null,null,null,null,null,null,null,null,null,null,null,null,null,null,null,null,"kępiński","Kępno"]
[null,null,null,null,null,null,null,null,null,null,null,null,null,null,null,null,null,null,null,null,null,null,null,null,null,"kępiński","Łęka Opatowska"]
[null,null,null,null,null,null,null,null,null,null,null,null,null,null,null,null,null,null,null,null,null,null,null,null,null,"kępiński","Perzów"]
[null,null,null,null,null,null,null,null,null,null,null,null,null,null,null,null,null,null,null,null,null,null,null,null,null,"kępiński","Rychtal"]
[null,null,null,null,null,null,null,null,null,null,null,null,null,null,null,null,null,null,null,null,null,null,null,null,null,"kępiński","Trzcinica"]
[null,null,null,null,null,null,null,null,null,null,null,null,null,null,null,null,null,null,null,null,null,null,null,null,null,"krotoszyński","Sulmierzyce"]
[null,null,null,null,null,null,null,null,null,null,null,null,null,null,null,null,null,null,null,null,null,null,null,null,null,"krotoszyński","Kobylin"]
[null,null,null,null,null,null,null,null,null,null,null,null,null,null,null,null,null,null,null,null,null,null,null,null,null,"krotoszyński","Koźmin Wielkopolski"]
[null,null,null,null,null,null,null,null,null,null,null,null,null,null,null,null,null,null,null,null,null,null,null,null,null,"krotoszyński","Krotoszyn"]
[null,null,null,null,null,null,null,null,null,null,null,null,null,null,null,null,null,null,null,null,null,null,null,null,null,"krotoszyński","Rozdrażew"]
[null,null,null,null,null,null,null,null,null,null,null,null,null,null,null,null,null,null,null,null,null,null,null,null,null,"krotoszyński","Zduny"]
[null,null,null,null,null,null,null,null,null,null,null,null,null,null,null,null,null,null,null,null,null,null,null,null,null,"ostrowski","Ostrów Wielkopolski"]
[null,null,null,null,null,null,null,null,null,null,null,null,null,null,null,null,null,null,null,null,null,null,null,null,null,"ostrowski","Nowe Skalmierzyce"]
[null,null,null,null,null,null,null,null,null,null,null,null,null,null,null,null,null,null,null,null,null,null,null,null,null,"ostrowski","Odolanów"]
[null,null,null,null,null,null,null,null,null,null,null,null,null,null,null,null,null,null,null,null,null,null,null,null,null,"ostrowski","Ostrów Wielkopolski"]
[null,null,null,null,null,null,null,null,null,null,null,null,null,null,null,null,null,null,null,null,null,null,null,null,null,"ostrowski","Przygodzice"]
[null,null,null,null,null,null,null,null,null,null,null,null,null,null,null,null,null,null,null,null,null,null,null,null,null,"ostrowski","Raszków"]
[null,null,null,null,null,null,null,null,null,null,null,null,null,null,null,null,null,null,null,null,null,null,null,null,null,"ostrowski","Sieroszewice"]
[null,null,null,null,null,null,null,null,null,null,null,null,null,null,null,null,null,null,null,null,null,null,null,null,null,"ostrowski","Sośnie"]
[null,null,null,null,null,null,null,null,null,null,null,null,null,null,null,null,null,null,null,null,null,null,null,null,null,"ostrzeszowski","Czajków"]
[null,null,null,null,null,null,null,null,null,null,null,null,null,null,null,null,null,null,null,null,null,null,null,null,null,"ostrzeszowski","Doruchów"]
[null,null,null,null,null,null,null,null,null,null,null,null,null,null,null,null,null,null,null,null,null,null,null,null,null,"ostrzeszowski","Grabów nad Prosną"]
[null,null,null,null,null,null,null,null,null,null,null,null,null,null,null,null,null,null,null,null,null,null,null,null,null,"ostrzeszowski","Kobyla Góra"]
[null,null,null,null,null,null,null,null,null,null,null,null,null,null,null,null,null,null,null,null,null,null,null,null,null,"ostrzeszowski","Kraszewice"]
[null,null,null,null,null,null,null,null,null,null,null,null,null,null,null,null,null,null,null,null,null,null,null,null,null,"ostrzeszowski","Mikstat"]
[null,null,null,null,null,null,null,null,null,null,null,null,null,null,null,null,null,null,null,null,null,null,null,null,null,"ostrzeszowski","Ostrzeszów"]
[null,null,null,null,null,null,null,null,null,null,null,null,null,null,null,null,null,null,null,null,null,null,null,null,null,"pleszewski","Chocz"]
[null,null,null,null,null,null,null,null,null,null,null,null,null,null,null,null,null,null,null,null,null,null,null,null,null,"pleszewski","Czermin"]
[null,null,null,null,null,null,null,null,null,null,null,null,null,null,null,null,null,null,null,null,null,null,null,null,null,"pleszewski","Dobrzyca"]
[null,null,null,null,null,null,null,null,null,null,null,null,null,null,null,null,null,null,null,null,null,null,null,null,null,"pleszewski","Gizałki"]
[null,null,null,null,null,null,null,null,null,null,null,null,null,null,null,null,null,null,null,null,null,null,null,null,null,"pleszewski","Gołuchów"]
[null,null,null,null,null,null,null,null,null,null,null,null,null,null,null,null,null,null,null,null,null,null,null,null,null,"pleszewski","Pleszew"]
[null,null,null,null,null,null,null,null,null,null,null,null,null,null,null,null,null,null,null,null,null,null,null,null,null,"Kalisz","Kalisz"]
[null,null,null,null,null,null,null,null,null,null,null,null,null,null,null,null,null,null,null,null,null,null,null,null,null,"gnieźnieński","Gniezno"]
[null,null,null,null,null,null,null,null,null,null,null,null,null,null,null,null,null,null,null,null,null,null,null,null,null,"gnieźnieński","Czerniejewo"]
[null,null,null,null,null,null,null,null,null,null,null,null,null,null,null,null,null,null,null,null,null,null,null,null,null,"gnieźnieński","Gniezno"]
[null,null,null,null,null,null,null,null,null,null,null,null,null,null,null,null,null,null,null,null,null,null,null,null,null,"gnieźnieński","Kiszkowo"]
[null,null,null,null,null,null,null,null,null,null,null,null,null,null,null,null,null,null,null,null,null,null,null,null,null,"gnieźnieński","Kłecko"]
[null,null,null,null,null,null,null,null,null,null,null,null,null,null,null,null,null,null,null,null,null,null,null,null,null,"gnieźnieński","Łubowo"]
[null,null,null,null,null,null,null,null,null,null,null,null,null,null,null,null,null,null,null,null,null,null,null,null,null,"gnieźnieński","Mieleszyn"]
[null,null,null,null,null,null,null,null,null,null,null,null,null,null,null,null,null,null,null,null,null,null,null,null,null,"gnieźnieński","Niechanowo"]
[null,null,null,null,null,null,null,null,null,null,null,null,null,null,null,null,null,null,null,null,null,null,null,null,null,"gnieźnieński","Trzemeszno"]
[null,null,null,null,null,null,null,null,null,null,null,null,null,null,null,null,null,null,null,null,null,null,null,null,null,"gnieźnieński","Witkowo"]
[null,null,null,null,null,null,null,null,null,null,null,null,null,null,null,null,null,null,null,null,null,null,null,null,null,"kolski","Koło"]
[null,null,null,null,null,null,null,null,null,null,null,null,null,null,null,null,null,null,null,null,null,null,null,null,null,"kolski","Babiak"]
[null,null,null,null,null,null,null,null,null,null,null,null,null,null,null,null,null,null,null,null,null,null,null,null,null,"kolski","Chodów"]
[null,null,null,null,null,null,null,null,null,null,null,null,null,null,null,null,null,null,null,null,null,null,null,null,null,"kolski","Dąbie"]
[null,null,null,null,null,null,null,null,null,null,null,null,null,null,null,null,null,null,null,null,null,null,null,null,null,"kolski","Grzegorzew"]
[null,null,null,null,null,null,null,null,null,null,null,null,null,null,null,null,null,null,null,null,null,null,null,null,null,"kolski","Kłodawa"]
[null,null,null,null,null,null,null,null,null,null,null,null,null,null,null,null,null,null,null,null,null,null,null,null,null,"kolski","Koło"]
[null,null,null,null,null,null,null,null,null,null,null,null,null,null,null,null,null,null,null,null,null,null,null,null,null,"kolski","Kościelec"]
[null,null,null,null,null,null,null,null,null,null,null,null,null,null,null,null,null,null,null,null,null,null,null,null,null,"kolski","Olszówka"]
[null,null,null,null,null,null,null,null,null,null,null,null,null,null,null,null,null,null,null,null,null,null,null,null,null,"kolski","Osiek Mały"]
[null,null,null,null,null,null,null,null,null,null,null,null,null,null,null,null,null,null,null,null,null,null,null,null,null,"kolski","Przedecz"]
[null,null,null,null,null,null,null,null,null,null,null,null,null,null,null,null,null,null,null,null,null,null,null,null,null,"koniński","Golina"]
[null,null,null,null,null,null,null,null,null,null,null,null,null,null,null,null,null,null,null,null,null,null,null,null,null,"koniński","Grodziec"]
[null,null,null,null,null,null,null,null,null,null,null,null,null,null,null,null,null,null,null,null,null,null,null,null,null,"koniński","Kazimierz Biskupi"]
[null,null,null,null,null,null,null,null,null,null,null,null,null,null,null,null,null,null,null,null,null,null,null,null,null,"koniński","Kleczew"]
[null,null,null,null,null,null,null,null,null,null,null,null,null,null,null,null,null,null,null,null,null,null,null,null,null,"koniński","Kramsk"]
[null,null,null,null,null,null,null,null,null,null,null,null,null,null,null,null,null,null,null,null,null,null,null,null,null,"koniński","Krzymów"]
[null,null,null,null,null,null,null,null,null,null,null,null,null,null,null,null,null,null,null,null,null,null,null,null,null,"koniński","Rychwał"]
[null,null,null,null,null,null,null,null,null,null,null,null,null,null,null,null,null,null,null,null,null,null,null,null,null,"koniński","Rzgów"]
[null,null,null,null,null,null,null,null,null,null,null,null,null,null,null,null,null,null,null,null,null,null,null,null,null,"koniński","Skulsk"]
[null,null,null,null,null,null,null,null,null,null,null,null,null,null,null,null,null,null,null,null,null,null,null,null,null,"koniński","Sompolno"]
[null,null,null,null,null,null,null,null,null,null,null,null,null,null,null,null,null,null,null,null,null,null,null,null,null,"koniński","Stare Miasto"]
[null,null,null,null,null,null,null,null,null,null,null,null,null,null,null,null,null,null,null,null,null,null,null,null,null,"koniński","Ślesin"]
[null,null,null,null,null,null,null,null,null,null,null,null,null,null,null,null,null,null,null,null,null,null,null,null,null,"koniński","Wierzbinek"]
[null,null,null,null,null,null,null,null,null,null,null,null,null,null,null,null,null,null,null,null,null,null,null,null,null,"koniński","Wilczyn"]
[null,null,null,null,null,null,null,null,null,null,null,null,null,null,null,null,null,null,null,null,null,null,null,null,null,"słupecki","Słupca"]
[null,null,null,null,null,null,null,null,null,null,null,null,null,null,null,null,null,null,null,null,null,null,null,null,null,"słupecki","Lądek"]
[null,null,null,null,null,null,null,null,null,null,null,null,null,null,null,null,null,null,null,null,null,null,null,null,null,"słupecki","Orchowo"]
[null,null,null,null,null,null,null,null,null,null,null,null,null,null,null,null,null,null,null,null,null,null,null,null,null,"słupecki","Ostrowite"]
[null,null,null,null,null,null,null,null,null,null,null,null,null,null,null,null,null,null,null,null,null,null,null,null,null,"słupecki","Powidz"]
[null,null,null,null,null,null,null,null,null,null,null,null,null,null,null,null,null,null,null,null,null,null,null,null,null,"słupecki","Słupca"]
[null,null,null,null,null,null,null,null,null,null,null,null,null,null,null,null,null,null,null,null,null,null,null,null,null,"słupecki","Strzałkowo"]
[null,null,null,null,null,null,null,null,null,null,null,null,null,null,null,null,null,null,null,null,null,null,null,null,null,"słupecki","Zagórów"]
[null,null,null,null,null,null,null,null,null,null,null,null,null,null,null,null,null,null,null,null,null,null,null,null,null,"turecki","Turek"]
[null,null,null,null,null,null,null,null,null,null,null,null,null,null,null,null,null,null,null,null,null,null,null,null,null,"turecki","Brudzew"]
[null,null,null,null,null,null,null,null,null,null,null,null,null,null,null,null,null,null,null,null,null,null,null,null,null,"turecki","Dobra"]
[null,null,null,null,null,null,null,null,null,null,null,null,null,null,null,null,null,null,null,null,null,null,null,null,null,"turecki","Kawęczyn"]
[null,null,null,null,null,null,null,null,null,null,null,null,null,null,null,null,null,null,null,null,null,null,null,null,null,"turecki","Malanów"]
[null,null,null,null,null,null,null,null,null,null,null,null,null,null,null,null,null,null,null,null,null,null,null,null,null,"turecki","Przykona"]
[null,null,null,null,null,null,null,null,null,null,null,null,null,null,null,null,null,null,null,null,null,null,null,null,null,"turecki","Tuliszków"]
[null,null,null,null,null,null,null,null,null,null,null,null,null,null,null,null,null,null,null,null,null,null,null,null,null,"turecki","Turek"]
[null,null,null,null,null,null,null,null,null,null,null,null,null,null,null,null,null,null,null,null,null,null,null,null,null,"turecki","Władysławów"]
[null,null,null,null,null,null,null,null,null,null,null,null,null,null,null,null,null,null,null,null,null,null,null,null,null,"wrzesiński","Kołaczkowo"]
[null,null,null,null,null,null,null,null,null,null,null,null,null,null,null,null,null,null,null,null,null,null,null,null,null,"wrzesiński","Miłosław"]
[null,null,null,null,null,null,null,null,null,null,null,null,null,null,null,null,null,null,null,null,null,null,null,null,null,"wrzesiński","Nekla"]
[null,null,null,null,null,null,null,null,null,null,null,null,null,null,null,null,null,null,null,null,null,null,null,null,null,"wrzesiński","Pyzdry"]
[null,null,null,null,null,null,null,null,null,null,null,null,null,null,null,null,null,null,null,null,null,null,null,null,null,"wrzesiński","Września"]
[null,null,null,null,null,null,null,null,null,null,null,null,null,null,null,null,null,null,null,null,null,null,null,null,null,"Konin","Konin"]
[null,null,null,null,null,null,null,null,null,null,null,null,null,null,null,null,null,null,null,null,null,null,null,null,null,"gostyński","Borek Wielkopolski"]
[null,null,null,null,null,null,null,null,null,null,null,null,null,null,null,null,null,null,null,null,null,null,null,null,null,"gostyński","Gostyń"]
[null,null,null,null,null,null,null,null,null,null,null,null,null,null,null,null,null,null,null,null,null,null,null,null,null,"gostyński","Krobia"]
[null,null,null,null,null,null,null,null,null,null,null,null,null,null,null,null,null,null,null,null,null,null,null,null,null,"gostyński","Pępowo"]
[null,null,null,null,null,null,null,null,null,null,null,null,null,null,null,null,null,null,null,null,null,null,null,null,null,"gostyński","Piaski"]
[null,null,null,null,null,null,null,null,null,null,null,null,null,null,null,null,null,null,null,null,null,null,null,null,null,"gostyński","Pogorzela"]
[null,null,null,null,null,null,null,null,null,null,null,null,null,null,null,null,null,null,null,null,null,null,null,null,null,"gostyński","Poniec"]
[null,null,null,null,null,null,null,null,null,null,null,null,null,null,null,null,null,null,null,null,null,null,null,null,null,"grodziski","Granowo"]
[null,null,null,null,null,null,null,null,null,null,null,null,null,null,null,null,null,null,null,null,null,null,null,null,null,"grodziski","Grodzisk Wielkopolski"]
[null,null,null,null,null,null,null,null,null,null,null,null,null,null,null,null,null,null,null,null,null,null,null,null,null,"grodziski","Kamieniec"]
[null,null,null,null,null,null,null,null,null,null,null,null,null,null,null,null,null,null,null,null,null,null,null,null,null,"grodziski","Rakoniewice"]
[null,null,null,null,null,null,null,null,null,null,null,null,null,null,null,null,null,null,null,null,null,null,null,null,null,"grodziski","Wielichowo"]
[null,null,null,null,null,null,null,null,null,null,null,null,null,null,null,null,null,null,null,null,null,null,null,null,null,"kościański","Kościan"]
[null,null,null,null,null,null,null,null,null,null,null,null,null,null,null,null,null,null,null,null,null,null,null,null,null,"kościański","Czempiń"]
[null,null,null,null,null,null,null,null,null,null,null,null,null,null,null,null,null,null,null,null,null,null,null,null,null,"kościański","Kościan"]
[null,null,null,null,null,null,null,null,null,null,null,null,null,null,null,null,null,null,null,null,null,null,null,null,null,"kościański","Krzywiń"]
[null,null,null,null,null,null,null,null,null,null,null,null,null,null,null,null,null,null,null,null,null,null,null,null,null,"kościański","Śmigiel"]
[null,null,null,null,null,null,null,null,null,null,null,null,null,null,null,null,null,null,null,null,null,null,null,null,null,"leszczyński","Krzemieniewo"]
[null,null,null,null,null,null,null,null,null,null,null,null,null,null,null,null,null,null,null,null,null,null,null,null,null,"leszczyński","Lipno"]
[null,null,null,null,null,null,null,null,null,null,null,null,null,null,null,null,null,null,null,null,null,null,null,null,null,"leszczyński","Osieczna"]
[null,null,null,null,null,null,null,null,null,null,null,null,null,null,null,null,null,null,null,null,null,null,null,null,null,"leszczyński","Rydzyna"]
[null,null,null,null,null,null,null,null,null,null,null,null,null,null,null,null,null,null,null,null,null,null,null,null,null,"leszczyński","Święciechowa"]
[null,null,null,null,null,null,null,null,null,null,null,null,null,null,null,null,null,null,null,null,null,null,null,null,null,"leszczyński","Wijewo"]
[null,null,null,null,null,null,null,null,null,null,null,null,null,null,null,null,null,null,null,null,null,null,null,null,null,"leszczyński","Włoszakowice"]
[null,null,null,null,null,null,null,null,null,null,null,null,null,null,null,null,null,null,null,null,null,null,null,null,null,"międzychodzki","Chrzypsko Wielkie"]
[null,null,null,null,null,null,null,null,null,null,null,null,null,null,null,null,null,null,null,null,null,null,null,null,null,"międzychodzki","Kwilcz"]
[null,null,null,null,null,null,null,null,null,null,null,null,null,null,null,null,null,null,null,null,null,null,null,null,null,"międzychodzki","Międzychód"]
[null,null,null,null,null,null,null,null,null,null,null,null,null,null,null,null,null,null,null,null,null,null,null,null,null,"międzychodzki","Sieraków"]
[null,null,null,null,null,null,null,null,null,null,null,null,null,null,null,null,null,null,null,null,null,null,null,null,null,"nowotomyski","Kuślin"]
[null,null,null,null,null,null,null,null,null,null,null,null,null,null,null,null,null,null,null,null,null,null,null,null,null,"nowotomyski","Lwówek"]
[null,null,null,null,null,null,null,null,null,null,null,null,null,null,null,null,null,null,null,null,null,null,null,null,null,"nowotomyski","Miedzichowo"]
[null,null,null,null,null,null,null,null,null,null,null,null,null,null,null,null,null,null,null,null,null,null,null,null,null,"nowotomyski","Nowy Tomyśl"]
[null,null,null,null,null,null,null,null,null,null,null,null,null,null,null,null,null,null,null,null,null,null,null,null,null,"nowotomyski","Opalenica"]
[null,null,null,null,null,null,null,null,null,null,null,null,null,null,null,null,null,null,null,null,null,null,null,null,null,"nowotomyski","Zbąszyń"]
[null,null,null,null,null,null,null,null,null,null,null,null,null,null,null,null,null,null,null,null,null,null,null,null,null,"rawicki","Bojanowo"]
[null,null,null,null,null,null,null,null,null,null,null,null,null,null,null,null,null,null,null,null,null,null,null,null,null,"rawicki","Jutrosin"]
[null,null,null,null,null,null,null,null,null,null,null,null,null,null,null,null,null,null,null,null,null,null,null,null,null,"rawicki","Miejska Górka"]
[null,null,null,null,null,null,null,null,null,null,null,null,null,null,null,null,null,null,null,null,null,null,null,null,null,"rawicki","Pakosław"]
[null,null,null,null,null,null,null,null,null,null,null,null,null,null,null,null,null,null,null,null,null,null,null,null,null,"rawicki","Rawicz"]
[null,null,null,null,null,null,null,null,null,null,null,null,null,null,null,null,null,null,null,null,null,null,null,null,null,"wolsztyński","Przemęt"]
[null,null,null,null,null,null,null,null,null,null,null,null,null,null,null,null,null,null,null,null,null,null,null,null,null,"wolsztyński","Siedlec"]
[null,null,null,null,null,null,null,null,null,null,null,null,null,null,null,null,null,null,null,null,null,null,null,null,null,"wolsztyński","Wolsztyn"]
[null,null,null,null,null,null,null,null,null,null,null,null,null,null,null,null,null,null,null,null,null,null,null,null,null,"Leszno","Leszno"]
[null,null,null,null,null,null,null,null,null,null,null,null,null,null,null,null,null,null,null,null,null,null,null,null,null,"chodzieski","Chodzież"]
[null,null,null,null,null,null,null,null,null,null,null,null,null,null,null,null,null,null,null,null,null,null,null,null,null,"chodzieski","Budzyń"]
[null,null,null,null,null,null,null,null,null,null,null,null,null,null,null,null,null,null,null,null,null,null,null,null,null,"chodzieski","Chodzież"]
[null,null,null,null,null,null,null,null,null,null,null,null,null,null,null,null,null,null,null,null,null,null,null,null,null,"chodzieski","Margonin"]
[null,null,null,null,null,null,null,null,null,null,null,null,null,null,null,null,null,null,null,null,null,null,null,null,null,"chodzieski","Szamocin"]
[null,null,null,null,null,null,null,null,null,null,null,null,null,null,null,null,null,null,null,null,null,null,null,null,null,"czarnkowsko-trzcianecki","Czarnków"]
[null,null,null,null,null,null,null,null,null,null,null,null,null,null,null,null,null,null,null,null,null,null,null,null,null,"czarnkowsko-trzcianecki","Drawsko"]
[null,null,null,null,null,null,null,null,null,null,null,null,null,null,null,null,null,null,null,null,null,null,null,null,null,"czarnkowsko-trzcianecki","Krzyż Wielkopolski"]
[null,null,null,null,null,null,null,null,null,null,null,null,null,null,null,null,null,null,null,null,null,null,null,null,null,"czarnkowsko-trzcianecki","Lubasz"]
[null,null,null,null,null,null,null,null,null,null,null,null,null,null,null,null,null,null,null,null,null,null,null,null,null,"czarnkowsko-trzcianecki","Połajewo"]
[null,null,null,null,null,null,null,null,null,null,null,null,null,null,null,null,null,null,null,null,null,null,null,null,null,"czarnkowsko-trzcianecki","Trzcianka"]
[null,null,null,null,null,null,null,null,null,null,null,null,null,null,null,null,null,null,null,null,null,null,null,null,null,"czarnkowsko-trzcianecki","Wieleń"]
[null,null,null,null,null,null,null,null,null,null,null,null,null,null,null,null,null,null,null,null,null,null,null,null,null,"pilski","Piła"]
[null,null,null,null,null,null,null,null,null,null,null,null,null,null,null,null,null,null,null,null,null,null,null,null,null,"pilski","Białośliwie"]
[null,null,null,null,null,null,null,null,null,null,null,null,null,null,null,null,null,null,null,null,null,null,null,null,null,"pilski","Kaczory"]
[null,null,null,null,null,null,null,null,null,null,null,null,null,null,null,null,null,null,null,null,null,null,null,null,null,"pilski","Łobżenica"]
[null,null,null,null,null,null,null,null,null,null,null,null,null,null,null,null,null,null,null,null,null,null,null,null,null,"pilski","Miasteczko Krajeńskie"]
[null,null,null,null,null,null,null,null,null,null,null,null,null,null,null,null,null,null,null,null,null,null,null,null,null,"pilski","Szydłowo"]
[null,null,null,null,null,null,null,null,null,null,null,null,null,null,null,null,null,null,null,null,null,null,null,null,null,"pilski","Ujście"]
[null,null,null,null,null,null,null,null,null,null,null,null,null,null,null,null,null,null,null,null,null,null,null,null,null,"pilski","Wyrzysk"]
[null,null,null,null,null,null,null,null,null,null,null,null,null,null,null,null,null,null,null,null,null,null,null,null,null,"pilski","Wysoka"]
[null,null,null,null,null,null,null,null,null,null,null,null,null,null,null,null,null,null,null,null,null,null,null,null,null,"wągrowiecki","Wągrowiec"]
[null,null,null,null,null,null,null,null,null,null,null,null,null,null,null,null,null,null,null,null,null,null,null,null,null,"wągrowiecki","Damasławek"]
[null,null,null,null,null,null,null,null,null,null,null,null,null,null,null,null,null,null,null,null,null,null,null,null,null,"wągrowiecki","Gołańcz"]
[null,null,null,null,null,null,null,null,null,null,null,null,null,null,null,null,null,null,null,null,null,null,null,null,null,"wągrowiecki","Mieścisko"]
[null,null,null,null,null,null,null,null,null,null,null,null,null,null,null,null,null,null,null,null,null,null,null,null,null,"wągrowiecki","Skoki"]
[null,null,null,null,null,null,null,null,null,null,null,null,null,null,null,null,null,null,null,null,null,null,null,null,null,"wągrowiecki","Wapno"]
[null,null,null,null,null,null,null,null,null,null,null,null,null,null,null,null,null,null,null,null,null,null,null,null,null,"wągrowiecki","Wągrowiec"]
[null,null,null,null,null,null,null,null,null,null,null,null,null,null,null,null,null,null,null,null,null,null,null,null,null,"złotowski","Złotów"]
[null,null,null,null,null,null,null,null,null,null,null,null,null,null,null,null,null,null,null,null,null,null,null,null,null,"złotowski","Jastrowie"]
[null,null,null,null,null,null,null,null,null,null,null,null,null,null,null,null,null,null,null,null,null,null,null,null,null,"złotowski","Krajenka"]
[null,null,null,null,null,null,null,null,null,null,null,null,null,null,null,null,null,null,null,null,null,null,null,null,null,"złotowski","Lipka"]
[null,null,null,null,null,null,null,null,null,null,null,null,null,null,null,null,null,null,null,null,null,null,null,null,null,"złotowski","Okonek"]
[null,null,null,null,null,null,null,null,null,null,null,null,null,null,null,null,null,null,null,null,null,null,null,null,null,"złotowski","Tarnówka"]
[null,null,null,null,null,null,null,null,null,null,null,null,null,null,null,null,null,null,null,null,null,null,null,null,null,"złotowski","Zakrzewo"]
[null,null,null,null,null,null,null,null,null,null,null,null,null,null,null,null,null,null,null,null,null,null,null,null,null,"złotowski","Złotów"]
[null,null,null,null,null,null,null,null,null,null,null,null,null,null,null,null,null,null,null,null,null,null,null,null,null,"obornicki","Oborniki"]
[null,null,null,null,null,null,null,null,null,null,null,null,null,null,null,null,null,null,null,null,null,null,null,null,null,"obornicki","Rogoźno"]
[null,null,null,null,null,null,null,null,null,null,null,null,null,null,null,null,null,null,null,null,null,null,null,null,null,"obornicki","Ryczywół"]
[null,null,null,null,null,null,null,null,null,null,null,null,null,null,null,null,null,null,null,null,null,null,null,null,null,"poznański","Luboń"]
[null,null,null,null,null,null,null,null,null,null,null,null,null,null,null,null,null,null,null,null,null,null,null,null,null,"poznański","Puszczykowo"]
[null,null,null,null,null,null,null,null,null,null,null,null,null,null,null,null,null,null,null,null,null,null,null,null,null,"poznański","Buk"]
[null,null,null,null,null,null,null,null,null,null,null,null,null,null,null,null,null,null,null,null,null,null,null,null,null,"poznański","Czerwonak"]
[null,null,null,null,null,null,null,null,null,null,null,null,null,null,null,null,null,null,null,null,null,null,null,null,null,"poznański","Dopiewo"]
[null,null,null,null,null,null,null,null,null,null,null,null,null,null,null,null,null,null,null,null,null,null,null,null,null,"poznański","Kleszczewo"]
[null,null,null,null,null,null,null,null,null,null,null,null,null,null,null,null,null,null,null,null,null,null,null,null,null,"poznański","Komorniki"]
[null,null,null,null,null,null,null,null,null,null,null,null,null,null,null,null,null,null,null,null,null,null,null,null,null,"poznański","Kostrzyn"]
[null,null,null,null,null,null,null,null,null,null,null,null,null,null,null,null,null,null,null,null,null,null,null,null,null,"poznański","Kórnik"]
[null,null,null,null,null,null,null,null,null,null,null,null,null,null,null,null,null,null,null,null,null,null,null,null,null,"poznański","Mosina"]
[null,null,null,null,null,null,null,null,null,null,null,null,null,null,null,null,null,null,null,null,null,null,null,null,null,"poznański","Murowana Goślina"]
[null,null,null,null,null,null,null,null,null,null,null,null,null,null,null,null,null,null,null,null,null,null,null,null,null,"poznański","Pobiedziska"]
[null,null,null,null,null,null,null,null,null,null,null,null,null,null,null,null,null,null,null,null,null,null,null,null,null,"poznański","Rokietnica"]
[null,null,null,null,null,null,null,null,null,null,null,null,null,null,null,null,null,null,null,null,null,null,null,null,null,"poznański","Stęszew"]
[null,null,null,null,null,null,null,null,null,null,null,null,null,null,null,null,null,null,null,null,null,null,null,null,null,"poznański","Suchy Las"]
[null,null,null,null,null,null,null,null,null,null,null,null,null,null,null,null,null,null,null,null,null,null,null,null,null,"poznański","Swarzędz"]
[null,null,null,null,null,null,null,null,null,null,null,null,null,null,null,null,null,null,null,null,null,null,null,null,null,"poznański","Tarnowo Podgórne"]
[null,null,null,null,null,null,null,null,null,null,null,null,null,null,null,null,null,null,null,null,null,null,null,null,null,"szamotulski","Obrzycko"]
[null,null,null,null,null,null,null,null,null,null,null,null,null,null,null,null,null,null,null,null,null,null,null,null,null,"szamotulski","Duszniki"]
[null,null,null,null,null,null,null,null,null,null,null,null,null,null,null,null,null,null,null,null,null,null,null,null,null,"szamotulski","Kaźmierz"]
[null,null,null,null,null,null,null,null,null,null,null,null,null,null,null,null,null,null,null,null,null,null,null,null,null,"szamotulski","Obrzycko"]
[null,null,null,null,null,null,null,null,null,null,null,null,null,null,null,null,null,null,null,null,null,null,null,null,null,"szamotulski","Ostroróg"]
[null,null,null,null,null,null,null,null,null,null,null,null,null,null,null,null,null,null,null,null,null,null,null,null,null,"szamotulski","Pniewy"]
[null,null,null,null,null,null,null,null,null,null,null,null,null,null,null,null,null,null,null,null,null,null,null,null,null,"szamotulski","Szamotuły"]
[null,null,null,null,null,null,null,null,null,null,null,null,null,null,null,null,null,null,null,null,null,null,null,null,null,"szamotulski","Wronki"]
[null,null,null,null,null,null,null,null,null,null,null,null,null,null,null,null,null,null,null,null,null,null,null,null,null,"średzki","Dominowo"]
[null,null,null,null,null,null,null,null,null,null,null,null,null,null,null,null,null,null,null,null,null,null,null,null,null,"średzki","Krzykosy"]
[null,null,null,null,null,null,null,null,null,null,null,null,null,null,null,null,null,null,null,null,null,null,null,null,null,"średzki","Nowe Miasto nad Wartą"]
[null,null,null,null,null,null,null,null,null,null,null,null,null,null,null,null,null,null,null,null,null,null,null,null,null,"średzki","Środa Wielkopolska"]
[null,null,null,null,null,null,null,null,null,null,null,null,null,null,null,null,null,null,null,null,null,null,null,null,null,"średzki","Zaniemyśl"]
[null,null,null,null,null,null,null,null,null,null,null,null,null,null,null,null,null,null,null,null,null,null,null,null,null,"śremski","Brodnica"]
[null,null,null,null,null,null,null,null,null,null,null,null,null,null,null,null,null,null,null,null,null,null,null,null,null,"śremski","Dolsk"]
[null,null,null,null,null,null,null,null,null,null,null,null,null,null,null,null,null,null,null,null,null,null,null,null,null,"śremski","Książ Wielkopolski"]
[null,null,null,null,null,null,null,null,null,null,null,null,null,null,null,null,null,null,null,null,null,null,null,null,null,"śremski","Śrem"]
[null,null,null,null,null,null,null,null,null,null,null,null,null,null,null,null,null,null,null,null,null,null,null,null,null,"Poznań","Poznań"]
[null,null,null,null,null,null,null,null,null,null,null,null,null,null,null,null,null,null,null,null,null,null,null,null,null,"Poznań","Poznań-Grunwald"]
[null,null,null,null,null,null,null,null,null,null,null,null,null,null,null,null,null,null,null,null,null,null,null,null,null,"Poznań","Poznań-Jeżyce"]
[null,null,null,null,null,null,null,null,null,null,null,null,null,null,null,null,null,null,null,null,null,null,null,null,null,"Poznań","Poznań-Nowe Miasto"]
[null,null,null,null,null,null,null,null,null,null,null,null,null,null,null,null,null,null,null,null,null,null,null,null,null,"Poznań","Poznań-Stare Miasto"]
[null,null,null,null,null,null,null,null,null,null,null,null,null,null,null,null,null,null,null,null,null,null,null,null,null,"Poznań","Poznań-Wilda"]
[null,null,null,null,null,null,null,null,null,null,null,null,null,null,null,null,null,null,null,null,null,null,null,null,null,"białogardzki","Białogard"]
[null,null,null,null,null,null,null,null,null,null,null,null,null,null,null,null,null,null,null,null,null,null,null,null,null,"białogardzki","Karlino"]
[null,null,null,null,null,null,null,null,null,null,null,null,null,null,null,null,null,null,null,null,null,null,null,null,null,"białogardzki","Tychowo"]
[null,null,null,null,null,null,null,null,null,null,null,null,null,null,null,null,null,null,null,null,null,null,null,null,null,"kołobrzeski","Kołobrzeg"]
[null,null,null,null,null,null,null,null,null,null,null,null,null,null,null,null,null,null,null,null,null,null,null,null,null,"kołobrzeski","Dygowo"]
[null,null,null,null,null,null,null,null,null,null,null,null,null,null,null,null,null,null,null,null,null,null,null,null,null,"kołobrzeski","Gościno"]
[null,null,null,null,null,null,null,null,null,null,null,null,null,null,null,null,null,null,null,null,null,null,null,null,null,"kołobrzeski","Kołobrzeg"]
[null,null,null,null,null,null,null,null,null,null,null,null,null,null,null,null,null,null,null,null,null,null,null,null,null,"kołobrzeski","Rymań"]
[null,null,null,null,null,null,null,null,null,null,null,null,null,null,null,null,null,null,null,null,null,null,null,null,null,"kołobrzeski","Siemyśl"]
[null,null,null,null,null,null,null,null,null,null,null,null,null,null,null,null,null,null,null,null,null,null,null,null,null,"kołobrzeski","Ustronie Morskie"]
[null,null,null,null,null,null,null,null,null,null,null,null,null,null,null,null,null,null,null,null,null,null,null,null,null,"koszaliński","Będzino"]
[null,null,null,null,null,null,null,null,null,null,null,null,null,null,null,null,null,null,null,null,null,null,null,null,null,"koszaliński","Biesiekierz"]
[null,null,null,null,null,null,null,null,null,null,null,null,null,null,null,null,null,null,null,null,null,null,null,null,null,"koszaliński","Bobolice"]
[null,null,null,null,null,null,null,null,null,null,null,null,null,null,null,null,null,null,null,null,null,null,null,null,null,"koszaliński","Manowo"]
[null,null,null,null,null,null,null,null,null,null,null,null,null,null,null,null,null,null,null,null,null,null,null,null,null,"koszaliński","Mielno"]
[null,null,null,null,null,null,null,null,null,null,null,null,null,null,null,null,null,null,null,null,null,null,null,null,null,"koszaliński","Polanów"]
[null,null,null,null,null,null,null,null,null,null,null,null,null,null,null,null,null,null,null,null,null,null,null,null,null,"koszaliński","Sianów"]
[null,null,null,null,null,null,null,null,null,null,null,null,null,null,null,null,null,null,null,null,null,null,null,null,null,"koszaliński","Świeszyno"]
[null,null,null,null,null,null,null,null,null,null,null,null,null,null,null,null,null,null,null,null,null,null,null,null,null,"sławieński","Darłowo"]
[null,null,null,null,null,null,null,null,null,null,null,null,null,null,null,null,null,null,null,null,null,null,null,null,null,"sławieński","Sławno"]
[null,null,null,null,null,null,null,null,null,null,null,null,null,null,null,null,null,null,null,null,null,null,null,null,null,"sławieński","Malechowo"]
[null,null,null,null,null,null,null,null,null,null,null,null,null,null,null,null,null,null,null,null,null,null,null,null,null,"sławieński","Postomino"]
[null,null,null,null,null,null,null,null,null,null,null,null,null,null,null,null,null,null,null,null,null,null,null,null,null,"sławieński","Sławno"]
[null,null,null,null,null,null,null,null,null,null,null,null,null,null,null,null,null,null,null,null,null,null,null,null,null,"Koszalin","Koszalin"]
[null,null,null,null,null,null,null,null,null,null,null,null,null,null,null,null,null,null,null,null,null,null,null,null,null,"choszczeński","Bierzwnik"]
[null,null,null,null,null,null,null,null,null,null,null,null,null,null,null,null,null,null,null,null,null,null,null,null,null,"choszczeński","Choszczno"]
[null,null,null,null,null,null,null,null,null,null,null,null,null,null,null,null,null,null,null,null,null,null,null,null,null,"choszczeński","Drawno"]
[null,null,null,null,null,null,null,null,null,null,null,null,null,null,null,null,null,null,null,null,null,null,null,null,null,"choszczeński","Krzęcin"]
[null,null,null,null,null,null,null,null,null,null,null,null,null,null,null,null,null,null,null,null,null,null,null,null,null,"choszczeński","Pełczyce"]
[null,null,null,null,null,null,null,null,null,null,null,null,null,null,null,null,null,null,null,null,null,null,null,null,null,"choszczeński","Recz"]
[null,null,null,null,null,null,null,null,null,null,null,null,null,null,null,null,null,null,null,null,null,null,null,null,null,"drawski","Czaplinek"]
[null,null,null,null,null,null,null,null,null,null,null,null,null,null,null,null,null,null,null,null,null,null,null,null,null,"drawski","Drawsko Pomorskie"]
[null,null,null,null,null,null,null,null,null,null,null,null,null,null,null,null,null,null,null,null,null,null,null,null,null,"drawski","Kalisz Pomorski"]
[null,null,null,null,null,null,null,null,null,null,null,null,null,null,null,null,null,null,null,null,null,null,null,null,null,"drawski","Wierzchowo"]
[null,null,null,null,null,null,null,null,null,null,null,null,null,null,null,null,null,null,null,null,null,null,null,null,null,"drawski","Złocieniec"]
[null,null,null,null,null,null,null,null,null,null,null,null,null,null,null,null,null,null,null,null,null,null,null,null,null,"myśliborski","Barlinek"]
[null,null,null,null,null,null,null,null,null,null,null,null,null,null,null,null,null,null,null,null,null,null,null,null,null,"myśliborski","Boleszkowice"]
[null,null,null,null,null,null,null,null,null,null,null,null,null,null,null,null,null,null,null,null,null,null,null,null,null,"myśliborski","Dębno"]
[null,null,null,null,null,null,null,null,null,null,null,null,null,null,null,null,null,null,null,null,null,null,null,null,null,"myśliborski","Myślibórz"]
[null,null,null,null,null,null,null,null,null,null,null,null,null,null,null,null,null,null,null,null,null,null,null,null,null,"myśliborski","Nowogródek Pomorski"]
[null,null,null,null,null,null,null,null,null,null,null,null,null,null,null,null,null,null,null,null,null,null,null,null,null,"pyrzycki","Bielice"]
[null,null,null,null,null,null,null,null,null,null,null,null,null,null,null,null,null,null,null,null,null,null,null,null,null,"pyrzycki","Kozielice"]
[null,null,null,null,null,null,null,null,null,null,null,null,null,null,null,null,null,null,null,null,null,null,null,null,null,"pyrzycki","Lipiany"]
[null,null,null,null,null,null,null,null,null,null,null,null,null,null,null,null,null,null,null,null,null,null,null,null,null,"pyrzycki","Przelewice"]
[null,null,null,null,null,null,null,null,null,null,null,null,null,null,null,null,null,null,null,null,null,null,null,null,null,"pyrzycki","Pyrzyce"]
[null,null,null,null,null,null,null,null,null,null,null,null,null,null,null,null,null,null,null,null,null,null,null,null,null,"pyrzycki","Warnice"]
[null,null,null,null,null,null,null,null,null,null,null,null,null,null,null,null,null,null,null,null,null,null,null,null,null,"szczecinecki","Szczecinek"]
[null,null,null,null,null,null,null,null,null,null,null,null,null,null,null,null,null,null,null,null,null,null,null,null,null,"szczecinecki","Barwice"]
[null,null,null,null,null,null,null,null,null,null,null,null,null,null,null,null,null,null,null,null,null,null,null,null,null,"szczecinecki","Biały Bór"]
[null,null,null,null,null,null,null,null,null,null,null,null,null,null,null,null,null,null,null,null,null,null,null,null,null,"szczecinecki","Borne Sulinowo"]
[null,null,null,null,null,null,null,null,null,null,null,null,null,null,null,null,null,null,null,null,null,null,null,null,null,"szczecinecki","Grzmiąca"]
[null,null,null,null,null,null,null,null,null,null,null,null,null,null,null,null,null,null,null,null,null,null,null,null,null,"szczecinecki","Szczecinek"]
[null,null,null,null,null,null,null,null,null,null,null,null,null,null,null,null,null,null,null,null,null,null,null,null,null,"świdwiński","Świdwin"]
[null,null,null,null,null,null,null,null,null,null,null,null,null,null,null,null,null,null,null,null,null,null,null,null,null,"świdwiński","Brzeżno"]
[null,null,null,null,null,null,null,null,null,null,null,null,null,null,null,null,null,null,null,null,null,null,null,null,null,"świdwiński","Połczyn-Zdrój"]
[null,null,null,null,null,null,null,null,null,null,null,null,null,null,null,null,null,null,null,null,null,null,null,null,null,"świdwiński","Rąbino"]
[null,null,null,null,null,null,null,null,null,null,null,null,null,null,null,null,null,null,null,null,null,null,null,null,null,"świdwiński","Sławoborze"]
[null,null,null,null,null,null,null,null,null,null,null,null,null,null,null,null,null,null,null,null,null,null,null,null,null,"świdwiński","Świdwin"]
[null,null,null,null,null,null,null,null,null,null,null,null,null,null,null,null,null,null,null,null,null,null,null,null,null,"wałecki","Wałcz"]
[null,null,null,null,null,null,null,null,null,null,null,null,null,null,null,null,null,null,null,null,null,null,null,null,null,"wałecki","Człopa"]
[null,null,null,null,null,null,null,null,null,null,null,null,null,null,null,null,null,null,null,null,null,null,null,null,null,"wałecki","Mirosławiec"]
[null,null,null,null,null,null,null,null,null,null,null,null,null,null,null,null,null,null,null,null,null,null,null,null,null,"wałecki","Tuczno"]
[null,null,null,null,null,null,null,null,null,null,null,null,null,null,null,null,null,null,null,null,null,null,null,null,null,"wałecki","Wałcz"]
[null,null,null,null,null,null,null,null,null,null,null,null,null,null,null,null,null,null,null,null,null,null,null,null,null,"łobeski","Dobra"]
[null,null,null,null,null,null,null,null,null,null,null,null,null,null,null,null,null,null,null,null,null,null,null,null,null,"łobeski","Łobez"]
[null,null,null,null,null,null,null,null,null,null,null,null,null,null,null,null,null,null,null,null,null,null,null,null,null,"łobeski","Radowo Małe"]
[null,null,null,null,null,null,null,null,null,null,null,null,null,null,null,null,null,null,null,null,null,null,null,null,null,"łobeski","Resko"]
[null,null,null,null,null,null,null,null,null,null,null,null,null,null,null,null,null,null,null,null,null,null,null,null,null,"łobeski","Węgorzyno"]
[null,null,null,null,null,null,null,null,null,null,null,null,null,null,null,null,null,null,null,null,null,null,null,null,null,"Szczecin","Szczecin"]
[null,null,null,null,null,null,null,null,null,null,null,null,null,null,null,null,null,null,null,null,null,null,null,null,null,"goleniowski","Goleniów"]
[null,null,null,null,null,null,null,null,null,null,null,null,null,null,null,null,null,null,null,null,null,null,null,null,null,"goleniowski","Maszewo"]
[null,null,null,null,null,null,null,null,null,null,null,null,null,null,null,null,null,null,null,null,null,null,null,null,null,"goleniowski","Nowogard"]
[null,null,null,null,null,null,null,null,null,null,null,null,null,null,null,null,null,null,null,null,null,null,null,null,null,"goleniowski","Osina"]
[null,null,null,null,null,null,null,null,null,null,null,null,null,null,null,null,null,null,null,null,null,null,null,null,null,"goleniowski","Przybiernów"]
[null,null,null,null,null,null,null,null,null,null,null,null,null,null,null,null,null,null,null,null,null,null,null,null,null,"goleniowski","Stepnica"]
[null,null,null,null,null,null,null,null,null,null,null,null,null,null,null,null,null,null,null,null,null,null,null,null,null,"gryficki","Brojce"]
[null,null,null,null,null,null,null,null,null,null,null,null,null,null,null,null,null,null,null,null,null,null,null,null,null,"gryficki","Gryfice"]
[null,null,null,null,null,null,null,null,null,null,null,null,null,null,null,null,null,null,null,null,null,null,null,null,null,"gryficki","Karnice"]
[null,null,null,null,null,null,null,null,null,null,null,null,null,null,null,null,null,null,null,null,null,null,null,null,null,"gryficki","Płoty"]
[null,null,null,null,null,null,null,null,null,null,null,null,null,null,null,null,null,null,null,null,null,null,null,null,null,"gryficki","Rewal"]
[null,null,null,null,null,null,null,null,null,null,null,null,null,null,null,null,null,null,null,null,null,null,null,null,null,"gryficki","Trzebiatów"]
[null,null,null,null,null,null,null,null,null,null,null,null,null,null,null,null,null,null,null,null,null,null,null,null,null,"gryfiński","Banie"]
[null,null,null,null,null,null,null,null,null,null,null,null,null,null,null,null,null,null,null,null,null,null,null,null,null,"gryfiński","Cedynia"]
[null,null,null,null,null,null,null,null,null,null,null,null,null,null,null,null,null,null,null,null,null,null,null,null,null,"gryfiński","Chojna"]
[null,null,null,null,null,null,null,null,null,null,null,null,null,null,null,null,null,null,null,null,null,null,null,null,null,"gryfiński","Gryfino"]
[null,null,null,null,null,null,null,null,null,null,null,null,null,null,null,null,null,null,null,null,null,null,null,null,null,"gryfiński","Mieszkowice"]
[null,null,null,null,null,null,null,null,null,null,null,null,null,null,null,null,null,null,null,null,null,null,null,null,null,"gryfiński","Moryń"]
[null,null,null,null,null,null,null,null,null,null,null,null,null,null,null,null,null,null,null,null,null,null,null,null,null,"gryfiński","Stare Czarnowo"]
[null,null,null,null,null,null,null,null,null,null,null,null,null,null,null,null,null,null,null,null,null,null,null,null,null,"gryfiński","Trzcińsko-Zdrój"]
[null,null,null,null,null,null,null,null,null,null,null,null,null,null,null,null,null,null,null,null,null,null,null,null,null,"gryfiński","Widuchowa"]
[null,null,null,null,null,null,null,null,null,null,null,null,null,null,null,null,null,null,null,null,null,null,null,null,null,"kamieński","Dziwnów"]
[null,null,null,null,null,null,null,null,null,null,null,null,null,null,null,null,null,null,null,null,null,null,null,null,null,"kamieński","Golczewo"]
[null,null,null,null,null,null,null,null,null,null,null,null,null,null,null,null,null,null,null,null,null,null,null,null,null,"kamieński","Kamień Pomorski"]
[null,null,null,null,null,null,null,null,null,null,null,null,null,null,null,null,null,null,null,null,null,null,null,null,null,"kamieński","Międzyzdroje"]
[null,null,null,null,null,null,null,null,null,null,null,null,null,null,null,null,null,null,null,null,null,null,null,null,null,"kamieński","Świerzno"]
[null,null,null,null,null,null,null,null,null,null,null,null,null,null,null,null,null,null,null,null,null,null,null,null,null,"kamieński","Wolin"]
[null,null,null,null,null,null,null,null,null,null,null,null,null,null,null,null,null,null,null,null,null,null,null,null,null,"policki","Dobra (Szczecińska)"]
[null,null,null,null,null,null,null,null,null,null,null,null,null,null,null,null,null,null,null,null,null,null,null,null,null,"policki","Kołbaskowo"]
[null,null,null,null,null,null,null,null,null,null,null,null,null,null,null,null,null,null,null,null,null,null,null,null,null,"policki","Nowe Warpno"]
[null,null,null,null,null,null,null,null,null,null,null,null,null,null,null,null,null,null,null,null,null,null,null,null,null,"policki","Police"]
[null,null,null,null,null,null,null,null,null,null,null,null,null,null,null,null,null,null,null,null,null,null,null,null,null,"stargardzki","Stargard"]
[null,null,null,null,null,null,null,null,null,null,null,null,null,null,null,null,null,null,null,null,null,null,null,null,null,"stargardzki","Chociwel"]
[null,null,null,null,null,null,null,null,null,null,null,null,null,null,null,null,null,null,null,null,null,null,null,null,null,"stargardzki","Dobrzany"]
[null,null,null,null,null,null,null,null,null,null,null,null,null,null,null,null,null,null,null,null,null,null,null,null,null,"stargardzki","Dolice"]
[null,null,null,null,null,null,null,null,null,null,null,null,null,null,null,null,null,null,null,null,null,null,null,null,null,"stargardzki","Ińsko"]
[null,null,null,null,null,null,null,null,null,null,null,null,null,null,null,null,null,null,null,null,null,null,null,null,null,"stargardzki","Kobylanka"]
[null,null,null,null,null,null,null,null,null,null,null,null,null,null,null,null,null,null,null,null,null,null,null,null,null,"stargardzki","Marianowo"]
[null,null,null,null,null,null,null,null,null,null,null,null,null,null,null,null,null,null,null,null,null,null,null,null,null,"stargardzki","Stara Dąbrowa"]
[null,null,null,null,null,null,null,null,null,null,null,null,null,null,null,null,null,null,null,null,null,null,null,null,null,"stargardzki","Stargard"]
[null,null,null,null,null,null,null,null,null,null,null,null,null,null,null,null,null,null,null,null,null,null,null,null,null,"stargardzki","Suchań"]
[null,null,null,null,null,null,null,null,null,null,null,null,null,null,null,null,null,null,null,null,null,null,null,null,null,"Świnoujście","Świnoujście"]
[null,null,null,null,null,null,null,null,null,null,null,null,null,null,null,null,null,null,null,null,null,null,null,null,null,"bolesławiecki","Bolesławiec"]
[null,null,null,null,null,null,null,null,null,null,null,null,null,null,null,null,null,null,null,null,null,null,null,null,null,"bolesławiecki","Gromadka"]
[null,null,null,null,null,null,null,null,null,null,null,null,null,null,null,null,null,null,null,null,null,null,null,null,null,"bolesławiecki","Nowogrodziec"]
[null,null,null,null,null,null,null,null,null,null,null,null,null,null,null,null,null,null,null,null,null,null,null,null,null,"bolesławiecki","Osiecznica"]
[null,null,null,null,null,null,null,null,null,null,null,null,null,null,null,null,null,null,null,null,null,null,null,null,null,"bolesławiecki","Warta Bolesławiecka"]
[null,null,null,null,null,null,null,null,null,null,null,null,null,null,null,null,null,null,null,null,null,null,null,null,null,"jaworski","Jawor"]
[null,null,null,null,null,null,null,null,null,null,null,null,null,null,null,null,null,null,null,null,null,null,null,null,null,"jaworski","Bolków"]
[null,null,null,null,null,null,null,null,null,null,null,null,null,null,null,null,null,null,null,null,null,null,null,null,null,"jaworski","Męcinka"]
[null,null,null,null,null,null,null,null,null,null,null,null,null,null,null,null,null,null,null,null,null,null,null,null,null,"jaworski","Mściwojów"]
[null,null,null,null,null,null,null,null,null,null,null,null,null,null,null,null,null,null,null,null,null,null,null,null,null,"jaworski","Paszowice"]
[null,null,null,null,null,null,null,null,null,null,null,null,null,null,null,null,null,null,null,null,null,null,null,null,null,"jaworski","Wądroże Wielkie"]
[null,null,null,null,null,null,null,null,null,null,null,null,null,null,null,null,null,null,null,null,null,null,null,null,null,"karkonoski","Karpacz"]
[null,null,null,null,null,null,null,null,null,null,null,null,null,null,null,null,null,null,null,null,null,null,null,null,null,"karkonoski","Kowary"]
[null,null,null,null,null,null,null,null,null,null,null,null,null,null,null,null,null,null,null,null,null,null,null,null,null,"karkonoski","Piechowice"]
[null,null,null,null,null,null,null,null,null,null,null,null,null,null,null,null,null,null,null,null,null,null,null,null,null,"karkonoski","Szklarska Poręba"]
[null,null,null,null,null,null,null,null,null,null,null,null,null,null,null,null,null,null,null,null,null,null,null,null,null,"karkonoski","Janowice Wielkie"]
[null,null,null,null,null,null,null,null,null,null,null,null,null,null,null,null,null,null,null,null,null,null,null,null,null,"karkonoski","Jeżów Sudecki"]
[null,null,null,null,null,null,null,null,null,null,null,null,null,null,null,null,null,null,null,null,null,null,null,null,null,"karkonoski","Mysłakowice"]
[null,null,null,null,null,null,null,null,null,null,null,null,null,null,null,null,null,null,null,null,null,null,null,null,null,"karkonoski","Podgórzyn"]
[null,null,null,null,null,null,null,null,null,null,null,null,null,null,null,null,null,null,null,null,null,null,null,null,null,"karkonoski","Stara Kamienica"]
[null,null,null,null,null,null,null,null,null,null,null,null,null,null,null,null,null,null,null,null,null,null,null,null,null,"kamiennogórski","Kamienna Góra"]
[null,null,null,null,null,null,null,null,null,null,null,null,null,null,null,null,null,null,null,null,null,null,null,null,null,"kamiennogórski","Kamienna Góra"]
[null,null,null,null,null,null,null,null,null,null,null,null,null,null,null,null,null,null,null,null,null,null,null,null,null,"kamiennogórski","Lubawka"]
[null,null,null,null,null,null,null,null,null,null,null,null,null,null,null,null,null,null,null,null,null,null,null,null,null,"kamiennogórski","Marciszów"]
[null,null,null,null,null,null,null,null,null,null,null,null,null,null,null,null,null,null,null,null,null,null,null,null,null,"lubański","Lubań"]
[null,null,null,null,null,null,null,null,null,null,null,null,null,null,null,null,null,null,null,null,null,null,null,null,null,"lubański","Świeradów-Zdrój"]
[null,null,null,null,null,null,null,null,null,null,null,null,null,null,null,null,null,null,null,null,null,null,null,null,null,"lubański","Leśna"]
[null,null,null,null,null,null,null,null,null,null,null,null,null,null,null,null,null,null,null,null,null,null,null,null,null,"lubański","Lubań"]
[null,null,null,null,null,null,null,null,null,null,null,null,null,null,null,null,null,null,null,null,null,null,null,null,null,"lubański","Olszyna"]
[null,null,null,null,null,null,null,null,null,null,null,null,null,null,null,null,null,null,null,null,null,null,null,null,null,"lubański","Platerówka"]
[null,null,null,null,null,null,null,null,null,null,null,null,null,null,null,null,null,null,null,null,null,null,null,null,null,"lubański","Siekierczyn"]
[null,null,null,null,null,null,null,null,null,null,null,null,null,null,null,null,null,null,null,null,null,null,null,null,null,"lwówecki","Gryfów Śląski"]
[null,null,null,null,null,null,null,null,null,null,null,null,null,null,null,null,null,null,null,null,null,null,null,null,null,"lwówecki","Lubomierz"]
[null,null,null,null,null,null,null,null,null,null,null,null,null,null,null,null,null,null,null,null,null,null,null,null,null,"lwówecki","Lwówek Śląski"]
[null,null,null,null,null,null,null,null,null,null,null,null,null,null,null,null,null,null,null,null,null,null,null,null,null,"lwówecki","Mirsk"]
[null,null,null,null,null,null,null,null,null,null,null,null,null,null,null,null,null,null,null,null,null,null,null,null,null,"lwówecki","Wleń"]
[null,null,null,null,null,null,null,null,null,null,null,null,null,null,null,null,null,null,null,null,null,null,null,null,null,"zgorzelecki","Zawidów"]
[null,null,null,null,null,null,null,null,null,null,null,null,null,null,null,null,null,null,null,null,null,null,null,null,null,"zgorzelecki","Zgorzelec"]
[null,null,null,null,null,null,null,null,null,null,null,null,null,null,null,null,null,null,null,null,null,null,null,null,null,"zgorzelecki","Bogatynia"]
[null,null,null,null,null,null,null,null,null,null,null,null,null,null,null,null,null,null,null,null,null,null,null,null,null,"zgorzelecki","Pieńsk"]
[null,null,null,null,null,null,null,null,null,null,null,null,null,null,null,null,null,null,null,null,null,null,null,null,null,"zgorzelecki","Sulików"]
[null,null,null,null,null,null,null,null,null,null,null,null,null,null,null,null,null,null,null,null,null,null,null,null,null,"zgorzelecki","Węgliniec"]
[null,null,null,null,null,null,null,null,null,null,null,null,null,null,null,null,null,null,null,null,null,null,null,null,null,"zgorzelecki","Zgorzelec"]
[null,null,null,null,null,null,null,null,null,null,null,null,null,null,null,null,null,null,null,null,null,null,null,null,null,"złotoryjski","Wojcieszów"]
[null,null,null,null,null,null,null,null,null,null,null,null,null,null,null,null,null,null,null,null,null,null,null,null,null,"złotoryjski","Złotoryja"]
[null,null,null,null,null,null,null,null,null,null,null,null,null,null,null,null,null,null,null,null,null,null,null,null,null,"złotoryjski","Pielgrzymka"]
[null,null,null,null,null,null,null,null,null,null,null,null,null,null,null,null,null,null,null,null,null,null,null,null,null,"złotoryjski","Świerzawa"]
[null,null,null,null,null,null,null,null,null,null,null,null,null,null,null,null,null,null,null,null,null,null,null,null,null,"złotoryjski","Zagrodno"]
[null,null,null,null,null,null,null,null,null,null,null,null,null,null,null,null,null,null,null,null,null,null,null,null,null,"złotoryjski","Złotoryja"]
[null,null,null,null,null,null,null,null,null,null,null,null,null,null,null,null,null,null,null,null,null,null,null,null,null,"Jelenia Góra","Jelenia Góra"]
[null,null,null,null,null,null,null,null,null,null,null,null,null,null,null,null,null,null,null,null,null,null,null,null,null,"głogowski","Głogów"]
[null,null,null,null,null,null,null,null,null,null,null,null,null,null,null,null,null,null,null,null,null,null,null,null,null,"głogowski","Głogów"]
[null,null,null,null,null,null,null,null,null,null,null,null,null,null,null,null,null,null,null,null,null,null,null,null,null,"głogowski","Jerzmanowa"]
[null,null,null,null,null,null,null,null,null,null,null,null,null,null,null,null,null,null,null,null,null,null,null,null,null,"głogowski","Kotla"]
[null,null,null,null,null,null,null,null,null,null,null,null,null,null,null,null,null,null,null,null,null,null,null,null,null,"głogowski","Pęcław"]
[null,null,null,null,null,null,null,null,null,null,null,null,null,null,null,null,null,null,null,null,null,null,null,null,null,"głogowski","Żukowice"]
[null,null,null,null,null,null,null,null,null,null,null,null,null,null,null,null,null,null,null,null,null,null,null,null,null,"górowski","Góra"]
[null,null,null,null,null,null,null,null,null,null,null,null,null,null,null,null,null,null,null,null,null,null,null,null,null,"górowski","Jemielno"]
[null,null,null,null,null,null,null,null,null,null,null,null,null,null,null,null,null,null,null,null,null,null,null,null,null,"górowski","Niechlów"]
[null,null,null,null,null,null,null,null,null,null,null,null,null,null,null,null,null,null,null,null,null,null,null,null,null,"górowski","Wąsosz"]
[null,null,null,null,null,null,null,null,null,null,null,null,null,null,null,null,null,null,null,null,null,null,null,null,null,"legnicki","Chojnów"]
[null,null,null,null,null,null,null,null,null,null,null,null,null,null,null,null,null,null,null,null,null,null,null,null,null,"legnicki","Krotoszyce"]
[null,null,null,null,null,null,null,null,null,null,null,null,null,null,null,null,null,null,null,null,null,null,null,null,null,"legnicki","Kunice"]
[null,null,null,null,null,null,null,null,null,null,null,null,null,null,null,null,null,null,null,null,null,null,null,null,null,"legnicki","Legnickie Pole"]
[null,null,null,null,null,null,null,null,null,null,null,null,null,null,null,null,null,null,null,null,null,null,null,null,null,"legnicki","Miłkowice"]
[null,null,null,null,null,null,null,null,null,null,null,null,null,null,null,null,null,null,null,null,null,null,null,null,null,"legnicki","Prochowice"]
[null,null,null,null,null,null,null,null,null,null,null,null,null,null,null,null,null,null,null,null,null,null,null,null,null,"legnicki","Ruja"]
[null,null,null,null,null,null,null,null,null,null,null,null,null,null,null,null,null,null,null,null,null,null,null,null,null,"lubiński","Lubin"]
[null,null,null,null,null,null,null,null,null,null,null,null,null,null,null,null,null,null,null,null,null,null,null,null,null,"lubiński","Rudna"]
[null,null,null,null,null,null,null,null,null,null,null,null,null,null,null,null,null,null,null,null,null,null,null,null,null,"lubiński","Ścinawa"]
[null,null,null,null,null,null,null,null,null,null,null,null,null,null,null,null,null,null,null,null,null,null,null,null,null,"polkowicki","Chocianów"]
[null,null,null,null,null,null,null,null,null,null,null,null,null,null,null,null,null,null,null,null,null,null,null,null,null,"polkowicki","Gaworzyce"]
[null,null,null,null,null,null,null,null,null,null,null,null,null,null,null,null,null,null,null,null,null,null,null,null,null,"polkowicki","Grębocice"]
[null,null,null,null,null,null,null,null,null,null,null,null,null,null,null,null,null,null,null,null,null,null,null,null,null,"polkowicki","Polkowice"]
[null,null,null,null,null,null,null,null,null,null,null,null,null,null,null,null,null,null,null,null,null,null,null,null,null,"polkowicki","Przemków"]
[null,null,null,null,null,null,null,null,null,null,null,null,null,null,null,null,null,null,null,null,null,null,null,null,null,"polkowicki","Radwanice"]
[null,null,null,null,null,null,null,null,null,null,null,null,null,null,null,null,null,null,null,null,null,null,null,null,null,"Legnica","Legnica"]
[null,null,null,null,null,null,null,null,null,null,null,null,null,null,null,null,null,null,null,null,null,null,null,null,null,"dzierżoniowski","Bielawa"]
[null,null,null,null,null,null,null,null,null,null,null,null,null,null,null,null,null,null,null,null,null,null,null,null,null,"dzierżoniowski","Dzierżoniów"]
[null,null,null,null,null,null,null,null,null,null,null,null,null,null,null,null,null,null,null,null,null,null,null,null,null,"dzierżoniowski","Pieszyce"]
[null,null,null,null,null,null,null,null,null,null,null,null,null,null,null,null,null,null,null,null,null,null,null,null,null,"dzierżoniowski","Piława Górna"]
[null,null,null,null,null,null,null,null,null,null,null,null,null,null,null,null,null,null,null,null,null,null,null,null,null,"dzierżoniowski","Dzierżoniów"]
[null,null,null,null,null,null,null,null,null,null,null,null,null,null,null,null,null,null,null,null,null,null,null,null,null,"dzierżoniowski","Łagiewniki"]
[null,null,null,null,null,null,null,null,null,null,null,null,null,null,null,null,null,null,null,null,null,null,null,null,null,"dzierżoniowski","Niemcza"]
[null,null,null,null,null,null,null,null,null,null,null,null,null,null,null,null,null,null,null,null,null,null,null,null,null,"kłodzki","Duszniki-Zdrój"]
[null,null,null,null,null,null,null,null,null,null,null,null,null,null,null,null,null,null,null,null,null,null,null,null,null,"kłodzki","Kłodzko"]
[null,null,null,null,null,null,null,null,null,null,null,null,null,null,null,null,null,null,null,null,null,null,null,null,null,"kłodzki","Kudowa-Zdrój"]
[null,null,null,null,null,null,null,null,null,null,null,null,null,null,null,null,null,null,null,null,null,null,null,null,null,"kłodzki","Nowa Ruda"]
[null,null,null,null,null,null,null,null,null,null,null,null,null,null,null,null,null,null,null,null,null,null,null,null,null,"kłodzki","Polanica-Zdrój"]
[null,null,null,null,null,null,null,null,null,null,null,null,null,null,null,null,null,null,null,null,null,null,null,null,null,"kłodzki","Bystrzyca Kłodzka"]
[null,null,null,null,null,null,null,null,null,null,null,null,null,null,null,null,null,null,null,null,null,null,null,null,null,"kłodzki","Kłodzko"]
[null,null,null,null,null,null,null,null,null,null,null,null,null,null,null,null,null,null,null,null,null,null,null,null,null,"kłodzki","Lądek-Zdrój"]
[null,null,null,null,null,null,null,null,null,null,null,null,null,null,null,null,null,null,null,null,null,null,null,null,null,"kłodzki","Lewin Kłodzki"]
[null,null,null,null,null,null,null,null,null,null,null,null,null,null,null,null,null,null,null,null,null,null,null,null,null,"kłodzki","Międzylesie"]
[null,null,null,null,null,null,null,null,null,null,null,null,null,null,null,null,null,null,null,null,null,null,null,null,null,"kłodzki","Nowa Ruda"]
[null,null,null,null,null,null,null,null,null,null,null,null,null,null,null,null,null,null,null,null,null,null,null,null,null,"kłodzki","Radków"]
[null,null,null,null,null,null,null,null,null,null,null,null,null,null,null,null,null,null,null,null,null,null,null,null,null,"kłodzki","Stronie Śląskie"]
[null,null,null,null,null,null,null,null,null,null,null,null,null,null,null,null,null,null,null,null,null,null,null,null,null,"kłodzki","Szczytna"]
[null,null,null,null,null,null,null,null,null,null,null,null,null,null,null,null,null,null,null,null,null,null,null,null,null,"świdnicki","Świdnica"]
[null,null,null,null,null,null,null,null,null,null,null,null,null,null,null,null,null,null,null,null,null,null,null,null,null,"świdnicki","Świebodzice"]
[null,null,null,null,null,null,null,null,null,null,null,null,null,null,null,null,null,null,null,null,null,null,null,null,null,"świdnicki","Dobromierz"]
[null,null,null,null,null,null,null,null,null,null,null,null,null,null,null,null,null,null,null,null,null,null,null,null,null,"świdnicki","Jaworzyna Śląska"]
[null,null,null,null,null,null,null,null,null,null,null,null,null,null,null,null,null,null,null,null,null,null,null,null,null,"świdnicki","Marcinowice"]
[null,null,null,null,null,null,null,null,null,null,null,null,null,null,null,null,null,null,null,null,null,null,null,null,null,"świdnicki","Strzegom"]
[null,null,null,null,null,null,null,null,null,null,null,null,null,null,null,null,null,null,null,null,null,null,null,null,null,"świdnicki","Świdnica"]
[null,null,null,null,null,null,null,null,null,null,null,null,null,null,null,null,null,null,null,null,null,null,null,null,null,"świdnicki","Żarów"]
[null,null,null,null,null,null,null,null,null,null,null,null,null,null,null,null,null,null,null,null,null,null,null,null,null,"wałbrzyski","Boguszów-Gorce"]
[null,null,null,null,null,null,null,null,null,null,null,null,null,null,null,null,null,null,null,null,null,null,null,null,null,"wałbrzyski","Jedlina-Zdrój"]
[null,null,null,null,null,null,null,null,null,null,null,null,null,null,null,null,null,null,null,null,null,null,null,null,null,"wałbrzyski","Szczawno-Zdrój"]
[null,null,null,null,null,null,null,null,null,null,null,null,null,null,null,null,null,null,null,null,null,null,null,null,null,"wałbrzyski","Czarny Bór"]
[null,null,null,null,null,null,null,null,null,null,null,null,null,null,null,null,null,null,null,null,null,null,null,null,null,"wałbrzyski","Głuszyca"]
[null,null,null,null,null,null,null,null,null,null,null,null,null,null,null,null,null,null,null,null,null,null,null,null,null,"wałbrzyski","Mieroszów"]
[null,null,null,null,null,null,null,null,null,null,null,null,null,null,null,null,null,null,null,null,null,null,null,null,null,"wałbrzyski","Stare Bogaczowice"]
[null,null,null,null,null,null,null,null,null,null,null,null,null,null,null,null,null,null,null,null,null,null,null,null,null,"wałbrzyski","Walim"]
[null,null,null,null,null,null,null,null,null,null,null,null,null,null,null,null,null,null,null,null,null,null,null,null,null,"ząbkowicki","Bardo"]
[null,null,null,null,null,null,null,null,null,null,null,null,null,null,null,null,null,null,null,null,null,null,null,null,null,"ząbkowicki","Ciepłowody"]
[null,null,null,null,null,null,null,null,null,null,null,null,null,null,null,null,null,null,null,null,null,null,null,null,null,"ząbkowicki","Kamieniec Ząbkowicki"]
[null,null,null,null,null,null,null,null,null,null,null,null,null,null,null,null,null,null,null,null,null,null,null,null,null,"ząbkowicki","Stoszowice"]
[null,null,null,null,null,null,null,null,null,null,null,null,null,null,null,null,null,null,null,null,null,null,null,null,null,"ząbkowicki","Ząbkowice Śląskie"]
[null,null,null,null,null,null,null,null,null,null,null,null,null,null,null,null,null,null,null,null,null,null,null,null,null,"ząbkowicki","Ziębice"]
[null,null,null,null,null,null,null,null,null,null,null,null,null,null,null,null,null,null,null,null,null,null,null,null,null,"ząbkowicki","Złoty Stok"]
[null,null,null,null,null,null,null,null,null,null,null,null,null,null,null,null,null,null,null,null,null,null,null,null,null,"Wałbrzych","Wałbrzych"]
[null,null,null,null,null,null,null,null,null,null,null,null,null,null,null,null,null,null,null,null,null,null,null,null,null,"milicki","Cieszków"]
[null,null,null,null,null,null,null,null,null,null,null,null,null,null,null,null,null,null,null,null,null,null,null,null,null,"milicki","Krośnice"]
[null,null,null,null,null,null,null,null,null,null,null,null,null,null,null,null,null,null,null,null,null,null,null,null,null,"milicki","Milicz"]
[null,null,null,null,null,null,null,null,null,null,null,null,null,null,null,null,null,null,null,null,null,null,null,null,null,"oleśnicki","Oleśnica"]
[null,null,null,null,null,null,null,null,null,null,null,null,null,null,null,null,null,null,null,null,null,null,null,null,null,"oleśnicki","Bierutów"]
[null,null,null,null,null,null,null,null,null,null,null,null,null,null,null,null,null,null,null,null,null,null,null,null,null,"oleśnicki","Dobroszyce"]
[null,null,null,null,null,null,null,null,null,null,null,null,null,null,null,null,null,null,null,null,null,null,null,null,null,"oleśnicki","Dziadowa Kłoda"]
[null,null,null,null,null,null,null,null,null,null,null,null,null,null,null,null,null,null,null,null,null,null,null,null,null,"oleśnicki","Międzybórz"]
[null,null,null,null,null,null,null,null,null,null,null,null,null,null,null,null,null,null,null,null,null,null,null,null,null,"oleśnicki","Oleśnica"]
[null,null,null,null,null,null,null,null,null,null,null,null,null,null,null,null,null,null,null,null,null,null,null,null,null,"oleśnicki","Syców"]
[null,null,null,null,null,null,null,null,null,null,null,null,null,null,null,null,null,null,null,null,null,null,null,null,null,"oleśnicki","Twardogóra"]
[null,null,null,null,null,null,null,null,null,null,null,null,null,null,null,null,null,null,null,null,null,null,null,null,null,"oławski","Oława"]
[null,null,null,null,null,null,null,null,null,null,null,null,null,null,null,null,null,null,null,null,null,null,null,null,null,"oławski","Domaniów"]
[null,null,null,null,null,null,null,null,null,null,null,null,null,null,null,null,null,null,null,null,null,null,null,null,null,"oławski","Jelcz-Laskowice"]
[null,null,null,null,null,null,null,null,null,null,null,null,null,null,null,null,null,null,null,null,null,null,null,null,null,"oławski","Oława"]
[null,null,null,null,null,null,null,null,null,null,null,null,null,null,null,null,null,null,null,null,null,null,null,null,null,"strzeliński","Borów"]
[null,null,null,null,null,null,null,null,null,null,null,null,null,null,null,null,null,null,null,null,null,null,null,null,null,"strzeliński","Kondratowice"]
[null,null,null,null,null,null,null,null,null,null,null,null,null,null,null,null,null,null,null,null,null,null,null,null,null,"strzeliński","Przeworno"]
[null,null,null,null,null,null,null,null,null,null,null,null,null,null,null,null,null,null,null,null,null,null,null,null,null,"strzeliński","Strzelin"]
[null,null,null,null,null,null,null,null,null,null,null,null,null,null,null,null,null,null,null,null,null,null,null,null,null,"strzeliński","Wiązów"]
[null,null,null,null,null,null,null,null,null,null,null,null,null,null,null,null,null,null,null,null,null,null,null,null,null,"średzki","Kostomłoty"]
[null,null,null,null,null,null,null,null,null,null,null,null,null,null,null,null,null,null,null,null,null,null,null,null,null,"średzki","Malczyce"]
[null,null,null,null,null,null,null,null,null,null,null,null,null,null,null,null,null,null,null,null,null,null,null,null,null,"średzki","Miękinia"]
[null,null,null,null,null,null,null,null,null,null,null,null,null,null,null,null,null,null,null,null,null,null,null,null,null,"średzki","Środa Śląska"]
[null,null,null,null,null,null,null,null,null,null,null,null,null,null,null,null,null,null,null,null,null,null,null,null,null,"średzki","Udanin"]
[null,null,null,null,null,null,null,null,null,null,null,null,null,null,null,null,null,null,null,null,null,null,null,null,null,"trzebnicki","Oborniki Śląskie"]
[null,null,null,null,null,null,null,null,null,null,null,null,null,null,null,null,null,null,null,null,null,null,null,null,null,"trzebnicki","Prusice"]
[null,null,null,null,null,null,null,null,null,null,null,null,null,null,null,null,null,null,null,null,null,null,null,null,null,"trzebnicki","Trzebnica"]
[null,null,null,null,null,null,null,null,null,null,null,null,null,null,null,null,null,null,null,null,null,null,null,null,null,"trzebnicki","Wisznia Mała"]
[null,null,null,null,null,null,null,null,null,null,null,null,null,null,null,null,null,null,null,null,null,null,null,null,null,"trzebnicki","Zawonia"]
[null,null,null,null,null,null,null,null,null,null,null,null,null,null,null,null,null,null,null,null,null,null,null,null,null,"trzebnicki","Żmigród"]
[null,null,null,null,null,null,null,null,null,null,null,null,null,null,null,null,null,null,null,null,null,null,null,null,null,"wołowski","Brzeg Dolny"]
[null,null,null,null,null,null,null,null,null,null,null,null,null,null,null,null,null,null,null,null,null,null,null,null,null,"wołowski","Wińsko"]
[null,null,null,null,null,null,null,null,null,null,null,null,null,null,null,null,null,null,null,null,null,null,null,null,null,"wołowski","Wołów"]
[null,null,null,null,null,null,null,null,null,null,null,null,null,null,null,null,null,null,null,null,null,null,null,null,null,"wrocławski","Czernica"]
[null,null,null,null,null,null,null,null,null,null,null,null,null,null,null,null,null,null,null,null,null,null,null,null,null,"wrocławski","Długołęka"]
[null,null,null,null,null,null,null,null,null,null,null,null,null,null,null,null,null,null,null,null,null,null,null,null,null,"wrocławski","Jordanów Śląski"]
[null,null,null,null,null,null,null,null,null,null,null,null,null,null,null,null,null,null,null,null,null,null,null,null,null,"wrocławski","Kąty Wrocławskie"]
[null,null,null,null,null,null,null,null,null,null,null,null,null,null,null,null,null,null,null,null,null,null,null,null,null,"wrocławski","Kobierzyce"]
[null,null,null,null,null,null,null,null,null,null,null,null,null,null,null,null,null,null,null,null,null,null,null,null,null,"wrocławski","Mietków"]
[null,null,null,null,null,null,null,null,null,null,null,null,null,null,null,null,null,null,null,null,null,null,null,null,null,"wrocławski","Sobótka"]
[null,null,null,null,null,null,null,null,null,null,null,null,null,null,null,null,null,null,null,null,null,null,null,null,null,"wrocławski","Siechnice"]
[null,null,null,null,null,null,null,null,null,null,null,null,null,null,null,null,null,null,null,null,null,null,null,null,null,"wrocławski","Żórawina"]
[null,null,null,null,null,null,null,null,null,null,null,null,null,null,null,null,null,null,null,null,null,null,null,null,null,"Wrocław","Wrocław"]
[null,null,null,null,null,null,null,null,null,null,null,null,null,null,null,null,null,null,null,null,null,null,null,null,null,"Wrocław","Wrocław-Fabryczna"]
[null,null,null,null,null,null,null,null,null,null,null,null,null,null,null,null,null,null,null,null,null,null,null,null,null,"Wrocław","Wrocław-Krzyki"]
[null,null,null,null,null,null,null,null,null,null,null,null,null,null,null,null,null,null,null,null,null,null,null,null,null,"Wrocław","Wrocław-Psie Pole"]
[null,null,null,null,null,null,null,null,null,null,null,null,null,null,null,null,null,null,null,null,null,null,null,null,null,"Wrocław","Wrocław-Stare Miasto"]
[null,null,null,null,null,null,null,null,null,null,null,null,null,null,null,null,null,null,null,null,null,null,null,null,null,"Wrocław","Wrocław-Śródmieście"]
[null,null,null,null,null,null,null,null,null,null,null,null,null,null,null,null,null,null,null,null,null,null,null,null,null,"brzeski","Brzeg"]
[null,null,null,null,null,null,null,null,null,null,null,null,null,null,null,null,null,null,null,null,null,null,null,null,null,"brzeski","Skarbimierz"]
[null,null,null,null,null,null,null,null,null,null,null,null,null,null,null,null,null,null,null,null,null,null,null,null,null,"brzeski","Grodków"]
[null,null,null,null,null,null,null,null,null,null,null,null,null,null,null,null,null,null,null,null,null,null,null,null,null,"brzeski","Lewin Brzeski"]
[null,null,null,null,null,null,null,null,null,null,null,null,null,null,null,null,null,null,null,null,null,null,null,null,null,"brzeski","Lubsza"]
[null,null,null,null,null,null,null,null,null,null,null,null,null,null,null,null,null,null,null,null,null,null,null,null,null,"brzeski","Olszanka"]
[null,null,null,null,null,null,null,null,null,null,null,null,null,null,null,null,null,null,null,null,null,null,null,null,null,"głubczycki","Baborów"]
[null,null,null,null,null,null,null,null,null,null,null,null,null,null,null,null,null,null,null,null,null,null,null,null,null,"głubczycki","Branice"]
[null,null,null,null,null,null,null,null,null,null,null,null,null,null,null,null,null,null,null,null,null,null,null,null,null,"głubczycki","Głubczyce"]
[null,null,null,null,null,null,null,null,null,null,null,null,null,null,null,null,null,null,null,null,null,null,null,null,null,"głubczycki","Kietrz"]
[null,null,null,null,null,null,null,null,null,null,null,null,null,null,null,null,null,null,null,null,null,null,null,null,null,"namysłowski","Domaszowice"]
[null,null,null,null,null,null,null,null,null,null,null,null,null,null,null,null,null,null,null,null,null,null,null,null,null,"namysłowski","Namysłów"]
[null,null,null,null,null,null,null,null,null,null,null,null,null,null,null,null,null,null,null,null,null,null,null,null,null,"namysłowski","Pokój"]
[null,null,null,null,null,null,null,null,null,null,null,null,null,null,null,null,null,null,null,null,null,null,null,null,null,"namysłowski","Świerczów"]
[null,null,null,null,null,null,null,null,null,null,null,null,null,null,null,null,null,null,null,null,null,null,null,null,null,"namysłowski","Wilków"]
[null,null,null,null,null,null,null,null,null,null,null,null,null,null,null,null,null,null,null,null,null,null,null,null,null,"nyski","Głuchołazy"]
[null,null,null,null,null,null,null,null,null,null,null,null,null,null,null,null,null,null,null,null,null,null,null,null,null,"nyski","Kamiennik"]
[null,null,null,null,null,null,null,null,null,null,null,null,null,null,null,null,null,null,null,null,null,null,null,null,null,"nyski","Korfantów"]
[null,null,null,null,null,null,null,null,null,null,null,null,null,null,null,null,null,null,null,null,null,null,null,null,null,"nyski","Łambinowice"]
[null,null,null,null,null,null,null,null,null,null,null,null,null,null,null,null,null,null,null,null,null,null,null,null,null,"nyski","Nysa"]
[null,null,null,null,null,null,null,null,null,null,null,null,null,null,null,null,null,null,null,null,null,null,null,null,null,"nyski","Otmuchów"]
[null,null,null,null,null,null,null,null,null,null,null,null,null,null,null,null,null,null,null,null,null,null,null,null,null,"nyski","Paczków"]
[null,null,null,null,null,null,null,null,null,null,null,null,null,null,null,null,null,null,null,null,null,null,null,null,null,"nyski","Pakosławice"]
[null,null,null,null,null,null,null,null,null,null,null,null,null,null,null,null,null,null,null,null,null,null,null,null,null,"nyski","Skoroszyce"]
[null,null,null,null,null,null,null,null,null,null,null,null,null,null,null,null,null,null,null,null,null,null,null,null,null,"prudnicki","Biała"]
[null,null,null,null,null,null,null,null,null,null,null,null,null,null,null,null,null,null,null,null,null,null,null,null,null,"prudnicki","Głogówek"]
[null,null,null,null,null,null,null,null,null,null,null,null,null,null,null,null,null,null,null,null,null,null,null,null,null,"prudnicki","Lubrza"]
[null,null,null,null,null,null,null,null,null,null,null,null,null,null,null,null,null,null,null,null,null,null,null,null,null,"prudnicki","Prudnik"]
[null,null,null,null,null,null,null,null,null,null,null,null,null,null,null,null,null,null,null,null,null,null,null,null,null,"kędzierzyńsko-kozielski","Kędzierzyn-Koźle"]
[null,null,null,null,null,null,null,null,null,null,null,null,null,null,null,null,null,null,null,null,null,null,null,null,null,"kędzierzyńsko-kozielski","Bierawa"]
[null,null,null,null,null,null,null,null,null,null,null,null,null,null,null,null,null,null,null,null,null,null,null,null,null,"kędzierzyńsko-kozielski","Cisek"]
[null,null,null,null,null,null,null,null,null,null,null,null,null,null,null,null,null,null,null,null,null,null,null,null,null,"kędzierzyńsko-kozielski","Pawłowiczki"]
[null,null,null,null,null,null,null,null,null,null,null,null,null,null,null,null,null,null,null,null,null,null,null,null,null,"kędzierzyńsko-kozielski","Polska Cerekiew"]
[null,null,null,null,null,null,null,null,null,null,null,null,null,null,null,null,null,null,null,null,null,null,null,null,null,"kędzierzyńsko-kozielski","Reńska Wieś"]
[null,null,null,null,null,null,null,null,null,null,null,null,null,null,null,null,null,null,null,null,null,null,null,null,null,"kluczborski","Byczyna"]
[null,null,null,null,null,null,null,null,null,null,null,null,null,null,null,null,null,null,null,null,null,null,null,null,null,"kluczborski","Kluczbork"]
[null,null,null,null,null,null,null,null,null,null,null,null,null,null,null,null,null,null,null,null,null,null,null,null,null,"kluczborski","Lasowice Wielkie"]
[null,null,null,null,null,null,null,null,null,null,null,null,null,null,null,null,null,null,null,null,null,null,null,null,null,"kluczborski","Wołczyn"]
[null,null,null,null,null,null,null,null,null,null,null,null,null,null,null,null,null,null,null,null,null,null,null,null,null,"krapkowicki","Gogolin"]
[null,null,null,null,null,null,null,null,null,null,null,null,null,null,null,null,null,null,null,null,null,null,null,null,null,"krapkowicki","Krapkowice"]
[null,null,null,null,null,null,null,null,null,null,null,null,null,null,null,null,null,null,null,null,null,null,null,null,null,"krapkowicki","Strzeleczki"]
[null,null,null,null,null,null,null,null,null,null,null,null,null,null,null,null,null,null,null,null,null,null,null,null,null,"krapkowicki","Walce"]
[null,null,null,null,null,null,null,null,null,null,null,null,null,null,null,null,null,null,null,null,null,null,null,null,null,"krapkowicki","Zdzieszowice"]
[null,null,null,null,null,null,null,null,null,null,null,null,null,null,null,null,null,null,null,null,null,null,null,null,null,"oleski","Dobrodzień"]
[null,null,null,null,null,null,null,null,null,null,null,null,null,null,null,null,null,null,null,null,null,null,null,null,null,"oleski","Gorzów Śląski"]
[null,null,null,null,null,null,null,null,null,null,null,null,null,null,null,null,null,null,null,null,null,null,null,null,null,"oleski","Olesno"]
[null,null,null,null,null,null,null,null,null,null,null,null,null,null,null,null,null,null,null,null,null,null,null,null,null,"oleski","Praszka"]
[null,null,null,null,null,null,null,null,null,null,null,null,null,null,null,null,null,null,null,null,null,null,null,null,null,"oleski","Radłów"]
[null,null,null,null,null,null,null,null,null,null,null,null,null,null,null,null,null,null,null,null,null,null,null,null,null,"oleski","Rudniki"]
[null,null,null,null,null,null,null,null,null,null,null,null,null,null,null,null,null,null,null,null,null,null,null,null,null,"oleski","Zębowice"]
[null,null,null,null,null,null,null,null,null,null,null,null,null,null,null,null,null,null,null,null,null,null,null,null,null,"opolski","Chrząstowice"]
[null,null,null,null,null,null,null,null,null,null,null,null,null,null,null,null,null,null,null,null,null,null,null,null,null,"opolski","Dąbrowa"]
[null,null,null,null,null,null,null,null,null,null,null,null,null,null,null,null,null,null,null,null,null,null,null,null,null,"opolski","Dobrzeń Wielki"]
[null,null,null,null,null,null,null,null,null,null,null,null,null,null,null,null,null,null,null,null,null,null,null,null,null,"opolski","Komprachcice"]
[null,null,null,null,null,null,null,null,null,null,null,null,null,null,null,null,null,null,null,null,null,null,null,null,null,"opolski","Łubniany"]
[null,null,null,null,null,null,null,null,null,null,null,null,null,null,null,null,null,null,null,null,null,null,null,null,null,"opolski","Murów"]
[null,null,null,null,null,null,null,null,null,null,null,null,null,null,null,null,null,null,null,null,null,null,null,null,null,"opolski","Niemodlin"]
[null,null,null,null,null,null,null,null,null,null,null,null,null,null,null,null,null,null,null,null,null,null,null,null,null,"opolski","Ozimek"]
[null,null,null,null,null,null,null,null,null,null,null,null,null,null,null,null,null,null,null,null,null,null,null,null,null,"opolski","Popielów"]
[null,null,null,null,null,null,null,null,null,null,null,null,null,null,null,null,null,null,null,null,null,null,null,null,null,"opolski","Prószków"]
[null,null,null,null,null,null,null,null,null,null,null,null,null,null,null,null,null,null,null,null,null,null,null,null,null,"opolski","Tarnów Opolski"]
[null,null,null,null,null,null,null,null,null,null,null,null,null,null,null,null,null,null,null,null,null,null,null,null,null,"opolski","Tułowice"]
[null,null,null,null,null,null,null,null,null,null,null,null,null,null,null,null,null,null,null,null,null,null,null,null,null,"opolski","Turawa"]
[null,null,null,null,null,null,null,null,null,null,null,null,null,null,null,null,null,null,null,null,null,null,null,null,null,"strzelecki","Izbicko"]
[null,null,null,null,null,null,null,null,null,null,null,null,null,null,null,null,null,null,null,null,null,null,null,null,null,"strzelecki","Jemielnica"]
[null,null,null,null,null,null,null,null,null,null,null,null,null,null,null,null,null,null,null,null,null,null,null,null,null,"strzelecki","Kolonowskie"]
[null,null,null,null,null,null,null,null,null,null,null,null,null,null,null,null,null,null,null,null,null,null,null,null,null,"strzelecki","Leśnica"]
[null,null,null,null,null,null,null,null,null,null,null,null,null,null,null,null,null,null,null,null,null,null,null,null,null,"strzelecki","Strzelce Opolskie"]
[null,null,null,null,null,null,null,null,null,null,null,null,null,null,null,null,null,null,null,null,null,null,null,null,null,"strzelecki","Ujazd"]
[null,null,null,null,null,null,null,null,null,null,null,null,null,null,null,null,null,null,null,null,null,null,null,null,null,"strzelecki","Zawadzkie"]
[null,null,null,null,null,null,null,null,null,null,null,null,null,null,null,null,null,null,null,null,null,null,null,null,null,"Opole","Opole"]
[null,null,null,null,null,null,null,null,null,null,null,null,null,null,null,null,null,null,null,null,null,null,null,null,null,"bydgoski","Białe Błota"]
[null,null,null,null,null,null,null,null,null,null,null,null,null,null,null,null,null,null,null,null,null,null,null,null,null,"bydgoski","Dąbrowa Chełmińska"]
[null,null,null,null,null,null,null,null,null,null,null,null,null,null,null,null,null,null,null,null,null,null,null,null,null,"bydgoski","Dobrcz"]
[null,null,null,null,null,null,null,null,null,null,null,null,null,null,null,null,null,null,null,null,null,null,null,null,null,"bydgoski","Koronowo"]
[null,null,null,null,null,null,null,null,null,null,null,null,null,null,null,null,null,null,null,null,null,null,null,null,null,"bydgoski","Nowa Wieś Wielka"]
[null,null,null,null,null,null,null,null,null,null,null,null,null,null,null,null,null,null,null,null,null,null,null,null,null,"bydgoski","Osielsko"]
[null,null,null,null,null,null,null,null,null,null,null,null,null,null,null,null,null,null,null,null,null,null,null,null,null,"bydgoski","Sicienko"]
[null,null,null,null,null,null,null,null,null,null,null,null,null,null,null,null,null,null,null,null,null,null,null,null,null,"bydgoski","Solec Kujawski"]
[null,null,null,null,null,null,null,null,null,null,null,null,null,null,null,null,null,null,null,null,null,null,null,null,null,"toruński","Chełmża"]
[null,null,null,null,null,null,null,null,null,null,null,null,null,null,null,null,null,null,null,null,null,null,null,null,null,"toruński","Czernikowo"]
[null,null,null,null,null,null,null,null,null,null,null,null,null,null,null,null,null,null,null,null,null,null,null,null,null,"toruński","Lubicz"]
[null,null,null,null,null,null,null,null,null,null,null,null,null,null,null,null,null,null,null,null,null,null,null,null,null,"toruński","Łubianka"]
[null,null,null,null,null,null,null,null,null,null,null,null,null,null,null,null,null,null,null,null,null,null,null,null,null,"toruński","Łysomice"]
[null,null,null,null,null,null,null,null,null,null,null,null,null,null,null,null,null,null,null,null,null,null,null,null,null,"toruński","Obrowo"]
[null,null,null,null,null,null,null,null,null,null,null,null,null,null,null,null,null,null,null,null,null,null,null,null,null,"toruński","Wielka Nieszawka"]
[null,null,null,null,null,null,null,null,null,null,null,null,null,null,null,null,null,null,null,null,null,null,null,null,null,"toruński","Zławieś Wielka"]
[null,null,null,null,null,null,null,null,null,null,null,null,null,null,null,null,null,null,null,null,null,null,null,null,null,"Bydgoszcz","Bydgoszcz"]
[null,null,null,null,null,null,null,null,null,null,null,null,null,null,null,null,null,null,null,null,null,null,null,null,null,"Toruń","Toruń"]
[null,null,null,null,null,null,null,null,null,null,null,null,null,null,null,null,null,null,null,null,null,null,null,null,null,"brodnicki","Brodnica"]
[null,null,null,null,null,null,null,null,null,null,null,null,null,null,null,null,null,null,null,null,null,null,null,null,null,"brodnicki","Bobrowo"]
[null,null,null,null,null,null,null,null,null,null,null,null,null,null,null,null,null,null,null,null,null,null,null,null,null,"brodnicki","Brzozie"]
[null,null,null,null,null,null,null,null,null,null,null,null,null,null,null,null,null,null,null,null,null,null,null,null,null,"brodnicki","Górzno"]
[null,null,null,null,null,null,null,null,null,null,null,null,null,null,null,null,null,null,null,null,null,null,null,null,null,"brodnicki","Bartniczka"]
[null,null,null,null,null,null,null,null,null,null,null,null,null,null,null,null,null,null,null,null,null,null,null,null,null,"brodnicki","Jabłonowo Pomorskie"]
[null,null,null,null,null,null,null,null,null,null,null,null,null,null,null,null,null,null,null,null,null,null,null,null,null,"brodnicki","Osiek"]
[null,null,null,null,null,null,null,null,null,null,null,null,null,null,null,null,null,null,null,null,null,null,null,null,null,"brodnicki","Świedziebnia"]
[null,null,null,null,null,null,null,null,null,null,null,null,null,null,null,null,null,null,null,null,null,null,null,null,null,"brodnicki","Zbiczno"]
[null,null,null,null,null,null,null,null,null,null,null,null,null,null,null,null,null,null,null,null,null,null,null,null,null,"chełmiński","Chełmno"]
[null,null,null,null,null,null,null,null,null,null,null,null,null,null,null,null,null,null,null,null,null,null,null,null,null,"chełmiński","Kijewo Królewskie"]
[null,null,null,null,null,null,null,null,null,null,null,null,null,null,null,null,null,null,null,null,null,null,null,null,null,"chełmiński","Lisewo"]
[null,null,null,null,null,null,null,null,null,null,null,null,null,null,null,null,null,null,null,null,null,null,null,null,null,"chełmiński","Papowo Biskupie"]
[null,null,null,null,null,null,null,null,null,null,null,null,null,null,null,null,null,null,null,null,null,null,null,null,null,"chełmiński","Stolno"]
[null,null,null,null,null,null,null,null,null,null,null,null,null,null,null,null,null,null,null,null,null,null,null,null,null,"chełmiński","Unisław"]
[null,null,null,null,null,null,null,null,null,null,null,null,null,null,null,null,null,null,null,null,null,null,null,null,null,"golubsko-dobrzyński","Ciechocin"]
[null,null,null,null,null,null,null,null,null,null,null,null,null,null,null,null,null,null,null,null,null,null,null,null,null,"golubsko-dobrzyński","Golub-Dobrzyń"]
[null,null,null,null,null,null,null,null,null,null,null,null,null,null,null,null,null,null,null,null,null,null,null,null,null,"golubsko-dobrzyński","Kowalewo Pomorskie"]
[null,null,null,null,null,null,null,null,null,null,null,null,null,null,null,null,null,null,null,null,null,null,null,null,null,"golubsko-dobrzyński","Radomin"]
[null,null,null,null,null,null,null,null,null,null,null,null,null,null,null,null,null,null,null,null,null,null,null,null,null,"golubsko-dobrzyński","Zbójno"]
[null,null,null,null,null,null,null,null,null,null,null,null,null,null,null,null,null,null,null,null,null,null,null,null,null,"grudziądzki","Grudziądz"]
[null,null,null,null,null,null,null,null,null,null,null,null,null,null,null,null,null,null,null,null,null,null,null,null,null,"grudziądzki","Gruta"]
[null,null,null,null,null,null,null,null,null,null,null,null,null,null,null,null,null,null,null,null,null,null,null,null,null,"grudziądzki","Łasin"]
[null,null,null,null,null,null,null,null,null,null,null,null,null,null,null,null,null,null,null,null,null,null,null,null,null,"grudziądzki","Radzyń Chełmiński"]
[null,null,null,null,null,null,null,null,null,null,null,null,null,null,null,null,null,null,null,null,null,null,null,null,null,"grudziądzki","Rogóźno"]
[null,null,null,null,null,null,null,null,null,null,null,null,null,null,null,null,null,null,null,null,null,null,null,null,null,"grudziądzki","Świecie nad Osą"]
[null,null,null,null,null,null,null,null,null,null,null,null,null,null,null,null,null,null,null,null,null,null,null,null,null,"rypiński","Rypin"]
[null,null,null,null,null,null,null,null,null,null,null,null,null,null,null,null,null,null,null,null,null,null,null,null,null,"rypiński","Brzuze"]
[null,null,null,null,null,null,null,null,null,null,null,null,null,null,null,null,null,null,null,null,null,null,null,null,null,"rypiński","Rogowo"]
[null,null,null,null,null,null,null,null,null,null,null,null,null,null,null,null,null,null,null,null,null,null,null,null,null,"rypiński","Skrwilno"]
[null,null,null,null,null,null,null,null,null,null,null,null,null,null,null,null,null,null,null,null,null,null,null,null,null,"rypiński","Wąpielsk"]
[null,null,null,null,null,null,null,null,null,null,null,null,null,null,null,null,null,null,null,null,null,null,null,null,null,"wąbrzeski","Wąbrzeźno"]
[null,null,null,null,null,null,null,null,null,null,null,null,null,null,null,null,null,null,null,null,null,null,null,null,null,"wąbrzeski","Dębowa Łąka"]
[null,null,null,null,null,null,null,null,null,null,null,null,null,null,null,null,null,null,null,null,null,null,null,null,null,"wąbrzeski","Książki"]
[null,null,null,null,null,null,null,null,null,null,null,null,null,null,null,null,null,null,null,null,null,null,null,null,null,"wąbrzeski","Płużnica"]
[null,null,null,null,null,null,null,null,null,null,null,null,null,null,null,null,null,null,null,null,null,null,null,null,null,"wąbrzeski","Ryńsk"]
[null,null,null,null,null,null,null,null,null,null,null,null,null,null,null,null,null,null,null,null,null,null,null,null,null,"Grudziądz","Grudziądz"]
[null,null,null,null,null,null,null,null,null,null,null,null,null,null,null,null,null,null,null,null,null,null,null,null,null,"aleksandrowski","Aleksandrów Kujawski"]
[null,null,null,null,null,null,null,null,null,null,null,null,null,null,null,null,null,null,null,null,null,null,null,null,null,"aleksandrowski","Ciechocinek"]
[null,null,null,null,null,null,null,null,null,null,null,null,null,null,null,null,null,null,null,null,null,null,null,null,null,"aleksandrowski","Nieszawa"]
[null,null,null,null,null,null,null,null,null,null,null,null,null,null,null,null,null,null,null,null,null,null,null,null,null,"aleksandrowski","Bądkowo"]
[null,null,null,null,null,null,null,null,null,null,null,null,null,null,null,null,null,null,null,null,null,null,null,null,null,"aleksandrowski","Koneck"]
[null,null,null,null,null,null,null,null,null,null,null,null,null,null,null,null,null,null,null,null,null,null,null,null,null,"aleksandrowski","Raciążek"]
[null,null,null,null,null,null,null,null,null,null,null,null,null,null,null,null,null,null,null,null,null,null,null,null,null,"aleksandrowski","Waganiec"]
[null,null,null,null,null,null,null,null,null,null,null,null,null,null,null,null,null,null,null,null,null,null,null,null,null,"aleksandrowski","Zakrzewo"]
[null,null,null,null,null,null,null,null,null,null,null,null,null,null,null,null,null,null,null,null,null,null,null,null,null,"lipnowski","Lipno"]
[null,null,null,null,null,null,null,null,null,null,null,null,null,null,null,null,null,null,null,null,null,null,null,null,null,"lipnowski","Bobrowniki"]
[null,null,null,null,null,null,null,null,null,null,null,null,null,null,null,null,null,null,null,null,null,null,null,null,null,"lipnowski","Chrostkowo"]
[null,null,null,null,null,null,null,null,null,null,null,null,null,null,null,null,null,null,null,null,null,null,null,null,null,"lipnowski","Dobrzyń nad Wisłą"]
[null,null,null,null,null,null,null,null,null,null,null,null,null,null,null,null,null,null,null,null,null,null,null,null,null,"lipnowski","Kikół"]
[null,null,null,null,null,null,null,null,null,null,null,null,null,null,null,null,null,null,null,null,null,null,null,null,null,"lipnowski","Lipno"]
[null,null,null,null,null,null,null,null,null,null,null,null,null,null,null,null,null,null,null,null,null,null,null,null,null,"lipnowski","Skępe"]
[null,null,null,null,null,null,null,null,null,null,null,null,null,null,null,null,null,null,null,null,null,null,null,null,null,"lipnowski","Tłuchowo"]
[null,null,null,null,null,null,null,null,null,null,null,null,null,null,null,null,null,null,null,null,null,null,null,null,null,"lipnowski","Wielgie"]
[null,null,null,null,null,null,null,null,null,null,null,null,null,null,null,null,null,null,null,null,null,null,null,null,null,"radziejowski","Radziejów"]
[null,null,null,null,null,null,null,null,null,null,null,null,null,null,null,null,null,null,null,null,null,null,null,null,null,"radziejowski","Bytoń"]
[null,null,null,null,null,null,null,null,null,null,null,null,null,null,null,null,null,null,null,null,null,null,null,null,null,"radziejowski","Dobre"]
[null,null,null,null,null,null,null,null,null,null,null,null,null,null,null,null,null,null,null,null,null,null,null,null,null,"radziejowski","Osięciny"]
[null,null,null,null,null,null,null,null,null,null,null,null,null,null,null,null,null,null,null,null,null,null,null,null,null,"radziejowski","Piotrków Kujawski"]
[null,null,null,null,null,null,null,null,null,null,null,null,null,null,null,null,null,null,null,null,null,null,null,null,null,"radziejowski","Radziejów"]
[null,null,null,null,null,null,null,null,null,null,null,null,null,null,null,null,null,null,null,null,null,null,null,null,null,"radziejowski","Topólka"]
[null,null,null,null,null,null,null,null,null,null,null,null,null,null,null,null,null,null,null,null,null,null,null,null,null,"włocławski","Kowal"]
[null,null,null,null,null,null,null,null,null,null,null,null,null,null,null,null,null,null,null,null,null,null,null,null,null,"włocławski","Baruchowo"]
[null,null,null,null,null,null,null,null,null,null,null,null,null,null,null,null,null,null,null,null,null,null,null,null,null,"włocławski","Boniewo"]
[null,null,null,null,null,null,null,null,null,null,null,null,null,null,null,null,null,null,null,null,null,null,null,null,null,"włocławski","Brześć Kujawski"]
[null,null,null,null,null,null,null,null,null,null,null,null,null,null,null,null,null,null,null,null,null,null,null,null,null,"włocławski","Choceń"]
[null,null,null,null,null,null,null,null,null,null,null,null,null,null,null,null,null,null,null,null,null,null,null,null,null,"włocławski","Chodecz"]
[null,null,null,null,null,null,null,null,null,null,null,null,null,null,null,null,null,null,null,null,null,null,null,null,null,"włocławski","Fabianki"]
[null,null,null,null,null,null,null,null,null,null,null,null,null,null,null,null,null,null,null,null,null,null,null,null,null,"włocławski","Izbica Kujawska"]
[null,null,null,null,null,null,null,null,null,null,null,null,null,null,null,null,null,null,null,null,null,null,null,null,null,"włocławski","Kowal"]
[null,null,null,null,null,null,null,null,null,null,null,null,null,null,null,null,null,null,null,null,null,null,null,null,null,"włocławski","Lubanie"]
[null,null,null,null,null,null,null,null,null,null,null,null,null,null,null,null,null,null,null,null,null,null,null,null,null,"włocławski","Lubień Kujawski"]
[null,null,null,null,null,null,null,null,null,null,null,null,null,null,null,null,null,null,null,null,null,null,null,null,null,"włocławski","Lubraniec"]
[null,null,null,null,null,null,null,null,null,null,null,null,null,null,null,null,null,null,null,null,null,null,null,null,null,"włocławski","Włocławek"]
[null,null,null,null,null,null,null,null,null,null,null,null,null,null,null,null,null,null,null,null,null,null,null,null,null,"Włocławek","Włocławek"]
[null,null,null,null,null,null,null,null,null,null,null,null,null,null,null,null,null,null,null,null,null,null,null,null,null,"inowrocławski","Inowrocław"]
[null,null,null,null,null,null,null,null,null,null,null,null,null,null,null,null,null,null,null,null,null,null,null,null,null,"inowrocławski","Dąbrowa Biskupia"]
[null,null,null,null,null,null,null,null,null,null,null,null,null,null,null,null,null,null,null,null,null,null,null,null,null,"inowrocławski","Gniewkowo"]
[null,null,null,null,null,null,null,null,null,null,null,null,null,null,null,null,null,null,null,null,null,null,null,null,null,"inowrocławski","Inowrocław"]
[null,null,null,null,null,null,null,null,null,null,null,null,null,null,null,null,null,null,null,null,null,null,null,null,null,"inowrocławski","Janikowo"]
[null,null,null,null,null,null,null,null,null,null,null,null,null,null,null,null,null,null,null,null,null,null,null,null,null,"inowrocławski","Kruszwica"]
[null,null,null,null,null,null,null,null,null,null,null,null,null,null,null,null,null,null,null,null,null,null,null,null,null,"inowrocławski","Pakość"]
[null,null,null,null,null,null,null,null,null,null,null,null,null,null,null,null,null,null,null,null,null,null,null,null,null,"inowrocławski","Rojewo"]
[null,null,null,null,null,null,null,null,null,null,null,null,null,null,null,null,null,null,null,null,null,null,null,null,null,"inowrocławski","Złotniki Kujawskie"]
[null,null,null,null,null,null,null,null,null,null,null,null,null,null,null,null,null,null,null,null,null,null,null,null,null,"mogileński","Dąbrowa"]
[null,null,null,null,null,null,null,null,null,null,null,null,null,null,null,null,null,null,null,null,null,null,null,null,null,"mogileński","Jeziora Wielkie"]
[null,null,null,null,null,null,null,null,null,null,null,null,null,null,null,null,null,null,null,null,null,null,null,null,null,"mogileński","Mogilno"]
[null,null,null,null,null,null,null,null,null,null,null,null,null,null,null,null,null,null,null,null,null,null,null,null,null,"mogileński","Strzelno"]
[null,null,null,null,null,null,null,null,null,null,null,null,null,null,null,null,null,null,null,null,null,null,null,null,null,"nakielski","Kcynia"]
[null,null,null,null,null,null,null,null,null,null,null,null,null,null,null,null,null,null,null,null,null,null,null,null,null,"nakielski","Mrocza"]
[null,null,null,null,null,null,null,null,null,null,null,null,null,null,null,null,null,null,null,null,null,null,null,null,null,"nakielski","Nakło nad Notecią"]
[null,null,null,null,null,null,null,null,null,null,null,null,null,null,null,null,null,null,null,null,null,null,null,null,null,"nakielski","Sadki"]
[null,null,null,null,null,null,null,null,null,null,null,null,null,null,null,null,null,null,null,null,null,null,null,null,null,"nakielski","Szubin"]
[null,null,null,null,null,null,null,null,null,null,null,null,null,null,null,null,null,null,null,null,null,null,null,null,null,"żniński","Barcin"]
[null,null,null,null,null,null,null,null,null,null,null,null,null,null,null,null,null,null,null,null,null,null,null,null,null,"żniński","Gąsawa"]
[null,null,null,null,null,null,null,null,null,null,null,null,null,null,null,null,null,null,null,null,null,null,null,null,null,"żniński","Janowiec Wielkopolski"]
[null,null,null,null,null,null,null,null,null,null,null,null,null,null,null,null,null,null,null,null,null,null,null,null,null,"żniński","Łabiszyn"]
[null,null,null,null,null,null,null,null,null,null,null,null,null,null,null,null,null,null,null,null,null,null,null,null,null,"żniński","Rogowo"]
[null,null,null,null,null,null,null,null,null,null,null,null,null,null,null,null,null,null,null,null,null,null,null,null,null,"żniński","Żnin"]
[null,null,null,null,null,null,null,null,null,null,null,null,null,null,null,null,null,null,null,null,null,null,null,null,null,"sępoleński","Kamień Krajeński"]
[null,null,null,null,null,null,null,null,null,null,null,null,null,null,null,null,null,null,null,null,null,null,null,null,null,"sępoleński","Sępólno Krajeńskie"]
[null,null,null,null,null,null,null,null,null,null,null,null,null,null,null,null,null,null,null,null,null,null,null,null,null,"sępoleński","Sośno"]
[null,null,null,null,null,null,null,null,null,null,null,null,null,null,null,null,null,null,null,null,null,null,null,null,null,"sępoleński","Więcbork"]
[null,null,null,null,null,null,null,null,null,null,null,null,null,null,null,null,null,null,null,null,null,null,null,null,null,"świecki","Bukowiec"]
[null,null,null,null,null,null,null,null,null,null,null,null,null,null,null,null,null,null,null,null,null,null,null,null,null,"świecki","Dragacz"]
[null,null,null,null,null,null,null,null,null,null,null,null,null,null,null,null,null,null,null,null,null,null,null,null,null,"świecki","Drzycim"]
[null,null,null,null,null,null,null,null,null,null,null,null,null,null,null,null,null,null,null,null,null,null,null,null,null,"świecki","Jeżewo"]
[null,null,null,null,null,null,null,null,null,null,null,null,null,null,null,null,null,null,null,null,null,null,null,null,null,"świecki","Lniano"]
[null,null,null,null,null,null,null,null,null,null,null,null,null,null,null,null,null,null,null,null,null,null,null,null,null,"świecki","Nowe"]
[null,null,null,null,null,null,null,null,null,null,null,null,null,null,null,null,null,null,null,null,null,null,null,null,null,"świecki","Osie"]
[null,null,null,null,null,null,null,null,null,null,null,null,null,null,null,null,null,null,null,null,null,null,null,null,null,"świecki","Pruszcz"]
[null,null,null,null,null,null,null,null,null,null,null,null,null,null,null,null,null,null,null,null,null,null,null,null,null,"świecki","Świecie"]
[null,null,null,null,null,null,null,null,null,null,null,null,null,null,null,null,null,null,null,null,null,null,null,null,null,"świecki","Świekatowo"]
[null,null,null,null,null,null,null,null,null,null,null,null,null,null,null,null,null,null,null,null,null,null,null,null,null,"świecki","Warlubie"]
[null,null,null,null,null,null,null,null,null,null,null,null,null,null,null,null,null,null,null,null,null,null,null,null,null,"tucholski","Cekcyn"]
[null,null,null,null,null,null,null,null,null,null,null,null,null,null,null,null,null,null,null,null,null,null,null,null,null,"tucholski","Gostycyn"]
[null,null,null,null,null,null,null,null,null,null,null,null,null,null,null,null,null,null,null,null,null,null,null,null,null,"tucholski","Kęsowo"]
[null,null,null,null,null,null,null,null,null,null,null,null,null,null,null,null,null,null,null,null,null,null,null,null,null,"tucholski","Lubiewo"]
[null,null,null,null,null,null,null,null,null,null,null,null,null,null,null,null,null,null,null,null,null,null,null,null,null,"tucholski","Śliwice"]
[null,null,null,null,null,null,null,null,null,null,null,null,null,null,null,null,null,null,null,null,null,null,null,null,null,"tucholski","Tuchola"]
[null,null,null,null,null,null,null,null,null,null,null,null,null,null,null,null,null,null,null,null,null,null,null,null,null,"gdański","Pruszcz Gdański"]
[null,null,null,null,null,null,null,null,null,null,null,null,null,null,null,null,null,null,null,null,null,null,null,null,null,"gdański","Cedry Wielkie"]
[null,null,null,null,null,null,null,null,null,null,null,null,null,null,null,null,null,null,null,null,null,null,null,null,null,"gdański","Kolbudy"]
[null,null,null,null,null,null,null,null,null,null,null,null,null,null,null,null,null,null,null,null,null,null,null,null,null,"gdański","Pruszcz Gdański"]
[null,null,null,null,null,null,null,null,null,null,null,null,null,null,null,null,null,null,null,null,null,null,null,null,null,"gdański","Przywidz"]
[null,null,null,null,null,null,null,null,null,null,null,null,null,null,null,null,null,null,null,null,null,null,null,null,null,"gdański","Pszczółki"]
[null,null,null,null,null,null,null,null,null,null,null,null,null,null,null,null,null,null,null,null,null,null,null,null,null,"gdański","Suchy Dąb"]
[null,null,null,null,null,null,null,null,null,null,null,null,null,null,null,null,null,null,null,null,null,null,null,null,null,"gdański","Trąbki Wielkie"]
[null,null,null,null,null,null,null,null,null,null,null,null,null,null,null,null,null,null,null,null,null,null,null,null,null,"kartuski","Chmielno"]
[null,null,null,null,null,null,null,null,null,null,null,null,null,null,null,null,null,null,null,null,null,null,null,null,null,"kartuski","Kartuzy"]
[null,null,null,null,null,null,null,null,null,null,null,null,null,null,null,null,null,null,null,null,null,null,null,null,null,"kartuski","Przodkowo"]
[null,null,null,null,null,null,null,null,null,null,null,null,null,null,null,null,null,null,null,null,null,null,null,null,null,"kartuski","Sierakowice"]
[null,null,null,null,null,null,null,null,null,null,null,null,null,null,null,null,null,null,null,null,null,null,null,null,null,"kartuski","Somonino"]
[null,null,null,null,null,null,null,null,null,null,null,null,null,null,null,null,null,null,null,null,null,null,null,null,null,"kartuski","Stężyca"]
[null,null,null,null,null,null,null,null,null,null,null,null,null,null,null,null,null,null,null,null,null,null,null,null,null,"kartuski","Sulęczyno"]
[null,null,null,null,null,null,null,null,null,null,null,null,null,null,null,null,null,null,null,null,null,null,null,null,null,"kartuski","Żukowo"]
[null,null,null,null,null,null,null,null,null,null,null,null,null,null,null,null,null,null,null,null,null,null,null,null,null,"nowodworski","Krynica Morska"]
[null,null,null,null,null,null,null,null,null,null,null,null,null,null,null,null,null,null,null,null,null,null,null,null,null,"nowodworski","Nowy Dwór Gdański"]
[null,null,null,null,null,null,null,null,null,null,null,null,null,null,null,null,null,null,null,null,null,null,null,null,null,"nowodworski","Ostaszewo"]
[null,null,null,null,null,null,null,null,null,null,null,null,null,null,null,null,null,null,null,null,null,null,null,null,null,"nowodworski","Stegna"]
[null,null,null,null,null,null,null,null,null,null,null,null,null,null,null,null,null,null,null,null,null,null,null,null,null,"nowodworski","Sztutowo"]
[null,null,null,null,null,null,null,null,null,null,null,null,null,null,null,null,null,null,null,null,null,null,null,null,null,"pucki","Hel"]
[null,null,null,null,null,null,null,null,null,null,null,null,null,null,null,null,null,null,null,null,null,null,null,null,null,"pucki","Jastarnia"]
[null,null,null,null,null,null,null,null,null,null,null,null,null,null,null,null,null,null,null,null,null,null,null,null,null,"pucki","Puck"]
[null,null,null,null,null,null,null,null,null,null,null,null,null,null,null,null,null,null,null,null,null,null,null,null,null,"pucki","Władysławowo"]
[null,null,null,null,null,null,null,null,null,null,null,null,null,null,null,null,null,null,null,null,null,null,null,null,null,"pucki","Kosakowo"]
[null,null,null,null,null,null,null,null,null,null,null,null,null,null,null,null,null,null,null,null,null,null,null,null,null,"pucki","Krokowa"]
[null,null,null,null,null,null,null,null,null,null,null,null,null,null,null,null,null,null,null,null,null,null,null,null,null,"pucki","Puck"]
[null,null,null,null,null,null,null,null,null,null,null,null,null,null,null,null,null,null,null,null,null,null,null,null,null,"wejherowski","Reda"]
[null,null,null,null,null,null,null,null,null,null,null,null,null,null,null,null,null,null,null,null,null,null,null,null,null,"wejherowski","Rumia"]
[null,null,null,null,null,null,null,null,null,null,null,null,null,null,null,null,null,null,null,null,null,null,null,null,null,"wejherowski","Wejherowo"]
[null,null,null,null,null,null,null,null,null,null,null,null,null,null,null,null,null,null,null,null,null,null,null,null,null,"wejherowski","Choczewo"]
[null,null,null,null,null,null,null,null,null,null,null,null,null,null,null,null,null,null,null,null,null,null,null,null,null,"wejherowski","Gniewino"]
[null,null,null,null,null,null,null,null,null,null,null,null,null,null,null,null,null,null,null,null,null,null,null,null,null,"wejherowski","Linia"]
[null,null,null,null,null,null,null,null,null,null,null,null,null,null,null,null,null,null,null,null,null,null,null,null,null,"wejherowski","Luzino"]
[null,null,null,null,null,null,null,null,null,null,null,null,null,null,null,null,null,null,null,null,null,null,null,null,null,"wejherowski","Łęczyce"]
[null,null,null,null,null,null,null,null,null,null,null,null,null,null,null,null,null,null,null,null,null,null,null,null,null,"wejherowski","Szemud"]
[null,null,null,null,null,null,null,null,null,null,null,null,null,null,null,null,null,null,null,null,null,null,null,null,null,"wejherowski","Wejherowo"]
[null,null,null,null,null,null,null,null,null,null,null,null,null,null,null,null,null,null,null,null,null,null,null,null,null,"bytowski","Borzytuchom"]
[null,null,null,null,null,null,null,null,null,null,null,null,null,null,null,null,null,null,null,null,null,null,null,null,null,"bytowski","Bytów"]
[null,null,null,null,null,null,null,null,null,null,null,null,null,null,null,null,null,null,null,null,null,null,null,null,null,"bytowski","Czarna Dąbrówka"]
[null,null,null,null,null,null,null,null,null,null,null,null,null,null,null,null,null,null,null,null,null,null,null,null,null,"bytowski","Kołczygłowy"]
[null,null,null,null,null,null,null,null,null,null,null,null,null,null,null,null,null,null,null,null,null,null,null,null,null,"bytowski","Lipnica"]
[null,null,null,null,null,null,null,null,null,null,null,null,null,null,null,null,null,null,null,null,null,null,null,null,null,"bytowski","Miastko"]
[null,null,null,null,null,null,null,null,null,null,null,null,null,null,null,null,null,null,null,null,null,null,null,null,null,"bytowski","Parchowo"]
[null,null,null,null,null,null,null,null,null,null,null,null,null,null,null,null,null,null,null,null,null,null,null,null,null,"bytowski","Studzienice"]
[null,null,null,null,null,null,null,null,null,null,null,null,null,null,null,null,null,null,null,null,null,null,null,null,null,"bytowski","Trzebielino"]
[null,null,null,null,null,null,null,null,null,null,null,null,null,null,null,null,null,null,null,null,null,null,null,null,null,"bytowski","Tuchomie"]
[null,null,null,null,null,null,null,null,null,null,null,null,null,null,null,null,null,null,null,null,null,null,null,null,null,"lęborski","Lębork"]
[null,null,null,null,null,null,null,null,null,null,null,null,null,null,null,null,null,null,null,null,null,null,null,null,null,"lęborski","Łeba"]
[null,null,null,null,null,null,null,null,null,null,null,null,null,null,null,null,null,null,null,null,null,null,null,null,null,"lęborski","Cewice"]
[null,null,null,null,null,null,null,null,null,null,null,null,null,null,null,null,null,null,null,null,null,null,null,null,null,"lęborski","Nowa Wieś Lęborska"]
[null,null,null,null,null,null,null,null,null,null,null,null,null,null,null,null,null,null,null,null,null,null,null,null,null,"lęborski","Wicko"]
[null,null,null,null,null,null,null,null,null,null,null,null,null,null,null,null,null,null,null,null,null,null,null,null,null,"słupski","Ustka"]
[null,null,null,null,null,null,null,null,null,null,null,null,null,null,null,null,null,null,null,null,null,null,null,null,null,"słupski","Damnica"]
[null,null,null,null,null,null,null,null,null,null,null,null,null,null,null,null,null,null,null,null,null,null,null,null,null,"słupski","Dębnica Kaszubska"]
[null,null,null,null,null,null,null,null,null,null,null,null,null,null,null,null,null,null,null,null,null,null,null,null,null,"słupski","Główczyce"]
[null,null,null,null,null,null,null,null,null,null,null,null,null,null,null,null,null,null,null,null,null,null,null,null,null,"słupski","Kępice"]
[null,null,null,null,null,null,null,null,null,null,null,null,null,null,null,null,null,null,null,null,null,null,null,null,null,"słupski","Kobylnica"]
[null,null,null,null,null,null,null,null,null,null,null,null,null,null,null,null,null,null,null,null,null,null,null,null,null,"słupski","Potęgowo"]
[null,null,null,null,null,null,null,null,null,null,null,null,null,null,null,null,null,null,null,null,null,null,null,null,null,"słupski","Słupsk"]
[null,null,null,null,null,null,null,null,null,null,null,null,null,null,null,null,null,null,null,null,null,null,null,null,null,"słupski","Smołdzino"]
[null,null,null,null,null,null,null,null,null,null,null,null,null,null,null,null,null,null,null,null,null,null,null,null,null,"słupski","Ustka"]
[null,null,null,null,null,null,null,null,null,null,null,null,null,null,null,null,null,null,null,null,null,null,null,null,null,"Słupsk","Słupsk"]
[null,null,null,null,null,null,null,null,null,null,null,null,null,null,null,null,null,null,null,null,null,null,null,null,null,"kwidzyński","Kwidzyn"]
[null,null,null,null,null,null,null,null,null,null,null,null,null,null,null,null,null,null,null,null,null,null,null,null,null,"kwidzyński","Gardeja"]
[null,null,null,null,null,null,null,null,null,null,null,null,null,null,null,null,null,null,null,null,null,null,null,null,null,"kwidzyński","Kwidzyn"]
[null,null,null,null,null,null,null,null,null,null,null,null,null,null,null,null,null,null,null,null,null,null,null,null,null,"kwidzyński","Prabuty"]
[null,null,null,null,null,null,null,null,null,null,null,null,null,null,null,null,null,null,null,null,null,null,null,null,null,"kwidzyński","Ryjewo"]
[null,null,null,null,null,null,null,null,null,null,null,null,null,null,null,null,null,null,null,null,null,null,null,null,null,"kwidzyński","Sadlinki"]
[null,null,null,null,null,null,null,null,null,null,null,null,null,null,null,null,null,null,null,null,null,null,null,null,null,"malborski","Malbork"]
[null,null,null,null,null,null,null,null,null,null,null,null,null,null,null,null,null,null,null,null,null,null,null,null,null,"malborski","Lichnowy"]
[null,null,null,null,null,null,null,null,null,null,null,null,null,null,null,null,null,null,null,null,null,null,null,null,null,"malborski","Malbork"]
[null,null,null,null,null,null,null,null,null,null,null,null,null,null,null,null,null,null,null,null,null,null,null,null,null,"malborski","Miłoradz"]
[null,null,null,null,null,null,null,null,null,null,null,null,null,null,null,null,null,null,null,null,null,null,null,null,null,"malborski","Nowy Staw"]
[null,null,null,null,null,null,null,null,null,null,null,null,null,null,null,null,null,null,null,null,null,null,null,null,null,"malborski","Stare Pole"]
[null,null,null,null,null,null,null,null,null,null,null,null,null,null,null,null,null,null,null,null,null,null,null,null,null,"starogardzki","Czarna Woda"]
[null,null,null,null,null,null,null,null,null,null,null,null,null,null,null,null,null,null,null,null,null,null,null,null,null,"starogardzki","Skórcz"]
[null,null,null,null,null,null,null,null,null,null,null,null,null,null,null,null,null,null,null,null,null,null,null,null,null,"starogardzki","Starogard Gdański"]
[null,null,null,null,null,null,null,null,null,null,null,null,null,null,null,null,null,null,null,null,null,null,null,null,null,"starogardzki","Bobowo"]
[null,null,null,null,null,null,null,null,null,null,null,null,null,null,null,null,null,null,null,null,null,null,null,null,null,"starogardzki","Kaliska"]
[null,null,null,null,null,null,null,null,null,null,null,null,null,null,null,null,null,null,null,null,null,null,null,null,null,"starogardzki","Lubichowo"]
[null,null,null,null,null,null,null,null,null,null,null,null,null,null,null,null,null,null,null,null,null,null,null,null,null,"starogardzki","Osieczna"]
[null,null,null,null,null,null,null,null,null,null,null,null,null,null,null,null,null,null,null,null,null,null,null,null,null,"starogardzki","Osiek"]
[null,null,null,null,null,null,null,null,null,null,null,null,null,null,null,null,null,null,null,null,null,null,null,null,null,"starogardzki","Skarszewy"]
[null,null,null,null,null,null,null,null,null,null,null,null,null,null,null,null,null,null,null,null,null,null,null,null,null,"starogardzki","Skórcz"]
[null,null,null,null,null,null,null,null,null,null,null,null,null,null,null,null,null,null,null,null,null,null,null,null,null,"starogardzki","Smętowo Graniczne"]
[null,null,null,null,null,null,null,null,null,null,null,null,null,null,null,null,null,null,null,null,null,null,null,null,null,"starogardzki","Starogard Gdański"]
[null,null,null,null,null,null,null,null,null,null,null,null,null,null,null,null,null,null,null,null,null,null,null,null,null,"starogardzki","Zblewo"]
[null,null,null,null,null,null,null,null,null,null,null,null,null,null,null,null,null,null,null,null,null,null,null,null,null,"tczewski","Gniew"]
[null,null,null,null,null,null,null,null,null,null,null,null,null,null,null,null,null,null,null,null,null,null,null,null,null,"tczewski","Morzeszczyn"]
[null,null,null,null,null,null,null,null,null,null,null,null,null,null,null,null,null,null,null,null,null,null,null,null,null,"tczewski","Pelplin"]
[null,null,null,null,null,null,null,null,null,null,null,null,null,null,null,null,null,null,null,null,null,null,null,null,null,"tczewski","Subkowy"]
[null,null,null,null,null,null,null,null,null,null,null,null,null,null,null,null,null,null,null,null,null,null,null,null,null,"tczewski","Tczew"]
[null,null,null,null,null,null,null,null,null,null,null,null,null,null,null,null,null,null,null,null,null,null,null,null,null,"sztumski","Dzierzgoń"]
[null,null,null,null,null,null,null,null,null,null,null,null,null,null,null,null,null,null,null,null,null,null,null,null,null,"sztumski","Mikołajki Pomorskie"]
[null,null,null,null,null,null,null,null,null,null,null,null,null,null,null,null,null,null,null,null,null,null,null,null,null,"sztumski","Stary Dzierzgoń"]
[null,null,null,null,null,null,null,null,null,null,null,null,null,null,null,null,null,null,null,null,null,null,null,null,null,"sztumski","Stary Targ"]
[null,null,null,null,null,null,null,null,null,null,null,null,null,null,null,null,null,null,null,null,null,null,null,null,null,"sztumski","Sztum"]
[null,null,null,null,null,null,null,null,null,null,null,null,null,null,null,null,null,null,null,null,null,null,null,null,null,"Gdańsk","Gdańsk"]
[null,null,null,null,null,null,null,null,null,null,null,null,null,null,null,null,null,null,null,null,null,null,null,null,null,"Gdynia","Gdynia"]
[null,null,null,null,null,null,null,null,null,null,null,null,null,null,null,null,null,null,null,null,null,null,null,null,null,"Sopot","Sopot"]
[null,null,null,null,null,null,null,null,null,null,null,null,null,null,null,null,null,null,null,null,null,null,null,null,null,"chojnicki","Chojnice"]
[null,null,null,null,null,null,null,null,null,null,null,null,null,null,null,null,null,null,null,null,null,null,null,null,null,"chojnicki","Brusy"]
[null,null,null,null,null,null,null,null,null,null,null,null,null,null,null,null,null,null,null,null,null,null,null,null,null,"chojnicki","Czersk"]
[null,null,null,null,null,null,null,null,null,null,null,null,null,null,null,null,null,null,null,null,null,null,null,null,null,"chojnicki","Konarzyny"]
[null,null,null,null,null,null,null,null,null,null,null,null,null,null,null,null,null,null,null,null,null,null,null,null,null,"człuchowski","Człuchów"]
[null,null,null,null,null,null,null,null,null,null,null,null,null,null,null,null,null,null,null,null,null,null,null,null,null,"człuchowski","Czarne"]
[null,null,null,null,null,null,null,null,null,null,null,null,null,null,null,null,null,null,null,null,null,null,null,null,null,"człuchowski","Debrzno"]
[null,null,null,null,null,null,null,null,null,null,null,null,null,null,null,null,null,null,null,null,null,null,null,null,null,"człuchowski","Koczała"]
[null,null,null,null,null,null,null,null,null,null,null,null,null,null,null,null,null,null,null,null,null,null,null,null,null,"człuchowski","Przechlewo"]
[null,null,null,null,null,null,null,null,null,null,null,null,null,null,null,null,null,null,null,null,null,null,null,null,null,"człuchowski","Rzeczenica"]
[null,null,null,null,null,null,null,null,null,null,null,null,null,null,null,null,null,null,null,null,null,null,null,null,null,"kościerski","Kościerzyna"]
[null,null,null,null,null,null,null,null,null,null,null,null,null,null,null,null,null,null,null,null,null,null,null,null,null,"kościerski","Dziemiany"]
[null,null,null,null,null,null,null,null,null,null,null,null,null,null,null,null,null,null,null,null,null,null,null,null,null,"kościerski","Karsin"]
[null,null,null,null,null,null,null,null,null,null,null,null,null,null,null,null,null,null,null,null,null,null,null,null,null,"kościerski","Kościerzyna"]
[null,null,null,null,null,null,null,null,null,null,null,null,null,null,null,null,null,null,null,null,null,null,null,null,null,"kościerski","Liniewo"]
[null,null,null,null,null,null,null,null,null,null,null,null,null,null,null,null,null,null,null,null,null,null,null,null,null,"kościerski","Lipusz"]
[null,null,null,null,null,null,null,null,null,null,null,null,null,null,null,null,null,null,null,null,null,null,null,null,null,"kościerski","Nowa Karczma"]
[null,null,null,null,null,null,null,null,null,null,null,null,null,null,null,null,null,null,null,null,null,null,null,null,null,"kościerski","Stara Kiszewa"]
[null,null,null,null,null,null,null,null,null,null,null,null,null,null,null,null,null,null,null,null,null,null,null,null,null,"braniewski","Braniewo"]
[null,null,null,null,null,null,null,null,null,null,null,null,null,null,null,null,null,null,null,null,null,null,null,null,null,"braniewski","Frombork"]
[null,null,null,null,null,null,null,null,null,null,null,null,null,null,null,null,null,null,null,null,null,null,null,null,null,"braniewski","Lelkowo"]
[null,null,null,null,null,null,null,null,null,null,null,null,null,null,null,null,null,null,null,null,null,null,null,null,null,"braniewski","Pieniężno"]
[null,null,null,null,null,null,null,null,null,null,null,null,null,null,null,null,null,null,null,null,null,null,null,null,null,"braniewski","Płoskinia"]
[null,null,null,null,null,null,null,null,null,null,null,null,null,null,null,null,null,null,null,null,null,null,null,null,null,"braniewski","Wilczęta"]
[null,null,null,null,null,null,null,null,null,null,null,null,null,null,null,null,null,null,null,null,null,null,null,null,null,"działdowski","Działdowo"]
[null,null,null,null,null,null,null,null,null,null,null,null,null,null,null,null,null,null,null,null,null,null,null,null,null,"działdowski","Iłowo-Osada"]
[null,null,null,null,null,null,null,null,null,null,null,null,null,null,null,null,null,null,null,null,null,null,null,null,null,"działdowski","Lidzbark"]
[null,null,null,null,null,null,null,null,null,null,null,null,null,null,null,null,null,null,null,null,null,null,null,null,null,"działdowski","Płośnica"]
[null,null,null,null,null,null,null,null,null,null,null,null,null,null,null,null,null,null,null,null,null,null,null,null,null,"działdowski","Rybno"]
[null,null,null,null,null,null,null,null,null,null,null,null,null,null,null,null,null,null,null,null,null,null,null,null,null,"elbląski","Elbląg"]
[null,null,null,null,null,null,null,null,null,null,null,null,null,null,null,null,null,null,null,null,null,null,null,null,null,"elbląski","Godkowo"]
[null,null,null,null,null,null,null,null,null,null,null,null,null,null,null,null,null,null,null,null,null,null,null,null,null,"elbląski","Gronowo Elbląskie"]
[null,null,null,null,null,null,null,null,null,null,null,null,null,null,null,null,null,null,null,null,null,null,null,null,null,"elbląski","Markusy"]
[null,null,null,null,null,null,null,null,null,null,null,null,null,null,null,null,null,null,null,null,null,null,null,null,null,"elbląski","Milejewo"]
[null,null,null,null,null,null,null,null,null,null,null,null,null,null,null,null,null,null,null,null,null,null,null,null,null,"elbląski","Młynary"]
[null,null,null,null,null,null,null,null,null,null,null,null,null,null,null,null,null,null,null,null,null,null,null,null,null,"elbląski","Pasłęk"]
[null,null,null,null,null,null,null,null,null,null,null,null,null,null,null,null,null,null,null,null,null,null,null,null,null,"elbląski","Rychliki"]
[null,null,null,null,null,null,null,null,null,null,null,null,null,null,null,null,null,null,null,null,null,null,null,null,null,"elbląski","Tolkmicko"]
[null,null,null,null,null,null,null,null,null,null,null,null,null,null,null,null,null,null,null,null,null,null,null,null,null,"iławski","Iława"]
[null,null,null,null,null,null,null,null,null,null,null,null,null,null,null,null,null,null,null,null,null,null,null,null,null,"iławski","Lubawa"]
[null,null,null,null,null,null,null,null,null,null,null,null,null,null,null,null,null,null,null,null,null,null,null,null,null,"iławski","Iława"]
[null,null,null,null,null,null,null,null,null,null,null,null,null,null,null,null,null,null,null,null,null,null,null,null,null,"iławski","Kisielice"]
[null,null,null,null,null,null,null,null,null,null,null,null,null,null,null,null,null,null,null,null,null,null,null,null,null,"iławski","Lubawa"]
[null,null,null,null,null,null,null,null,null,null,null,null,null,null,null,null,null,null,null,null,null,null,null,null,null,"iławski","Susz"]
[null,null,null,null,null,null,null,null,null,null,null,null,null,null,null,null,null,null,null,null,null,null,null,null,null,"iławski","Zalewo"]
[null,null,null,null,null,null,null,null,null,null,null,null,null,null,null,null,null,null,null,null,null,null,null,null,null,"nowomiejski","Nowe Miasto Lubawskie"]
[null,null,null,null,null,null,null,null,null,null,null,null,null,null,null,null,null,null,null,null,null,null,null,null,null,"nowomiejski","Biskupiec"]
[null,null,null,null,null,null,null,null,null,null,null,null,null,null,null,null,null,null,null,null,null,null,null,null,null,"nowomiejski","Grodziczno"]
[null,null,null,null,null,null,null,null,null,null,null,null,null,null,null,null,null,null,null,null,null,null,null,null,null,"nowomiejski","Kurzętnik"]
[null,null,null,null,null,null,null,null,null,null,null,null,null,null,null,null,null,null,null,null,null,null,null,null,null,"ostródzki","Ostróda"]
[null,null,null,null,null,null,null,null,null,null,null,null,null,null,null,null,null,null,null,null,null,null,null,null,null,"ostródzki","Dąbrówno"]
[null,null,null,null,null,null,null,null,null,null,null,null,null,null,null,null,null,null,null,null,null,null,null,null,null,"ostródzki","Grunwald"]
[null,null,null,null,null,null,null,null,null,null,null,null,null,null,null,null,null,null,null,null,null,null,null,null,null,"ostródzki","Łukta"]
[null,null,null,null,null,null,null,null,null,null,null,null,null,null,null,null,null,null,null,null,null,null,null,null,null,"ostródzki","Małdyty"]
[null,null,null,null,null,null,null,null,null,null,null,null,null,null,null,null,null,null,null,null,null,null,null,null,null,"ostródzki","Miłomłyn"]
[null,null,null,null,null,null,null,null,null,null,null,null,null,null,null,null,null,null,null,null,null,null,null,null,null,"ostródzki","Morąg"]
[null,null,null,null,null,null,null,null,null,null,null,null,null,null,null,null,null,null,null,null,null,null,null,null,null,"ostródzki","Ostróda"]
[null,null,null,null,null,null,null,null,null,null,null,null,null,null,null,null,null,null,null,null,null,null,null,null,null,"Elbląg","Elbląg"]
[null,null,null,null,null,null,null,null,null,null,null,null,null,null,null,null,null,null,null,null,null,null,null,null,null,"ełcki","Ełk"]
[null,null,null,null,null,null,null,null,null,null,null,null,null,null,null,null,null,null,null,null,null,null,null,null,null,"ełcki","Kalinowo"]
[null,null,null,null,null,null,null,null,null,null,null,null,null,null,null,null,null,null,null,null,null,null,null,null,null,"ełcki","Prostki"]
[null,null,null,null,null,null,null,null,null,null,null,null,null,null,null,null,null,null,null,null,null,null,null,null,null,"ełcki","Stare Juchy"]
[null,null,null,null,null,null,null,null,null,null,null,null,null,null,null,null,null,null,null,null,null,null,null,null,null,"giżycki","Giżycko"]
[null,null,null,null,null,null,null,null,null,null,null,null,null,null,null,null,null,null,null,null,null,null,null,null,null,"giżycki","Kruklanki"]
[null,null,null,null,null,null,null,null,null,null,null,null,null,null,null,null,null,null,null,null,null,null,null,null,null,"giżycki","Miłki"]
[null,null,null,null,null,null,null,null,null,null,null,null,null,null,null,null,null,null,null,null,null,null,null,null,null,"giżycki","Ryn"]
[null,null,null,null,null,null,null,null,null,null,null,null,null,null,null,null,null,null,null,null,null,null,null,null,null,"giżycki","Wydminy"]
[null,null,null,null,null,null,null,null,null,null,null,null,null,null,null,null,null,null,null,null,null,null,null,null,null,"olecki","Kowale Oleckie"]
[null,null,null,null,null,null,null,null,null,null,null,null,null,null,null,null,null,null,null,null,null,null,null,null,null,"olecki","Olecko"]
[null,null,null,null,null,null,null,null,null,null,null,null,null,null,null,null,null,null,null,null,null,null,null,null,null,"olecki","Świętajno"]
[null,null,null,null,null,null,null,null,null,null,null,null,null,null,null,null,null,null,null,null,null,null,null,null,null,"olecki","Wieliczki"]
[null,null,null,null,null,null,null,null,null,null,null,null,null,null,null,null,null,null,null,null,null,null,null,null,null,"piski","Biała Piska"]
[null,null,null,null,null,null,null,null,null,null,null,null,null,null,null,null,null,null,null,null,null,null,null,null,null,"piski","Orzysz"]
[null,null,null,null,null,null,null,null,null,null,null,null,null,null,null,null,null,null,null,null,null,null,null,null,null,"piski","Pisz"]
[null,null,null,null,null,null,null,null,null,null,null,null,null,null,null,null,null,null,null,null,null,null,null,null,null,"piski","Ruciane-Nida"]
[null,null,null,null,null,null,null,null,null,null,null,null,null,null,null,null,null,null,null,null,null,null,null,null,null,"gołdapski","Banie Mazurskie"]
[null,null,null,null,null,null,null,null,null,null,null,null,null,null,null,null,null,null,null,null,null,null,null,null,null,"gołdapski","Dubeninki"]
[null,null,null,null,null,null,null,null,null,null,null,null,null,null,null,null,null,null,null,null,null,null,null,null,null,"gołdapski","Gołdap"]
[null,null,null,null,null,null,null,null,null,null,null,null,null,null,null,null,null,null,null,null,null,null,null,null,null,"węgorzewski","Budry"]
[null,null,null,null,null,null,null,null,null,null,null,null,null,null,null,null,null,null,null,null,null,null,null,null,null,"węgorzewski","Pozezdrze"]
[null,null,null,null,null,null,null,null,null,null,null,null,null,null,null,null,null,null,null,null,null,null,null,null,null,"węgorzewski","Węgorzewo"]
[null,null,null,null,null,null,null,null,null,null,null,null,null,null,null,null,null,null,null,null,null,null,null,null,null,"bartoszycki","Bartoszyce"]
[null,null,null,null,null,null,null,null,null,null,null,null,null,null,null,null,null,null,null,null,null,null,null,null,null,"bartoszycki","Górowo Iławeckie"]
[null,null,null,null,null,null,null,null,null,null,null,null,null,null,null,null,null,null,null,null,null,null,null,null,null,"bartoszycki","Bartoszyce"]
[null,null,null,null,null,null,null,null,null,null,null,null,null,null,null,null,null,null,null,null,null,null,null,null,null,"bartoszycki","Bisztynek"]
[null,null,null,null,null,null,null,null,null,null,null,null,null,null,null,null,null,null,null,null,null,null,null,null,null,"bartoszycki","Górowo Iławeckie"]
[null,null,null,null,null,null,null,null,null,null,null,null,null,null,null,null,null,null,null,null,null,null,null,null,null,"bartoszycki","Sępopol"]
[null,null,null,null,null,null,null,null,null,null,null,null,null,null,null,null,null,null,null,null,null,null,null,null,null,"kętrzyński","Kętrzyn"]
[null,null,null,null,null,null,null,null,null,null,null,null,null,null,null,null,null,null,null,null,null,null,null,null,null,"kętrzyński","Barciany"]
[null,null,null,null,null,null,null,null,null,null,null,null,null,null,null,null,null,null,null,null,null,null,null,null,null,"kętrzyński","Korsze"]
[null,null,null,null,null,null,null,null,null,null,null,null,null,null,null,null,null,null,null,null,null,null,null,null,null,"kętrzyński","Reszel"]
[null,null,null,null,null,null,null,null,null,null,null,null,null,null,null,null,null,null,null,null,null,null,null,null,null,"kętrzyński","Srokowo"]
[null,null,null,null,null,null,null,null,null,null,null,null,null,null,null,null,null,null,null,null,null,null,null,null,null,"lidzbarski","Kiwity"]
[null,null,null,null,null,null,null,null,null,null,null,null,null,null,null,null,null,null,null,null,null,null,null,null,null,"lidzbarski","Lidzbark Warmiński"]
[null,null,null,null,null,null,null,null,null,null,null,null,null,null,null,null,null,null,null,null,null,null,null,null,null,"lidzbarski","Lubomino"]
[null,null,null,null,null,null,null,null,null,null,null,null,null,null,null,null,null,null,null,null,null,null,null,null,null,"lidzbarski","Orneta"]
[null,null,null,null,null,null,null,null,null,null,null,null,null,null,null,null,null,null,null,null,null,null,null,null,null,"mrągowski","Mikołajki"]
[null,null,null,null,null,null,null,null,null,null,null,null,null,null,null,null,null,null,null,null,null,null,null,null,null,"mrągowski","Mrągowo"]
[null,null,null,null,null,null,null,null,null,null,null,null,null,null,null,null,null,null,null,null,null,null,null,null,null,"mrągowski","Piecki"]
[null,null,null,null,null,null,null,null,null,null,null,null,null,null,null,null,null,null,null,null,null,null,null,null,null,"mrągowski","Sorkwity"]
[null,null,null,null,null,null,null,null,null,null,null,null,null,null,null,null,null,null,null,null,null,null,null,null,null,"nidzicki","Janowiec Kościelny"]
[null,null,null,null,null,null,null,null,null,null,null,null,null,null,null,null,null,null,null,null,null,null,null,null,null,"nidzicki","Janowo"]
[null,null,null,null,null,null,null,null,null,null,null,null,null,null,null,null,null,null,null,null,null,null,null,null,null,"nidzicki","Kozłowo"]
[null,null,null,null,null,null,null,null,null,null,null,null,null,null,null,null,null,null,null,null,null,null,null,null,null,"nidzicki","Nidzica"]
[null,null,null,null,null,null,null,null,null,null,null,null,null,null,null,null,null,null,null,null,null,null,null,null,null,"olsztyński","Barczewo"]
[null,null,null,null,null,null,null,null,null,null,null,null,null,null,null,null,null,null,null,null,null,null,null,null,null,"olsztyński","Biskupiec"]
[null,null,null,null,null,null,null,null,null,null,null,null,null,null,null,null,null,null,null,null,null,null,null,null,null,"olsztyński","Dobre Miasto"]
[null,null,null,null,null,null,null,null,null,null,null,null,null,null,null,null,null,null,null,null,null,null,null,null,null,"olsztyński","Dywity"]
[null,null,null,null,null,null,null,null,null,null,null,null,null,null,null,null,null,null,null,null,null,null,null,null,null,"olsztyński","Gietrzwałd"]
[null,null,null,null,null,null,null,null,null,null,null,null,null,null,null,null,null,null,null,null,null,null,null,null,null,"olsztyński","Jeziorany"]
[null,null,null,null,null,null,null,null,null,null,null,null,null,null,null,null,null,null,null,null,null,null,null,null,null,"olsztyński","Jonkowo"]
[null,null,null,null,null,null,null,null,null,null,null,null,null,null,null,null,null,null,null,null,null,null,null,null,null,"olsztyński","Kolno"]
[null,null,null,null,null,null,null,null,null,null,null,null,null,null,null,null,null,null,null,null,null,null,null,null,null,"olsztyński","Olsztynek"]
[null,null,null,null,null,null,null,null,null,null,null,null,null,null,null,null,null,null,null,null,null,null,null,null,null,"olsztyński","Purda"]
[null,null,null,null,null,null,null,null,null,null,null,null,null,null,null,null,null,null,null,null,null,null,null,null,null,"olsztyński","Stawiguda"]
[null,null,null,null,null,null,null,null,null,null,null,null,null,null,null,null,null,null,null,null,null,null,null,null,null,"olsztyński","Świątki"]
[null,null,null,null,null,null,null,null,null,null,null,null,null,null,null,null,null,null,null,null,null,null,null,null,null,"szczycieński","Szczytno"]
[null,null,null,null,null,null,null,null,null,null,null,null,null,null,null,null,null,null,null,null,null,null,null,null,null,"szczycieński","Dźwierzuty"]
[null,null,null,null,null,null,null,null,null,null,null,null,null,null,null,null,null,null,null,null,null,null,null,null,null,"szczycieński","Jedwabno"]
[null,null,null,null,null,null,null,null,null,null,null,null,null,null,null,null,null,null,null,null,null,null,null,null,null,"szczycieński","Pasym"]
[null,null,null,null,null,null,null,null,null,null,null,null,null,null,null,null,null,null,null,null,null,null,null,null,null,"szczycieński","Rozogi"]
[null,null,null,null,null,null,null,null,null,null,null,null,null,null,null,null,null,null,null,null,null,null,null,null,null,"szczycieński","Szczytno"]
[null,null,null,null,null,null,null,null,null,null,null,null,null,null,null,null,null,null,null,null,null,null,null,null,null,"szczycieński","Świętajno"]
[null,null,null,null,null,null,null,null,null,null,null,null,null,null,null,null,null,null,null,null,null,null,null,null,null,"szczycieński","Wielbark"]
[null,null,null,null,null,null,null,null,null,null,null,null,null,null,null,null,null,null,null,null,null,null,null,null,null,"Olsztyn","Olsztyn"]
[null,null,null,null,null,null,null,null,null,null,null,null,null,null,null,null,null,null,null,null,null,null,null,null,null,"łódzki wschodni","Andrespol"]
[null,null,null,null,null,null,null,null,null,null,null,null,null,null,null,null,null,null,null,null,null,null,null,null,null,"łódzki wschodni","Brójce"]
[null,null,null,null,null,null,null,null,null,null,null,null,null,null,null,null,null,null,null,null,null,null,null,null,null,"łódzki wschodni","Koluszki"]
[null,null,null,null,null,null,null,null,null,null,null,null,null,null,null,null,null,null,null,null,null,null,null,null,null,"łódzki wschodni","Nowosolna"]
[null,null,null,null,null,null,null,null,null,null,null,null,null,null,null,null,null,null,null,null,null,null,null,null,null,"łódzki wschodni","Rzgów"]
[null,null,null,null,null,null,null,null,null,null,null,null,null,null,null,null,null,null,null,null,null,null,null,null,null,"łódzki wschodni","Tuszyn"]
[null,null,null,null,null,null,null,null,null,null,null,null,null,null,null,null,null,null,null,null,null,null,null,null,null,"pabianicki","Konstantynów Łódzki"]
[null,null,null,null,null,null,null,null,null,null,null,null,null,null,null,null,null,null,null,null,null,null,null,null,null,"pabianicki","Pabianice"]
[null,null,null,null,null,null,null,null,null,null,null,null,null,null,null,null,null,null,null,null,null,null,null,null,null,"pabianicki","Dłutów"]
[null,null,null,null,null,null,null,null,null,null,null,null,null,null,null,null,null,null,null,null,null,null,null,null,null,"pabianicki","Dobroń"]
[null,null,null,null,null,null,null,null,null,null,null,null,null,null,null,null,null,null,null,null,null,null,null,null,null,"pabianicki","Ksawerów"]
[null,null,null,null,null,null,null,null,null,null,null,null,null,null,null,null,null,null,null,null,null,null,null,null,null,"pabianicki","Lutomiersk"]
[null,null,null,null,null,null,null,null,null,null,null,null,null,null,null,null,null,null,null,null,null,null,null,null,null,"pabianicki","Pabianice"]
[null,null,null,null,null,null,null,null,null,null,null,null,null,null,null,null,null,null,null,null,null,null,null,null,null,"zgierski","Ozorków"]
[null,null,null,null,null,null,null,null,null,null,null,null,null,null,null,null,null,null,null,null,null,null,null,null,null,"zgierski","Zgierz"]
[null,null,null,null,null,null,null,null,null,null,null,null,null,null,null,null,null,null,null,null,null,null,null,null,null,"zgierski","Aleksandrów Łódzki"]
[null,null,null,null,null,null,null,null,null,null,null,null,null,null,null,null,null,null,null,null,null,null,null,null,null,"zgierski","Głowno"]
[null,null,null,null,null,null,null,null,null,null,null,null,null,null,null,null,null,null,null,null,null,null,null,null,null,"zgierski","Ozorków"]
[null,null,null,null,null,null,null,null,null,null,null,null,null,null,null,null,null,null,null,null,null,null,null,null,null,"zgierski","Parzęczew"]
[null,null,null,null,null,null,null,null,null,null,null,null,null,null,null,null,null,null,null,null,null,null,null,null,null,"zgierski","Stryków"]
[null,null,null,null,null,null,null,null,null,null,null,null,null,null,null,null,null,null,null,null,null,null,null,null,null,"brzeziński","Brzeziny"]
[null,null,null,null,null,null,null,null,null,null,null,null,null,null,null,null,null,null,null,null,null,null,null,null,null,"brzeziński","Dmosin"]
[null,null,null,null,null,null,null,null,null,null,null,null,null,null,null,null,null,null,null,null,null,null,null,null,null,"brzeziński","Jeżów"]
[null,null,null,null,null,null,null,null,null,null,null,null,null,null,null,null,null,null,null,null,null,null,null,null,null,"brzeziński","Rogów"]
[null,null,null,null,null,null,null,null,null,null,null,null,null,null,null,null,null,null,null,null,null,null,null,null,null,"Łódź","Łódź"]
[null,null,null,null,null,null,null,null,null,null,null,null,null,null,null,null,null,null,null,null,null,null,null,null,null,"Łódź","Łódź-Bałuty"]
[null,null,null,null,null,null,null,null,null,null,null,null,null,null,null,null,null,null,null,null,null,null,null,null,null,"Łódź","Łódź-Górna"]
[null,null,null,null,null,null,null,null,null,null,null,null,null,null,null,null,null,null,null,null,null,null,null,null,null,"Łódź","Łódź-Polesie"]
[null,null,null,null,null,null,null,null,null,null,null,null,null,null,null,null,null,null,null,null,null,null,null,null,null,"Łódź","Łódź-Śródmieście"]
[null,null,null,null,null,null,null,null,null,null,null,null,null,null,null,null,null,null,null,null,null,null,null,null,null,"Łódź","Łódź-Widzew"]
[null,null,null,null,null,null,null,null,null,null,null,null,null,null,null,null,null,null,null,null,null,null,null,null,null,"bełchatowski","Bełchatów"]
[null,null,null,null,null,null,null,null,null,null,null,null,null,null,null,null,null,null,null,null,null,null,null,null,null,"bełchatowski","Drużbice"]
[null,null,null,null,null,null,null,null,null,null,null,null,null,null,null,null,null,null,null,null,null,null,null,null,null,"bełchatowski","Kleszczów"]
[null,null,null,null,null,null,null,null,null,null,null,null,null,null,null,null,null,null,null,null,null,null,null,null,null,"bełchatowski","Kluki"]
[null,null,null,null,null,null,null,null,null,null,null,null,null,null,null,null,null,null,null,null,null,null,null,null,null,"bełchatowski","Rusiec"]
[null,null,null,null,null,null,null,null,null,null,null,null,null,null,null,null,null,null,null,null,null,null,null,null,null,"bełchatowski","Szczerców"]
[null,null,null,null,null,null,null,null,null,null,null,null,null,null,null,null,null,null,null,null,null,null,null,null,null,"bełchatowski","Zelów"]
[null,null,null,null,null,null,null,null,null,null,null,null,null,null,null,null,null,null,null,null,null,null,null,null,null,"opoczyński","Białaczów"]
[null,null,null,null,null,null,null,null,null,null,null,null,null,null,null,null,null,null,null,null,null,null,null,null,null,"opoczyński","Drzewica"]
[null,null,null,null,null,null,null,null,null,null,null,null,null,null,null,null,null,null,null,null,null,null,null,null,null,"opoczyński","Mniszków"]
[null,null,null,null,null,null,null,null,null,null,null,null,null,null,null,null,null,null,null,null,null,null,null,null,null,"opoczyński","Opoczno"]
[null,null,null,null,null,null,null,null,null,null,null,null,null,null,null,null,null,null,null,null,null,null,null,null,null,"opoczyński","Paradyż"]
[null,null,null,null,null,null,null,null,null,null,null,null,null,null,null,null,null,null,null,null,null,null,null,null,null,"opoczyński","Poświętne"]
[null,null,null,null,null,null,null,null,null,null,null,null,null,null,null,null,null,null,null,null,null,null,null,null,null,"opoczyński","Sławno"]
[null,null,null,null,null,null,null,null,null,null,null,null,null,null,null,null,null,null,null,null,null,null,null,null,null,"opoczyński","Żarnów"]
[null,null,null,null,null,null,null,null,null,null,null,null,null,null,null,null,null,null,null,null,null,null,null,null,null,"piotrkowski","Aleksandrów"]
[null,null,null,null,null,null,null,null,null,null,null,null,null,null,null,null,null,null,null,null,null,null,null,null,null,"piotrkowski","Czarnocin"]
[null,null,null,null,null,null,null,null,null,null,null,null,null,null,null,null,null,null,null,null,null,null,null,null,null,"piotrkowski","Gorzkowice"]
[null,null,null,null,null,null,null,null,null,null,null,null,null,null,null,null,null,null,null,null,null,null,null,null,null,"piotrkowski","Grabica"]
[null,null,null,null,null,null,null,null,null,null,null,null,null,null,null,null,null,null,null,null,null,null,null,null,null,"piotrkowski","Łęki Szlacheckie"]
[null,null,null,null,null,null,null,null,null,null,null,null,null,null,null,null,null,null,null,null,null,null,null,null,null,"piotrkowski","Moszczenica"]
[null,null,null,null,null,null,null,null,null,null,null,null,null,null,null,null,null,null,null,null,null,null,null,null,null,"piotrkowski","Ręczno"]
[null,null,null,null,null,null,null,null,null,null,null,null,null,null,null,null,null,null,null,null,null,null,null,null,null,"piotrkowski","Rozprza"]
[null,null,null,null,null,null,null,null,null,null,null,null,null,null,null,null,null,null,null,null,null,null,null,null,null,"piotrkowski","Sulejów"]
[null,null,null,null,null,null,null,null,null,null,null,null,null,null,null,null,null,null,null,null,null,null,null,null,null,"piotrkowski","Wola Krzysztoporska"]
[null,null,null,null,null,null,null,null,null,null,null,null,null,null,null,null,null,null,null,null,null,null,null,null,null,"piotrkowski","Wolbórz"]
[null,null,null,null,null,null,null,null,null,null,null,null,null,null,null,null,null,null,null,null,null,null,null,null,null,"radomszczański","Radomsko"]
[null,null,null,null,null,null,null,null,null,null,null,null,null,null,null,null,null,null,null,null,null,null,null,null,null,"radomszczański","Dobryszyce"]
[null,null,null,null,null,null,null,null,null,null,null,null,null,null,null,null,null,null,null,null,null,null,null,null,null,"radomszczański","Gidle"]
[null,null,null,null,null,null,null,null,null,null,null,null,null,null,null,null,null,null,null,null,null,null,null,null,null,"radomszczański","Gomunice"]
[null,null,null,null,null,null,null,null,null,null,null,null,null,null,null,null,null,null,null,null,null,null,null,null,null,"radomszczański","Kamieńsk"]
[null,null,null,null,null,null,null,null,null,null,null,null,null,null,null,null,null,null,null,null,null,null,null,null,null,"radomszczański","Kobiele Wielkie"]
[null,null,null,null,null,null,null,null,null,null,null,null,null,null,null,null,null,null,null,null,null,null,null,null,null,"radomszczański","Kodrąb"]
[null,null,null,null,null,null,null,null,null,null,null,null,null,null,null,null,null,null,null,null,null,null,null,null,null,"radomszczański","Lgota Wielka"]
[null,null,null,null,null,null,null,null,null,null,null,null,null,null,null,null,null,null,null,null,null,null,null,null,null,"radomszczański","Ładzice"]
[null,null,null,null,null,null,null,null,null,null,null,null,null,null,null,null,null,null,null,null,null,null,null,null,null,"radomszczański","Masłowice"]
[null,null,null,null,null,null,null,null,null,null,null,null,null,null,null,null,null,null,null,null,null,null,null,null,null,"radomszczański","Przedbórz"]
[null,null,null,null,null,null,null,null,null,null,null,null,null,null,null,null,null,null,null,null,null,null,null,null,null,"radomszczański","Radomsko"]
[null,null,null,null,null,null,null,null,null,null,null,null,null,null,null,null,null,null,null,null,null,null,null,null,null,"radomszczański","Wielgomłyny"]
[null,null,null,null,null,null,null,null,null,null,null,null,null,null,null,null,null,null,null,null,null,null,null,null,null,"radomszczański","Żytno"]
[null,null,null,null,null,null,null,null,null,null,null,null,null,null,null,null,null,null,null,null,null,null,null,null,null,"tomaszowski","Tomaszów Mazowiecki"]
[null,null,null,null,null,null,null,null,null,null,null,null,null,null,null,null,null,null,null,null,null,null,null,null,null,"tomaszowski","Będków"]
[null,null,null,null,null,null,null,null,null,null,null,null,null,null,null,null,null,null,null,null,null,null,null,null,null,"tomaszowski","Budziszewice"]
[null,null,null,null,null,null,null,null,null,null,null,null,null,null,null,null,null,null,null,null,null,null,null,null,null,"tomaszowski","Czerniewice"]
[null,null,null,null,null,null,null,null,null,null,null,null,null,null,null,null,null,null,null,null,null,null,null,null,null,"tomaszowski","Inowłódz"]
[null,null,null,null,null,null,null,null,null,null,null,null,null,null,null,null,null,null,null,null,null,null,null,null,null,"tomaszowski","Lubochnia"]
[null,null,null,null,null,null,null,null,null,null,null,null,null,null,null,null,null,null,null,null,null,null,null,null,null,"tomaszowski","Rokiciny"]
[null,null,null,null,null,null,null,null,null,null,null,null,null,null,null,null,null,null,null,null,null,null,null,null,null,"tomaszowski","Rzeczyca"]
[null,null,null,null,null,null,null,null,null,null,null,null,null,null,null,null,null,null,null,null,null,null,null,null,null,"tomaszowski","Tomaszów Mazowiecki"]
[null,null,null,null,null,null,null,null,null,null,null,null,null,null,null,null,null,null,null,null,null,null,null,null,null,"tomaszowski","Ujazd"]
[null,null,null,null,null,null,null,null,null,null,null,null,null,null,null,null,null,null,null,null,null,null,null,null,null,"tomaszowski","Żelechlinek"]
[null,null,null,null,null,null,null,null,null,null,null,null,null,null,null,null,null,null,null,null,null,null,null,null,null,"Piotrków Trybunalski","Piotrków Trybunalski"]
[null,null,null,null,null,null,null,null,null,null,null,null,null,null,null,null,null,null,null,null,null,null,null,null,null,"łaski","Buczek"]
[null,null,null,null,null,null,null,null,null,null,null,null,null,null,null,null,null,null,null,null,null,null,null,null,null,"łaski","Łask"]
[null,null,null,null,null,null,null,null,null,null,null,null,null,null,null,null,null,null,null,null,null,null,null,null,null,"łaski","Sędziejowice"]
[null,null,null,null,null,null,null,null,null,null,null,null,null,null,null,null,null,null,null,null,null,null,null,null,null,"łaski","Widawa"]
[null,null,null,null,null,null,null,null,null,null,null,null,null,null,null,null,null,null,null,null,null,null,null,null,null,"łaski","Wodzierady"]
[null,null,null,null,null,null,null,null,null,null,null,null,null,null,null,null,null,null,null,null,null,null,null,null,null,"pajęczański","Działoszyn"]
[null,null,null,null,null,null,null,null,null,null,null,null,null,null,null,null,null,null,null,null,null,null,null,null,null,"pajęczański","Kiełczygłów"]
[null,null,null,null,null,null,null,null,null,null,null,null,null,null,null,null,null,null,null,null,null,null,null,null,null,"pajęczański","Nowa Brzeźnica"]
[null,null,null,null,null,null,null,null,null,null,null,null,null,null,null,null,null,null,null,null,null,null,null,null,null,"pajęczański","Pajęczno"]
[null,null,null,null,null,null,null,null,null,null,null,null,null,null,null,null,null,null,null,null,null,null,null,null,null,"pajęczański","Rząśnia"]
[null,null,null,null,null,null,null,null,null,null,null,null,null,null,null,null,null,null,null,null,null,null,null,null,null,"pajęczański","Siemkowice"]
[null,null,null,null,null,null,null,null,null,null,null,null,null,null,null,null,null,null,null,null,null,null,null,null,null,"pajęczański","Strzelce Wielkie"]
[null,null,null,null,null,null,null,null,null,null,null,null,null,null,null,null,null,null,null,null,null,null,null,null,null,"pajęczański","Sulmierzyce"]
[null,null,null,null,null,null,null,null,null,null,null,null,null,null,null,null,null,null,null,null,null,null,null,null,null,"poddębicki","Dalików"]
[null,null,null,null,null,null,null,null,null,null,null,null,null,null,null,null,null,null,null,null,null,null,null,null,null,"poddębicki","Pęczniew"]
[null,null,null,null,null,null,null,null,null,null,null,null,null,null,null,null,null,null,null,null,null,null,null,null,null,"poddębicki","Poddębice"]
[null,null,null,null,null,null,null,null,null,null,null,null,null,null,null,null,null,null,null,null,null,null,null,null,null,"poddębicki","Uniejów"]
[null,null,null,null,null,null,null,null,null,null,null,null,null,null,null,null,null,null,null,null,null,null,null,null,null,"poddębicki","Wartkowice"]
[null,null,null,null,null,null,null,null,null,null,null,null,null,null,null,null,null,null,null,null,null,null,null,null,null,"poddębicki","Zadzim"]
[null,null,null,null,null,null,null,null,null,null,null,null,null,null,null,null,null,null,null,null,null,null,null,null,null,"sieradzki","Sieradz"]
[null,null,null,null,null,null,null,null,null,null,null,null,null,null,null,null,null,null,null,null,null,null,null,null,null,"sieradzki","Błaszki"]
[null,null,null,null,null,null,null,null,null,null,null,null,null,null,null,null,null,null,null,null,null,null,null,null,null,"sieradzki","Brąszewice"]
[null,null,null,null,null,null,null,null,null,null,null,null,null,null,null,null,null,null,null,null,null,null,null,null,null,"sieradzki","Brzeźnio"]
[null,null,null,null,null,null,null,null,null,null,null,null,null,null,null,null,null,null,null,null,null,null,null,null,null,"sieradzki","Burzenin"]
[null,null,null,null,null,null,null,null,null,null,null,null,null,null,null,null,null,null,null,null,null,null,null,null,null,"sieradzki","Goszczanów"]
[null,null,null,null,null,null,null,null,null,null,null,null,null,null,null,null,null,null,null,null,null,null,null,null,null,"sieradzki","Klonowa"]
[null,null,null,null,null,null,null,null,null,null,null,null,null,null,null,null,null,null,null,null,null,null,null,null,null,"sieradzki","Sieradz"]
[null,null,null,null,null,null,null,null,null,null,null,null,null,null,null,null,null,null,null,null,null,null,null,null,null,"sieradzki","Warta"]
[null,null,null,null,null,null,null,null,null,null,null,null,null,null,null,null,null,null,null,null,null,null,null,null,null,"sieradzki","Wróblew"]
[null,null,null,null,null,null,null,null,null,null,null,null,null,null,null,null,null,null,null,null,null,null,null,null,null,"sieradzki","Złoczew"]
[null,null,null,null,null,null,null,null,null,null,null,null,null,null,null,null,null,null,null,null,null,null,null,null,null,"wieluński","Biała"]
[null,null,null,null,null,null,null,null,null,null,null,null,null,null,null,null,null,null,null,null,null,null,null,null,null,"wieluński","Czarnożyły"]
[null,null,null,null,null,null,null,null,null,null,null,null,null,null,null,null,null,null,null,null,null,null,null,null,null,"wieluński","Konopnica"]
[null,null,null,null,null,null,null,null,null,null,null,null,null,null,null,null,null,null,null,null,null,null,null,null,null,"wieluński","Mokrsko"]
[null,null,null,null,null,null,null,null,null,null,null,null,null,null,null,null,null,null,null,null,null,null,null,null,null,"wieluński","Osjaków"]
[null,null,null,null,null,null,null,null,null,null,null,null,null,null,null,null,null,null,null,null,null,null,null,null,null,"wieluński","Ostrówek"]
[null,null,null,null,null,null,null,null,null,null,null,null,null,null,null,null,null,null,null,null,null,null,null,null,null,"wieluński","Pątnów"]
[null,null,null,null,null,null,null,null,null,null,null,null,null,null,null,null,null,null,null,null,null,null,null,null,null,"wieluński","Skomlin"]
[null,null,null,null,null,null,null,null,null,null,null,null,null,null,null,null,null,null,null,null,null,null,null,null,null,"wieluński","Wieluń"]
[null,null,null,null,null,null,null,null,null,null,null,null,null,null,null,null,null,null,null,null,null,null,null,null,null,"wieluński","Wierzchlas"]
[null,null,null,null,null,null,null,null,null,null,null,null,null,null,null,null,null,null,null,null,null,null,null,null,null,"wieruszowski","Bolesławiec"]
[null,null,null,null,null,null,null,null,null,null,null,null,null,null,null,null,null,null,null,null,null,null,null,null,null,"wieruszowski","Czastary"]
[null,null,null,null,null,null,null,null,null,null,null,null,null,null,null,null,null,null,null,null,null,null,null,null,null,"wieruszowski","Galewice"]
[null,null,null,null,null,null,null,null,null,null,null,null,null,null,null,null,null,null,null,null,null,null,null,null,null,"wieruszowski","Lututów"]
[null,null,null,null,null,null,null,null,null,null,null,null,null,null,null,null,null,null,null,null,null,null,null,null,null,"wieruszowski","Łubnice"]
[null,null,null,null,null,null,null,null,null,null,null,null,null,null,null,null,null,null,null,null,null,null,null,null,null,"wieruszowski","Sokolniki"]
[null,null,null,null,null,null,null,null,null,null,null,null,null,null,null,null,null,null,null,null,null,null,null,null,null,"wieruszowski","Wieruszów"]
[null,null,null,null,null,null,null,null,null,null,null,null,null,null,null,null,null,null,null,null,null,null,null,null,null,"zduńskowolski","Zduńska Wola"]
[null,null,null,null,null,null,null,null,null,null,null,null,null,null,null,null,null,null,null,null,null,null,null,null,null,"zduńskowolski","Szadek"]
[null,null,null,null,null,null,null,null,null,null,null,null,null,null,null,null,null,null,null,null,null,null,null,null,null,"zduńskowolski","Zapolice"]
[null,null,null,null,null,null,null,null,null,null,null,null,null,null,null,null,null,null,null,null,null,null,null,null,null,"zduńskowolski","Zduńska Wola"]
[null,null,null,null,null,null,null,null,null,null,null,null,null,null,null,null,null,null,null,null,null,null,null,null,null,"kutnowski","Bedlno"]
[null,null,null,null,null,null,null,null,null,null,null,null,null,null,null,null,null,null,null,null,null,null,null,null,null,"kutnowski","Dąbrowice"]
[null,null,null,null,null,null,null,null,null,null,null,null,null,null,null,null,null,null,null,null,null,null,null,null,null,"kutnowski","Krośniewice"]
[null,null,null,null,null,null,null,null,null,null,null,null,null,null,null,null,null,null,null,null,null,null,null,null,null,"kutnowski","Krzyżanów"]
[null,null,null,null,null,null,null,null,null,null,null,null,null,null,null,null,null,null,null,null,null,null,null,null,null,"kutnowski","Kutno"]
[null,null,null,null,null,null,null,null,null,null,null,null,null,null,null,null,null,null,null,null,null,null,null,null,null,"kutnowski","Łanięta"]
[null,null,null,null,null,null,null,null,null,null,null,null,null,null,null,null,null,null,null,null,null,null,null,null,null,"kutnowski","Nowe Ostrowy"]
[null,null,null,null,null,null,null,null,null,null,null,null,null,null,null,null,null,null,null,null,null,null,null,null,null,"kutnowski","Oporów"]
[null,null,null,null,null,null,null,null,null,null,null,null,null,null,null,null,null,null,null,null,null,null,null,null,null,"kutnowski","Strzelce"]
[null,null,null,null,null,null,null,null,null,null,null,null,null,null,null,null,null,null,null,null,null,null,null,null,null,"kutnowski","Żychlin"]
[null,null,null,null,null,null,null,null,null,null,null,null,null,null,null,null,null,null,null,null,null,null,null,null,null,"łęczycki","Łęczyca"]
[null,null,null,null,null,null,null,null,null,null,null,null,null,null,null,null,null,null,null,null,null,null,null,null,null,"łęczycki","Daszyna"]
[null,null,null,null,null,null,null,null,null,null,null,null,null,null,null,null,null,null,null,null,null,null,null,null,null,"łęczycki","Góra Świętej Małgorzaty"]
[null,null,null,null,null,null,null,null,null,null,null,null,null,null,null,null,null,null,null,null,null,null,null,null,null,"łęczycki","Grabów"]
[null,null,null,null,null,null,null,null,null,null,null,null,null,null,null,null,null,null,null,null,null,null,null,null,null,"łęczycki","Łęczyca"]
[null,null,null,null,null,null,null,null,null,null,null,null,null,null,null,null,null,null,null,null,null,null,null,null,null,"łęczycki","Piątek"]
[null,null,null,null,null,null,null,null,null,null,null,null,null,null,null,null,null,null,null,null,null,null,null,null,null,"łęczycki","Piątek"]
[null,null,null,null,null,null,null,null,null,null,null,null,null,null,null,null,null,null,null,null,null,null,null,null,null,"łęczycki","Piątek"]
[null,null,null,null,null,null,null,null,null,null,null,null,null,null,null,null,null,null,null,null,null,null,null,null,null,"łęczycki","Świnice Warckie"]
[null,null,null,null,null,null,null,null,null,null,null,null,null,null,null,null,null,null,null,null,null,null,null,null,null,"łęczycki","Witonia"]
[null,null,null,null,null,null,null,null,null,null,null,null,null,null,null,null,null,null,null,null,null,null,null,null,null,"łowicki","Łowicz"]
[null,null,null,null,null,null,null,null,null,null,null,null,null,null,null,null,null,null,null,null,null,null,null,null,null,"łowicki","Bielawy"]
[null,null,null,null,null,null,null,null,null,null,null,null,null,null,null,null,null,null,null,null,null,null,null,null,null,"łowicki","Chąśno"]
[null,null,null,null,null,null,null,null,null,null,null,null,null,null,null,null,null,null,null,null,null,null,null,null,null,"łowicki","Domaniewice"]
[null,null,null,null,null,null,null,null,null,null,null,null,null,null,null,null,null,null,null,null,null,null,null,null,null,"łowicki","Kiernozia"]
[null,null,null,null,null,null,null,null,null,null,null,null,null,null,null,null,null,null,null,null,null,null,null,null,null,"łowicki","Kocierzew Południowy"]
[null,null,null,null,null,null,null,null,null,null,null,null,null,null,null,null,null,null,null,null,null,null,null,null,null,"łowicki","Łowicz"]
[null,null,null,null,null,null,null,null,null,null,null,null,null,null,null,null,null,null,null,null,null,null,null,null,null,"łowicki","Łyszkowice"]
[null,null,null,null,null,null,null,null,null,null,null,null,null,null,null,null,null,null,null,null,null,null,null,null,null,"łowicki","Nieborów"]
[null,null,null,null,null,null,null,null,null,null,null,null,null,null,null,null,null,null,null,null,null,null,null,null,null,"łowicki","Zduny"]
[null,null,null,null,null,null,null,null,null,null,null,null,null,null,null,null,null,null,null,null,null,null,null,null,null,"rawski","Rawa Mazowiecka"]
[null,null,null,null,null,null,null,null,null,null,null,null,null,null,null,null,null,null,null,null,null,null,null,null,null,"rawski","Biała Rawska"]
[null,null,null,null,null,null,null,null,null,null,null,null,null,null,null,null,null,null,null,null,null,null,null,null,null,"rawski","Cielądz"]
[null,null,null,null,null,null,null,null,null,null,null,null,null,null,null,null,null,null,null,null,null,null,null,null,null,"rawski","Regnów"]
[null,null,null,null,null,null,null,null,null,null,null,null,null,null,null,null,null,null,null,null,null,null,null,null,null,"rawski","Sadkowice"]
[null,null,null,null,null,null,null,null,null,null,null,null,null,null,null,null,null,null,null,null,null,null,null,null,null,"skierniewicki","Bolimów"]
[null,null,null,null,null,null,null,null,null,null,null,null,null,null,null,null,null,null,null,null,null,null,null,null,null,"skierniewicki","Głuchów"]
[null,null,null,null,null,null,null,null,null,null,null,null,null,null,null,null,null,null,null,null,null,null,null,null,null,"skierniewicki","Godzianów"]
[null,null,null,null,null,null,null,null,null,null,null,null,null,null,null,null,null,null,null,null,null,null,null,null,null,"skierniewicki","Kowiesy"]
[null,null,null,null,null,null,null,null,null,null,null,null,null,null,null,null,null,null,null,null,null,null,null,null,null,"skierniewicki","Lipce Reymontowskie"]
[null,null,null,null,null,null,null,null,null,null,null,null,null,null,null,null,null,null,null,null,null,null,null,null,null,"skierniewicki","Maków"]
[null,null,null,null,null,null,null,null,null,null,null,null,null,null,null,null,null,null,null,null,null,null,null,null,null,"skierniewicki","Nowy Kawęczyn"]
[null,null,null,null,null,null,null,null,null,null,null,null,null,null,null,null,null,null,null,null,null,null,null,null,null,"skierniewicki","Skierniewice"]
[null,null,null,null,null,null,null,null,null,null,null,null,null,null,null,null,null,null,null,null,null,null,null,null,null,"skierniewicki","Słupia"]
[null,null,null,null,null,null,null,null,null,null,null,null,null,null,null,null,null,null,null,null,null,null,null,null,null,"kielecki","Bieliny"]
[null,null,null,null,null,null,null,null,null,null,null,null,null,null,null,null,null,null,null,null,null,null,null,null,null,"kielecki","Bodzentyn"]
[null,null,null,null,null,null,null,null,null,null,null,null,null,null,null,null,null,null,null,null,null,null,null,null,null,"kielecki","Chęciny"]
[null,null,null,null,null,null,null,null,null,null,null,null,null,null,null,null,null,null,null,null,null,null,null,null,null,"kielecki","Chmielnik"]
[null,null,null,null,null,null,null,null,null,null,null,null,null,null,null,null,null,null,null,null,null,null,null,null,null,"kielecki","Daleszyce"]
[null,null,null,null,null,null,null,null,null,null,null,null,null,null,null,null,null,null,null,null,null,null,null,null,null,"kielecki","Górno"]
[null,null,null,null,null,null,null,null,null,null,null,null,null,null,null,null,null,null,null,null,null,null,null,null,null,"kielecki","Łagów"]
[null,null,null,null,null,null,null,null,null,null,null,null,null,null,null,null,null,null,null,null,null,null,null,null,null,"kielecki","Łopuszno"]
[null,null,null,null,null,null,null,null,null,null,null,null,null,null,null,null,null,null,null,null,null,null,null,null,null,"kielecki","Masłów"]
[null,null,null,null,null,null,null,null,null,null,null,null,null,null,null,null,null,null,null,null,null,null,null,null,null,"kielecki","Miedziana Góra"]
[null,null,null,null,null,null,null,null,null,null,null,null,null,null,null,null,null,null,null,null,null,null,null,null,null,"kielecki","Mniów"]
[null,null,null,null,null,null,null,null,null,null,null,null,null,null,null,null,null,null,null,null,null,null,null,null,null,"kielecki","Morawica"]
[null,null,null,null,null,null,null,null,null,null,null,null,null,null,null,null,null,null,null,null,null,null,null,null,null,"kielecki","Nowa Słupia"]
[null,null,null,null,null,null,null,null,null,null,null,null,null,null,null,null,null,null,null,null,null,null,null,null,null,"kielecki","Piekoszów"]
[null,null,null,null,null,null,null,null,null,null,null,null,null,null,null,null,null,null,null,null,null,null,null,null,null,"kielecki","Pierzchnica"]
[null,null,null,null,null,null,null,null,null,null,null,null,null,null,null,null,null,null,null,null,null,null,null,null,null,"kielecki","Raków"]
[null,null,null,null,null,null,null,null,null,null,null,null,null,null,null,null,null,null,null,null,null,null,null,null,null,"kielecki","Nowiny"]
[null,null,null,null,null,null,null,null,null,null,null,null,null,null,null,null,null,null,null,null,null,null,null,null,null,"kielecki","Strawczyn"]
[null,null,null,null,null,null,null,null,null,null,null,null,null,null,null,null,null,null,null,null,null,null,null,null,null,"kielecki","Zagnańsk"]
[null,null,null,null,null,null,null,null,null,null,null,null,null,null,null,null,null,null,null,null,null,null,null,null,null,"konecki","Fałków"]
[null,null,null,null,null,null,null,null,null,null,null,null,null,null,null,null,null,null,null,null,null,null,null,null,null,"konecki","Gowarczów"]
[null,null,null,null,null,null,null,null,null,null,null,null,null,null,null,null,null,null,null,null,null,null,null,null,null,"konecki","Końskie"]
[null,null,null,null,null,null,null,null,null,null,null,null,null,null,null,null,null,null,null,null,null,null,null,null,null,"konecki","Radoszyce"]
[null,null,null,null,null,null,null,null,null,null,null,null,null,null,null,null,null,null,null,null,null,null,null,null,null,"konecki","Ruda Maleniecka"]
[null,null,null,null,null,null,null,null,null,null,null,null,null,null,null,null,null,null,null,null,null,null,null,null,null,"konecki","Słupia Konecka"]
[null,null,null,null,null,null,null,null,null,null,null,null,null,null,null,null,null,null,null,null,null,null,null,null,null,"konecki","Smyków"]
[null,null,null,null,null,null,null,null,null,null,null,null,null,null,null,null,null,null,null,null,null,null,null,null,null,"konecki","Stąporków"]
[null,null,null,null,null,null,null,null,null,null,null,null,null,null,null,null,null,null,null,null,null,null,null,null,null,"ostrowiecki","Ostrowiec Świętokrzyski"]
[null,null,null,null,null,null,null,null,null,null,null,null,null,null,null,null,null,null,null,null,null,null,null,null,null,"ostrowiecki","Bałtów"]
[null,null,null,null,null,null,null,null,null,null,null,null,null,null,null,null,null,null,null,null,null,null,null,null,null,"ostrowiecki","Bodzechów"]
[null,null,null,null,null,null,null,null,null,null,null,null,null,null,null,null,null,null,null,null,null,null,null,null,null,"ostrowiecki","Ćmielów"]
[null,null,null,null,null,null,null,null,null,null,null,null,null,null,null,null,null,null,null,null,null,null,null,null,null,"ostrowiecki","Kunów"]
[null,null,null,null,null,null,null,null,null,null,null,null,null,null,null,null,null,null,null,null,null,null,null,null,null,"ostrowiecki","Waśniów"]
[null,null,null,null,null,null,null,null,null,null,null,null,null,null,null,null,null,null,null,null,null,null,null,null,null,"skarżyski","Skarżysko-Kamienna"]
[null,null,null,null,null,null,null,null,null,null,null,null,null,null,null,null,null,null,null,null,null,null,null,null,null,"skarżyski","Bliżyn"]
[null,null,null,null,null,null,null,null,null,null,null,null,null,null,null,null,null,null,null,null,null,null,null,null,null,"skarżyski","Łączna"]
[null,null,null,null,null,null,null,null,null,null,null,null,null,null,null,null,null,null,null,null,null,null,null,null,null,"skarżyski","Skarżysko Kościelne"]
[null,null,null,null,null,null,null,null,null,null,null,null,null,null,null,null,null,null,null,null,null,null,null,null,null,"skarżyski","Suchedniów"]
[null,null,null,null,null,null,null,null,null,null,null,null,null,null,null,null,null,null,null,null,null,null,null,null,null,"starachowicki","Starachowice"]
[null,null,null,null,null,null,null,null,null,null,null,null,null,null,null,null,null,null,null,null,null,null,null,null,null,"starachowicki","Brody"]
[null,null,null,null,null,null,null,null,null,null,null,null,null,null,null,null,null,null,null,null,null,null,null,null,null,"starachowicki","Mirzec"]
[null,null,null,null,null,null,null,null,null,null,null,null,null,null,null,null,null,null,null,null,null,null,null,null,null,"starachowicki","Pawłów"]
[null,null,null,null,null,null,null,null,null,null,null,null,null,null,null,null,null,null,null,null,null,null,null,null,null,"starachowicki","Wąchock"]
[null,null,null,null,null,null,null,null,null,null,null,null,null,null,null,null,null,null,null,null,null,null,null,null,null,"Kielce","Kielce"]
[null,null,null,null,null,null,null,null,null,null,null,null,null,null,null,null,null,null,null,null,null,null,null,null,null,"buski","Busko-Zdrój"]
[null,null,null,null,null,null,null,null,null,null,null,null,null,null,null,null,null,null,null,null,null,null,null,null,null,"buski","Gnojno"]
[null,null,null,null,null,null,null,null,null,null,null,null,null,null,null,null,null,null,null,null,null,null,null,null,null,"buski","Nowy Korczyn"]
[null,null,null,null,null,null,null,null,null,null,null,null,null,null,null,null,null,null,null,null,null,null,null,null,null,"buski","Pacanów"]
[null,null,null,null,null,null,null,null,null,null,null,null,null,null,null,null,null,null,null,null,null,null,null,null,null,"buski","Solec-Zdrój"]
[null,null,null,null,null,null,null,null,null,null,null,null,null,null,null,null,null,null,null,null,null,null,null,null,null,"buski","Stopnica"]
[null,null,null,null,null,null,null,null,null,null,null,null,null,null,null,null,null,null,null,null,null,null,null,null,null,"buski","Tuczępy"]
[null,null,null,null,null,null,null,null,null,null,null,null,null,null,null,null,null,null,null,null,null,null,null,null,null,"buski","Wiślica"]
[null,null,null,null,null,null,null,null,null,null,null,null,null,null,null,null,null,null,null,null,null,null,null,null,null,"jędrzejowski","Imielno"]
[null,null,null,null,null,null,null,null,null,null,null,null,null,null,null,null,null,null,null,null,null,null,null,null,null,"jędrzejowski","Jędrzejów"]
[null,null,null,null,null,null,null,null,null,null,null,null,null,null,null,null,null,null,null,null,null,null,null,null,null,"jędrzejowski","Małogoszcz"]
[null,null,null,null,null,null,null,null,null,null,null,null,null,null,null,null,null,null,null,null,null,null,null,null,null,"jędrzejowski","Nagłowice"]
[null,null,null,null,null,null,null,null,null,null,null,null,null,null,null,null,null,null,null,null,null,null,null,null,null,"jędrzejowski","Oksa"]
[null,null,null,null,null,null,null,null,null,null,null,null,null,null,null,null,null,null,null,null,null,null,null,null,null,"jędrzejowski","Sędziszów"]
[null,null,null,null,null,null,null,null,null,null,null,null,null,null,null,null,null,null,null,null,null,null,null,null,null,"jędrzejowski","Słupia"]
[null,null,null,null,null,null,null,null,null,null,null,null,null,null,null,null,null,null,null,null,null,null,null,null,null,"jędrzejowski","Sobków"]
[null,null,null,null,null,null,null,null,null,null,null,null,null,null,null,null,null,null,null,null,null,null,null,null,null,"jędrzejowski","Wodzisław"]
[null,null,null,null,null,null,null,null,null,null,null,null,null,null,null,null,null,null,null,null,null,null,null,null,null,"kazimierski","Bejsce"]
[null,null,null,null,null,null,null,null,null,null,null,null,null,null,null,null,null,null,null,null,null,null,null,null,null,"kazimierski","Czarnocin"]
[null,null,null,null,null,null,null,null,null,null,null,null,null,null,null,null,null,null,null,null,null,null,null,null,null,"kazimierski","Kazimierza Wielka"]
[null,null,null,null,null,null,null,null,null,null,null,null,null,null,null,null,null,null,null,null,null,null,null,null,null,"kazimierski","Opatowiec"]
[null,null,null,null,null,null,null,null,null,null,null,null,null,null,null,null,null,null,null,null,null,null,null,null,null,"kazimierski","Skalbmierz"]
[null,null,null,null,null,null,null,null,null,null,null,null,null,null,null,null,null,null,null,null,null,null,null,null,null,"opatowski","Baćkowice"]
[null,null,null,null,null,null,null,null,null,null,null,null,null,null,null,null,null,null,null,null,null,null,null,null,null,"opatowski","Iwaniska"]
[null,null,null,null,null,null,null,null,null,null,null,null,null,null,null,null,null,null,null,null,null,null,null,null,null,"opatowski","Lipnik"]
[null,null,null,null,null,null,null,null,null,null,null,null,null,null,null,null,null,null,null,null,null,null,null,null,null,"opatowski","Opatów"]
[null,null,null,null,null,null,null,null,null,null,null,null,null,null,null,null,null,null,null,null,null,null,null,null,null,"opatowski","Ożarów"]
[null,null,null,null,null,null,null,null,null,null,null,null,null,null,null,null,null,null,null,null,null,null,null,null,null,"opatowski","Sadowie"]
[null,null,null,null,null,null,null,null,null,null,null,null,null,null,null,null,null,null,null,null,null,null,null,null,null,"opatowski","Tarłów"]
[null,null,null,null,null,null,null,null,null,null,null,null,null,null,null,null,null,null,null,null,null,null,null,null,null,"opatowski","Wojciechowice"]
[null,null,null,null,null,null,null,null,null,null,null,null,null,null,null,null,null,null,null,null,null,null,null,null,null,"pińczowski","Działoszyce"]
[null,null,null,null,null,null,null,null,null,null,null,null,null,null,null,null,null,null,null,null,null,null,null,null,null,"pińczowski","Kije"]
[null,null,null,null,null,null,null,null,null,null,null,null,null,null,null,null,null,null,null,null,null,null,null,null,null,"pińczowski","Michałów"]
[null,null,null,null,null,null,null,null,null,null,null,null,null,null,null,null,null,null,null,null,null,null,null,null,null,"pińczowski","Pińczów"]
[null,null,null,null,null,null,null,null,null,null,null,null,null,null,null,null,null,null,null,null,null,null,null,null,null,"pińczowski","Złota"]
[null,null,null,null,null,null,null,null,null,null,null,null,null,null,null,null,null,null,null,null,null,null,null,null,null,"sandomierski","Sandomierz"]
[null,null,null,null,null,null,null,null,null,null,null,null,null,null,null,null,null,null,null,null,null,null,null,null,null,"sandomierski","Dwikozy"]
[null,null,null,null,null,null,null,null,null,null,null,null,null,null,null,null,null,null,null,null,null,null,null,null,null,"sandomierski","Klimontów"]
[null,null,null,null,null,null,null,null,null,null,null,null,null,null,null,null,null,null,null,null,null,null,null,null,null,"sandomierski","Koprzywnica"]
[null,null,null,null,null,null,null,null,null,null,null,null,null,null,null,null,null,null,null,null,null,null,null,null,null,"sandomierski","Łoniów"]
[null,null,null,null,null,null,null,null,null,null,null,null,null,null,null,null,null,null,null,null,null,null,null,null,null,"sandomierski","Obrazów"]
[null,null,null,null,null,null,null,null,null,null,null,null,null,null,null,null,null,null,null,null,null,null,null,null,null,"sandomierski","Samborzec"]
[null,null,null,null,null,null,null,null,null,null,null,null,null,null,null,null,null,null,null,null,null,null,null,null,null,"sandomierski","Wilczyce"]
[null,null,null,null,null,null,null,null,null,null,null,null,null,null,null,null,null,null,null,null,null,null,null,null,null,"sandomierski","Zawichost"]
[null,null,null,null,null,null,null,null,null,null,null,null,null,null,null,null,null,null,null,null,null,null,null,null,null,"staszowski","Bogoria"]
[null,null,null,null,null,null,null,null,null,null,null,null,null,null,null,null,null,null,null,null,null,null,null,null,null,"staszowski","Łubnice"]
[null,null,null,null,null,null,null,null,null,null,null,null,null,null,null,null,null,null,null,null,null,null,null,null,null,"staszowski","Oleśnica"]
[null,null,null,null,null,null,null,null,null,null,null,null,null,null,null,null,null,null,null,null,null,null,null,null,null,"staszowski","Osiek"]
[null,null,null,null,null,null,null,null,null,null,null,null,null,null,null,null,null,null,null,null,null,null,null,null,null,"staszowski","Połaniec"]
[null,null,null,null,null,null,null,null,null,null,null,null,null,null,null,null,null,null,null,null,null,null,null,null,null,"staszowski","Rytwiany"]
[null,null,null,null,null,null,null,null,null,null,null,null,null,null,null,null,null,null,null,null,null,null,null,null,null,"staszowski","Staszów"]
[null,null,null,null,null,null,null,null,null,null,null,null,null,null,null,null,null,null,null,null,null,null,null,null,null,"staszowski","Szydłów"]
[null,null,null,null,null,null,null,null,null,null,null,null,null,null,null,null,null,null,null,null,null,null,null,null,null,"włoszczowski","Kluczewsko"]
[null,null,null,null,null,null,null,null,null,null,null,null,null,null,null,null,null,null,null,null,null,null,null,null,null,"włoszczowski","Krasocin"]
[null,null,null,null,null,null,null,null,null,null,null,null,null,null,null,null,null,null,null,null,null,null,null,null,null,"włoszczowski","Moskorzew"]
[null,null,null,null,null,null,null,null,null,null,null,null,null,null,null,null,null,null,null,null,null,null,null,null,null,"włoszczowski","Radków"]
[null,null,null,null,null,null,null,null,null,null,null,null,null,null,null,null,null,null,null,null,null,null,null,null,null,"włoszczowski","Secemin"]
[null,null,null,null,null,null,null,null,null,null,null,null,null,null,null,null,null,null,null,null,null,null,null,null,null,"włoszczowski","Włoszczowa"]
[null,null,null,null,null,null,null,null,null,null,null,null,null,null,null,null,null,null,null,null,null,null,null,null,null,"bialski","Terespol"]
[null,null,null,null,null,null,null,null,null,null,null,null,null,null,null,null,null,null,null,null,null,null,null,null,null,"bialski","Biała Podlaska"]
[null,null,null,null,null,null,null,null,null,null,null,null,null,null,null,null,null,null,null,null,null,null,null,null,null,"bialski","Drelów"]
[null,null,null,null,null,null,null,null,null,null,null,null,null,null,null,null,null,null,null,null,null,null,null,null,null,"bialski","Janów Podlaski"]
[null,null,null,null,null,null,null,null,null,null,null,null,null,null,null,null,null,null,null,null,null,null,null,null,null,"bialski","Kodeń"]
[null,null,null,null,null,null,null,null,null,null,null,null,null,null,null,null,null,null,null,null,null,null,null,null,null,"bialski","Konstantynów"]
[null,null,null,null,null,null,null,null,null,null,null,null,null,null,null,null,null,null,null,null,null,null,null,null,null,"bialski","Leśna Podlaska"]
[null,null,null,null,null,null,null,null,null,null,null,null,null,null,null,null,null,null,null,null,null,null,null,null,null,"bialski","Łomazy"]
[null,null,null,null,null,null,null,null,null,null,null,null,null,null,null,null,null,null,null,null,null,null,null,null,null,"bialski","Międzyrzec Podlaski"]
[null,null,null,null,null,null,null,null,null,null,null,null,null,null,null,null,null,null,null,null,null,null,null,null,null,"bialski","Piszczac"]
[null,null,null,null,null,null,null,null,null,null,null,null,null,null,null,null,null,null,null,null,null,null,null,null,null,"bialski","Rokitno"]
[null,null,null,null,null,null,null,null,null,null,null,null,null,null,null,null,null,null,null,null,null,null,null,null,null,"bialski","Rossosz"]
[null,null,null,null,null,null,null,null,null,null,null,null,null,null,null,null,null,null,null,null,null,null,null,null,null,"bialski","Sławatycze"]
[null,null,null,null,null,null,null,null,null,null,null,null,null,null,null,null,null,null,null,null,null,null,null,null,null,"bialski","Sosnówka"]
[null,null,null,null,null,null,null,null,null,null,null,null,null,null,null,null,null,null,null,null,null,null,null,null,null,"bialski","Terespol"]
[null,null,null,null,null,null,null,null,null,null,null,null,null,null,null,null,null,null,null,null,null,null,null,null,null,"bialski","Tuczna"]
[null,null,null,null,null,null,null,null,null,null,null,null,null,null,null,null,null,null,null,null,null,null,null,null,null,"bialski","Wisznice"]
[null,null,null,null,null,null,null,null,null,null,null,null,null,null,null,null,null,null,null,null,null,null,null,null,null,"bialski","Zalesie"]
[null,null,null,null,null,null,null,null,null,null,null,null,null,null,null,null,null,null,null,null,null,null,null,null,null,"parczewski","Dębowa Kłoda"]
[null,null,null,null,null,null,null,null,null,null,null,null,null,null,null,null,null,null,null,null,null,null,null,null,null,"parczewski","Jabłoń"]
[null,null,null,null,null,null,null,null,null,null,null,null,null,null,null,null,null,null,null,null,null,null,null,null,null,"parczewski","Milanów"]
[null,null,null,null,null,null,null,null,null,null,null,null,null,null,null,null,null,null,null,null,null,null,null,null,null,"parczewski","Parczew"]
[null,null,null,null,null,null,null,null,null,null,null,null,null,null,null,null,null,null,null,null,null,null,null,null,null,"parczewski","Podedwórze"]
[null,null,null,null,null,null,null,null,null,null,null,null,null,null,null,null,null,null,null,null,null,null,null,null,null,"parczewski","Siemień"]
[null,null,null,null,null,null,null,null,null,null,null,null,null,null,null,null,null,null,null,null,null,null,null,null,null,"parczewski","Sosnowica"]
[null,null,null,null,null,null,null,null,null,null,null,null,null,null,null,null,null,null,null,null,null,null,null,null,null,"radzyński","Radzyń Podlaski"]
[null,null,null,null,null,null,null,null,null,null,null,null,null,null,null,null,null,null,null,null,null,null,null,null,null,"radzyński","Borki"]
[null,null,null,null,null,null,null,null,null,null,null,null,null,null,null,null,null,null,null,null,null,null,null,null,null,"radzyński","Czemierniki"]
[null,null,null,null,null,null,null,null,null,null,null,null,null,null,null,null,null,null,null,null,null,null,null,null,null,"radzyński","Kąkolewnica"]
[null,null,null,null,null,null,null,null,null,null,null,null,null,null,null,null,null,null,null,null,null,null,null,null,null,"radzyński","Komarówka Podlaska"]
[null,null,null,null,null,null,null,null,null,null,null,null,null,null,null,null,null,null,null,null,null,null,null,null,null,"radzyński","Radzyń Podlaski"]
[null,null,null,null,null,null,null,null,null,null,null,null,null,null,null,null,null,null,null,null,null,null,null,null,null,"radzyński","Ulan-Majorat"]
[null,null,null,null,null,null,null,null,null,null,null,null,null,null,null,null,null,null,null,null,null,null,null,null,null,"radzyński","Wohyń"]
[null,null,null,null,null,null,null,null,null,null,null,null,null,null,null,null,null,null,null,null,null,null,null,null,null,"włodawski","Włodawa"]
[null,null,null,null,null,null,null,null,null,null,null,null,null,null,null,null,null,null,null,null,null,null,null,null,null,"włodawski","Hanna"]
[null,null,null,null,null,null,null,null,null,null,null,null,null,null,null,null,null,null,null,null,null,null,null,null,null,"włodawski","Hańsk"]
[null,null,null,null,null,null,null,null,null,null,null,null,null,null,null,null,null,null,null,null,null,null,null,null,null,"włodawski","Stary Brus"]
[null,null,null,null,null,null,null,null,null,null,null,null,null,null,null,null,null,null,null,null,null,null,null,null,null,"włodawski","Urszulin"]
[null,null,null,null,null,null,null,null,null,null,null,null,null,null,null,null,null,null,null,null,null,null,null,null,null,"włodawski","Włodawa"]
[null,null,null,null,null,null,null,null,null,null,null,null,null,null,null,null,null,null,null,null,null,null,null,null,null,"włodawski","Wola Uhruska"]
[null,null,null,null,null,null,null,null,null,null,null,null,null,null,null,null,null,null,null,null,null,null,null,null,null,"włodawski","Wyryki"]
[null,null,null,null,null,null,null,null,null,null,null,null,null,null,null,null,null,null,null,null,null,null,null,null,null,"Biała Podlaska","Biała Podlaska"]
[null,null,null,null,null,null,null,null,null,null,null,null,null,null,null,null,null,null,null,null,null,null,null,null,null,"biłgorajski","Aleksandrów"]
[null,null,null,null,null,null,null,null,null,null,null,null,null,null,null,null,null,null,null,null,null,null,null,null,null,"biłgorajski","Biłgoraj"]
[null,null,null,null,null,null,null,null,null,null,null,null,null,null,null,null,null,null,null,null,null,null,null,null,null,"biłgorajski","Biszcza"]
[null,null,null,null,null,null,null,null,null,null,null,null,null,null,null,null,null,null,null,null,null,null,null,null,null,"biłgorajski","Frampol"]
[null,null,null,null,null,null,null,null,null,null,null,null,null,null,null,null,null,null,null,null,null,null,null,null,null,"biłgorajski","Goraj"]
[null,null,null,null,null,null,null,null,null,null,null,null,null,null,null,null,null,null,null,null,null,null,null,null,null,"biłgorajski","Józefów"]
[null,null,null,null,null,null,null,null,null,null,null,null,null,null,null,null,null,null,null,null,null,null,null,null,null,"biłgorajski","Księżpol"]
[null,null,null,null,null,null,null,null,null,null,null,null,null,null,null,null,null,null,null,null,null,null,null,null,null,"biłgorajski","Łukowa"]
[null,null,null,null,null,null,null,null,null,null,null,null,null,null,null,null,null,null,null,null,null,null,null,null,null,"biłgorajski","Obsza"]
[null,null,null,null,null,null,null,null,null,null,null,null,null,null,null,null,null,null,null,null,null,null,null,null,null,"biłgorajski","Potok Górny"]
[null,null,null,null,null,null,null,null,null,null,null,null,null,null,null,null,null,null,null,null,null,null,null,null,null,"biłgorajski","Tarnogród"]
[null,null,null,null,null,null,null,null,null,null,null,null,null,null,null,null,null,null,null,null,null,null,null,null,null,"biłgorajski","Tereszpol"]
[null,null,null,null,null,null,null,null,null,null,null,null,null,null,null,null,null,null,null,null,null,null,null,null,null,"biłgorajski","Turobin"]
[null,null,null,null,null,null,null,null,null,null,null,null,null,null,null,null,null,null,null,null,null,null,null,null,null,"chełmski","Rejowiec Fabryczny"]
[null,null,null,null,null,null,null,null,null,null,null,null,null,null,null,null,null,null,null,null,null,null,null,null,null,"chełmski","Białopole"]
[null,null,null,null,null,null,null,null,null,null,null,null,null,null,null,null,null,null,null,null,null,null,null,null,null,"chełmski","Chełm"]
[null,null,null,null,null,null,null,null,null,null,null,null,null,null,null,null,null,null,null,null,null,null,null,null,null,"chełmski","Dorohusk"]
[null,null,null,null,null,null,null,null,null,null,null,null,null,null,null,null,null,null,null,null,null,null,null,null,null,"chełmski","Dubienka"]
[null,null,null,null,null,null,null,null,null,null,null,null,null,null,null,null,null,null,null,null,null,null,null,null,null,"chełmski","Kamień"]
[null,null,null,null,null,null,null,null,null,null,null,null,null,null,null,null,null,null,null,null,null,null,null,null,null,"chełmski","Leśniowice"]
[null,null,null,null,null,null,null,null,null,null,null,null,null,null,null,null,null,null,null,null,null,null,null,null,null,"chełmski","Rejowiec Fabryczny"]
[null,null,null,null,null,null,null,null,null,null,null,null,null,null,null,null,null,null,null,null,null,null,null,null,null,"chełmski","Ruda-Huta"]
[null,null,null,null,null,null,null,null,null,null,null,null,null,null,null,null,null,null,null,null,null,null,null,null,null,"chełmski","Sawin"]
[null,null,null,null,null,null,null,null,null,null,null,null,null,null,null,null,null,null,null,null,null,null,null,null,null,"chełmski","Siedliszcze"]
[null,null,null,null,null,null,null,null,null,null,null,null,null,null,null,null,null,null,null,null,null,null,null,null,null,"chełmski","Wierzbica"]
[null,null,null,null,null,null,null,null,null,null,null,null,null,null,null,null,null,null,null,null,null,null,null,null,null,"chełmski","Wojsławice"]
[null,null,null,null,null,null,null,null,null,null,null,null,null,null,null,null,null,null,null,null,null,null,null,null,null,"chełmski","Żmudź"]
[null,null,null,null,null,null,null,null,null,null,null,null,null,null,null,null,null,null,null,null,null,null,null,null,null,"chełmski","Rejowiec"]
[null,null,null,null,null,null,null,null,null,null,null,null,null,null,null,null,null,null,null,null,null,null,null,null,null,"hrubieszowski","Dołhobyczów"]
[null,null,null,null,null,null,null,null,null,null,null,null,null,null,null,null,null,null,null,null,null,null,null,null,null,"hrubieszowski","Horodło"]
[null,null,null,null,null,null,null,null,null,null,null,null,null,null,null,null,null,null,null,null,null,null,null,null,null,"hrubieszowski","Hrubieszów"]
[null,null,null,null,null,null,null,null,null,null,null,null,null,null,null,null,null,null,null,null,null,null,null,null,null,"hrubieszowski","Mircze"]
[null,null,null,null,null,null,null,null,null,null,null,null,null,null,null,null,null,null,null,null,null,null,null,null,null,"hrubieszowski","Trzeszczany"]
[null,null,null,null,null,null,null,null,null,null,null,null,null,null,null,null,null,null,null,null,null,null,null,null,null,"hrubieszowski","Uchanie"]
[null,null,null,null,null,null,null,null,null,null,null,null,null,null,null,null,null,null,null,null,null,null,null,null,null,"hrubieszowski","Werbkowice"]
[null,null,null,null,null,null,null,null,null,null,null,null,null,null,null,null,null,null,null,null,null,null,null,null,null,"krasnostawski","Krasnystaw"]
[null,null,null,null,null,null,null,null,null,null,null,null,null,null,null,null,null,null,null,null,null,null,null,null,null,"krasnostawski","Fajsławice"]
[null,null,null,null,null,null,null,null,null,null,null,null,null,null,null,null,null,null,null,null,null,null,null,null,null,"krasnostawski","Gorzków"]
[null,null,null,null,null,null,null,null,null,null,null,null,null,null,null,null,null,null,null,null,null,null,null,null,null,"krasnostawski","Izbica"]
[null,null,null,null,null,null,null,null,null,null,null,null,null,null,null,null,null,null,null,null,null,null,null,null,null,"krasnostawski","Krasnystaw"]
[null,null,null,null,null,null,null,null,null,null,null,null,null,null,null,null,null,null,null,null,null,null,null,null,null,"krasnostawski","Kraśniczyn"]
[null,null,null,null,null,null,null,null,null,null,null,null,null,null,null,null,null,null,null,null,null,null,null,null,null,"krasnostawski","Łopiennik Górny"]
[null,null,null,null,null,null,null,null,null,null,null,null,null,null,null,null,null,null,null,null,null,null,null,null,null,"krasnostawski","Rudnik"]
[null,null,null,null,null,null,null,null,null,null,null,null,null,null,null,null,null,null,null,null,null,null,null,null,null,"krasnostawski","Siennica Różana"]
[null,null,null,null,null,null,null,null,null,null,null,null,null,null,null,null,null,null,null,null,null,null,null,null,null,"krasnostawski","Żółkiewka"]
[null,null,null,null,null,null,null,null,null,null,null,null,null,null,null,null,null,null,null,null,null,null,null,null,null,"tomaszowski","Tomaszów Lubelski"]
[null,null,null,null,null,null,null,null,null,null,null,null,null,null,null,null,null,null,null,null,null,null,null,null,null,"tomaszowski","Bełżec"]
[null,null,null,null,null,null,null,null,null,null,null,null,null,null,null,null,null,null,null,null,null,null,null,null,null,"tomaszowski","Jarczów"]
[null,null,null,null,null,null,null,null,null,null,null,null,null,null,null,null,null,null,null,null,null,null,null,null,null,"tomaszowski","Krynice"]
[null,null,null,null,null,null,null,null,null,null,null,null,null,null,null,null,null,null,null,null,null,null,null,null,null,"tomaszowski","Lubycza Królewska"]
[null,null,null,null,null,null,null,null,null,null,null,null,null,null,null,null,null,null,null,null,null,null,null,null,null,"tomaszowski","Łaszczów"]
[null,null,null,null,null,null,null,null,null,null,null,null,null,null,null,null,null,null,null,null,null,null,null,null,null,"tomaszowski","Rachanie"]
[null,null,null,null,null,null,null,null,null,null,null,null,null,null,null,null,null,null,null,null,null,null,null,null,null,"tomaszowski","Susiec"]
[null,null,null,null,null,null,null,null,null,null,null,null,null,null,null,null,null,null,null,null,null,null,null,null,null,"tomaszowski","Tarnawatka"]
[null,null,null,null,null,null,null,null,null,null,null,null,null,null,null,null,null,null,null,null,null,null,null,null,null,"tomaszowski","Telatyn"]
[null,null,null,null,null,null,null,null,null,null,null,null,null,null,null,null,null,null,null,null,null,null,null,null,null,"tomaszowski","Tomaszów Lubelski"]
[null,null,null,null,null,null,null,null,null,null,null,null,null,null,null,null,null,null,null,null,null,null,null,null,null,"tomaszowski","Tyszowce"]
[null,null,null,null,null,null,null,null,null,null,null,null,null,null,null,null,null,null,null,null,null,null,null,null,null,"tomaszowski","Ulhówek"]
[null,null,null,null,null,null,null,null,null,null,null,null,null,null,null,null,null,null,null,null,null,null,null,null,null,"zamojski","Adamów"]
[null,null,null,null,null,null,null,null,null,null,null,null,null,null,null,null,null,null,null,null,null,null,null,null,null,"zamojski","Grabowiec"]
[null,null,null,null,null,null,null,null,null,null,null,null,null,null,null,null,null,null,null,null,null,null,null,null,null,"zamojski","Komarów-Osada"]
[null,null,null,null,null,null,null,null,null,null,null,null,null,null,null,null,null,null,null,null,null,null,null,null,null,"zamojski","Krasnobród"]
[null,null,null,null,null,null,null,null,null,null,null,null,null,null,null,null,null,null,null,null,null,null,null,null,null,"zamojski","Łabunie"]
[null,null,null,null,null,null,null,null,null,null,null,null,null,null,null,null,null,null,null,null,null,null,null,null,null,"zamojski","Miączyn"]
[null,null,null,null,null,null,null,null,null,null,null,null,null,null,null,null,null,null,null,null,null,null,null,null,null,"zamojski","Nielisz"]
[null,null,null,null,null,null,null,null,null,null,null,null,null,null,null,null,null,null,null,null,null,null,null,null,null,"zamojski","Radecznica"]
[null,null,null,null,null,null,null,null,null,null,null,null,null,null,null,null,null,null,null,null,null,null,null,null,null,"zamojski","Sitno"]
[null,null,null,null,null,null,null,null,null,null,null,null,null,null,null,null,null,null,null,null,null,null,null,null,null,"zamojski","Skierbieszów"]
[null,null,null,null,null,null,null,null,null,null,null,null,null,null,null,null,null,null,null,null,null,null,null,null,null,"zamojski","Stary Zamość"]
[null,null,null,null,null,null,null,null,null,null,null,null,null,null,null,null,null,null,null,null,null,null,null,null,null,"zamojski","Sułów"]
[null,null,null,null,null,null,null,null,null,null,null,null,null,null,null,null,null,null,null,null,null,null,null,null,null,"zamojski","Szczebrzeszyn"]
[null,null,null,null,null,null,null,null,null,null,null,null,null,null,null,null,null,null,null,null,null,null,null,null,null,"zamojski","Zamość"]
[null,null,null,null,null,null,null,null,null,null,null,null,null,null,null,null,null,null,null,null,null,null,null,null,null,"zamojski","Zwierzyniec"]
[null,null,null,null,null,null,null,null,null,null,null,null,null,null,null,null,null,null,null,null,null,null,null,null,null,"Chełm","Chełm"]
[null,null,null,null,null,null,null,null,null,null,null,null,null,null,null,null,null,null,null,null,null,null,null,null,null,"Zamość","Zamość"]
[null,null,null,null,null,null,null,null,null,null,null,null,null,null,null,null,null,null,null,null,null,null,null,null,null,"lubartowski","Lubartów"]
[null,null,null,null,null,null,null,null,null,null,null,null,null,null,null,null,null,null,null,null,null,null,null,null,null,"lubartowski","Abramów"]
[null,null,null,null,null,null,null,null,null,null,null,null,null,null,null,null,null,null,null,null,null,null,null,null,null,"lubartowski","Firlej"]
[null,null,null,null,null,null,null,null,null,null,null,null,null,null,null,null,null,null,null,null,null,null,null,null,null,"lubartowski","Jeziorzany"]
[null,null,null,null,null,null,null,null,null,null,null,null,null,null,null,null,null,null,null,null,null,null,null,null,null,"lubartowski","Kamionka"]
[null,null,null,null,null,null,null,null,null,null,null,null,null,null,null,null,null,null,null,null,null,null,null,null,null,"lubartowski","Kock"]
[null,null,null,null,null,null,null,null,null,null,null,null,null,null,null,null,null,null,null,null,null,null,null,null,null,"lubartowski","Lubartów"]
[null,null,null,null,null,null,null,null,null,null,null,null,null,null,null,null,null,null,null,null,null,null,null,null,null,"lubartowski","Michów"]
[null,null,null,null,null,null,null,null,null,null,null,null,null,null,null,null,null,null,null,null,null,null,null,null,null,"lubartowski","Niedźwiada"]
[null,null,null,null,null,null,null,null,null,null,null,null,null,null,null,null,null,null,null,null,null,null,null,null,null,"lubartowski","Ostrów Lubelski"]
[null,null,null,null,null,null,null,null,null,null,null,null,null,null,null,null,null,null,null,null,null,null,null,null,null,"lubartowski","Ostrówek"]
[null,null,null,null,null,null,null,null,null,null,null,null,null,null,null,null,null,null,null,null,null,null,null,null,null,"lubartowski","Serniki"]
[null,null,null,null,null,null,null,null,null,null,null,null,null,null,null,null,null,null,null,null,null,null,null,null,null,"lubartowski","Uścimów"]
[null,null,null,null,null,null,null,null,null,null,null,null,null,null,null,null,null,null,null,null,null,null,null,null,null,"lubelski","Bełżyce"]
[null,null,null,null,null,null,null,null,null,null,null,null,null,null,null,null,null,null,null,null,null,null,null,null,null,"lubelski","Borzechów"]
[null,null,null,null,null,null,null,null,null,null,null,null,null,null,null,null,null,null,null,null,null,null,null,null,null,"lubelski","Bychawa"]
[null,null,null,null,null,null,null,null,null,null,null,null,null,null,null,null,null,null,null,null,null,null,null,null,null,"lubelski","Garbów"]
[null,null,null,null,null,null,null,null,null,null,null,null,null,null,null,null,null,null,null,null,null,null,null,null,null,"lubelski","Głusk"]
[null,null,null,null,null,null,null,null,null,null,null,null,null,null,null,null,null,null,null,null,null,null,null,null,null,"lubelski","Jabłonna"]
[null,null,null,null,null,null,null,null,null,null,null,null,null,null,null,null,null,null,null,null,null,null,null,null,null,"lubelski","Jastków"]
[null,null,null,null,null,null,null,null,null,null,null,null,null,null,null,null,null,null,null,null,null,null,null,null,null,"lubelski","Konopnica"]
[null,null,null,null,null,null,null,null,null,null,null,null,null,null,null,null,null,null,null,null,null,null,null,null,null,"lubelski","Krzczonów"]
[null,null,null,null,null,null,null,null,null,null,null,null,null,null,null,null,null,null,null,null,null,null,null,null,null,"lubelski","Niedrzwica Duża"]
[null,null,null,null,null,null,null,null,null,null,null,null,null,null,null,null,null,null,null,null,null,null,null,null,null,"lubelski","Niemce"]
[null,null,null,null,null,null,null,null,null,null,null,null,null,null,null,null,null,null,null,null,null,null,null,null,null,"lubelski","Strzyżewice"]
[null,null,null,null,null,null,null,null,null,null,null,null,null,null,null,null,null,null,null,null,null,null,null,null,null,"lubelski","Wojciechów"]
[null,null,null,null,null,null,null,null,null,null,null,null,null,null,null,null,null,null,null,null,null,null,null,null,null,"lubelski","Wólka"]
[null,null,null,null,null,null,null,null,null,null,null,null,null,null,null,null,null,null,null,null,null,null,null,null,null,"lubelski","Wysokie"]
[null,null,null,null,null,null,null,null,null,null,null,null,null,null,null,null,null,null,null,null,null,null,null,null,null,"lubelski","Zakrzew"]
[null,null,null,null,null,null,null,null,null,null,null,null,null,null,null,null,null,null,null,null,null,null,null,null,null,"łęczyński","Cyców"]
[null,null,null,null,null,null,null,null,null,null,null,null,null,null,null,null,null,null,null,null,null,null,null,null,null,"łęczyński","Ludwin"]
[null,null,null,null,null,null,null,null,null,null,null,null,null,null,null,null,null,null,null,null,null,null,null,null,null,"łęczyński","Łęczna"]
[null,null,null,null,null,null,null,null,null,null,null,null,null,null,null,null,null,null,null,null,null,null,null,null,null,"łęczyński","Milejów"]
[null,null,null,null,null,null,null,null,null,null,null,null,null,null,null,null,null,null,null,null,null,null,null,null,null,"łęczyński","Puchaczów"]
[null,null,null,null,null,null,null,null,null,null,null,null,null,null,null,null,null,null,null,null,null,null,null,null,null,"łęczyński","Spiczyn"]
[null,null,null,null,null,null,null,null,null,null,null,null,null,null,null,null,null,null,null,null,null,null,null,null,null,"świdnicki","Świdnik"]
[null,null,null,null,null,null,null,null,null,null,null,null,null,null,null,null,null,null,null,null,null,null,null,null,null,"świdnicki","Mełgiew"]
[null,null,null,null,null,null,null,null,null,null,null,null,null,null,null,null,null,null,null,null,null,null,null,null,null,"świdnicki","Piaski"]
[null,null,null,null,null,null,null,null,null,null,null,null,null,null,null,null,null,null,null,null,null,null,null,null,null,"świdnicki","Rybczewice"]
[null,null,null,null,null,null,null,null,null,null,null,null,null,null,null,null,null,null,null,null,null,null,null,null,null,"świdnicki","Trawniki"]
[null,null,null,null,null,null,null,null,null,null,null,null,null,null,null,null,null,null,null,null,null,null,null,null,null,"Lublin","Lublin"]
[null,null,null,null,null,null,null,null,null,null,null,null,null,null,null,null,null,null,null,null,null,null,null,null,null,"janowski","Batorz"]
[null,null,null,null,null,null,null,null,null,null,null,null,null,null,null,null,null,null,null,null,null,null,null,null,null,"janowski","Chrzanów"]
[null,null,null,null,null,null,null,null,null,null,null,null,null,null,null,null,null,null,null,null,null,null,null,null,null,"janowski","Dzwola"]
[null,null,null,null,null,null,null,null,null,null,null,null,null,null,null,null,null,null,null,null,null,null,null,null,null,"janowski","Godziszów"]
[null,null,null,null,null,null,null,null,null,null,null,null,null,null,null,null,null,null,null,null,null,null,null,null,null,"janowski","Janów Lubelski"]
[null,null,null,null,null,null,null,null,null,null,null,null,null,null,null,null,null,null,null,null,null,null,null,null,null,"janowski","Modliborzyce"]
[null,null,null,null,null,null,null,null,null,null,null,null,null,null,null,null,null,null,null,null,null,null,null,null,null,"janowski","Potok Wielki"]
[null,null,null,null,null,null,null,null,null,null,null,null,null,null,null,null,null,null,null,null,null,null,null,null,null,"kraśnicki","Kraśnik"]
[null,null,null,null,null,null,null,null,null,null,null,null,null,null,null,null,null,null,null,null,null,null,null,null,null,"kraśnicki","Annopol"]
[null,null,null,null,null,null,null,null,null,null,null,null,null,null,null,null,null,null,null,null,null,null,null,null,null,"kraśnicki","Dzierzkowice"]
[null,null,null,null,null,null,null,null,null,null,null,null,null,null,null,null,null,null,null,null,null,null,null,null,null,"kraśnicki","Gościeradów"]
[null,null,null,null,null,null,null,null,null,null,null,null,null,null,null,null,null,null,null,null,null,null,null,null,null,"kraśnicki","Kraśnik"]
[null,null,null,null,null,null,null,null,null,null,null,null,null,null,null,null,null,null,null,null,null,null,null,null,null,"kraśnicki","Szastarka"]
[null,null,null,null,null,null,null,null,null,null,null,null,null,null,null,null,null,null,null,null,null,null,null,null,null,"kraśnicki","Trzydnik Duży"]
[null,null,null,null,null,null,null,null,null,null,null,null,null,null,null,null,null,null,null,null,null,null,null,null,null,"kraśnicki","Urzędów"]
[null,null,null,null,null,null,null,null,null,null,null,null,null,null,null,null,null,null,null,null,null,null,null,null,null,"kraśnicki","Wilkołaz"]
[null,null,null,null,null,null,null,null,null,null,null,null,null,null,null,null,null,null,null,null,null,null,null,null,null,"kraśnicki","Zakrzówek"]
[null,null,null,null,null,null,null,null,null,null,null,null,null,null,null,null,null,null,null,null,null,null,null,null,null,"łukowski","Stoczek Łukowski"]
[null,null,null,null,null,null,null,null,null,null,null,null,null,null,null,null,null,null,null,null,null,null,null,null,null,"łukowski","Adamów"]
[null,null,null,null,null,null,null,null,null,null,null,null,null,null,null,null,null,null,null,null,null,null,null,null,null,"łukowski","Krzywda"]
[null,null,null,null,null,null,null,null,null,null,null,null,null,null,null,null,null,null,null,null,null,null,null,null,null,"łukowski","Łuków"]
[null,null,null,null,null,null,null,null,null,null,null,null,null,null,null,null,null,null,null,null,null,null,null,null,null,"łukowski","Serokomla"]
[null,null,null,null,null,null,null,null,null,null,null,null,null,null,null,null,null,null,null,null,null,null,null,null,null,"łukowski","Stanin"]
[null,null,null,null,null,null,null,null,null,null,null,null,null,null,null,null,null,null,null,null,null,null,null,null,null,"łukowski","Stoczek Łukowski"]
[null,null,null,null,null,null,null,null,null,null,null,null,null,null,null,null,null,null,null,null,null,null,null,null,null,"łukowski","Trzebieszów"]
[null,null,null,null,null,null,null,null,null,null,null,null,null,null,null,null,null,null,null,null,null,null,null,null,null,"łukowski","Wojcieszków"]
[null,null,null,null,null,null,null,null,null,null,null,null,null,null,null,null,null,null,null,null,null,null,null,null,null,"łukowski","Wola Mysłowska"]
[null,null,null,null,null,null,null,null,null,null,null,null,null,null,null,null,null,null,null,null,null,null,null,null,null,"opolski","Chodel"]
[null,null,null,null,null,null,null,null,null,null,null,null,null,null,null,null,null,null,null,null,null,null,null,null,null,"opolski","Józefów nad Wisłą"]
[null,null,null,null,null,null,null,null,null,null,null,null,null,null,null,null,null,null,null,null,null,null,null,null,null,"opolski","Karczmiska"]
[null,null,null,null,null,null,null,null,null,null,null,null,null,null,null,null,null,null,null,null,null,null,null,null,null,"opolski","Łaziska"]
[null,null,null,null,null,null,null,null,null,null,null,null,null,null,null,null,null,null,null,null,null,null,null,null,null,"opolski","Opole Lubelskie"]
[null,null,null,null,null,null,null,null,null,null,null,null,null,null,null,null,null,null,null,null,null,null,null,null,null,"opolski","Poniatowa"]
[null,null,null,null,null,null,null,null,null,null,null,null,null,null,null,null,null,null,null,null,null,null,null,null,null,"opolski","Wilków"]
[null,null,null,null,null,null,null,null,null,null,null,null,null,null,null,null,null,null,null,null,null,null,null,null,null,"puławski","Puławy"]
[null,null,null,null,null,null,null,null,null,null,null,null,null,null,null,null,null,null,null,null,null,null,null,null,null,"puławski","Baranów"]
[null,null,null,null,null,null,null,null,null,null,null,null,null,null,null,null,null,null,null,null,null,null,null,null,null,"puławski","Janowiec"]
[null,null,null,null,null,null,null,null,null,null,null,null,null,null,null,null,null,null,null,null,null,null,null,null,null,"puławski","Kazimierz Dolny"]
[null,null,null,null,null,null,null,null,null,null,null,null,null,null,null,null,null,null,null,null,null,null,null,null,null,"puławski","Końskowola"]
[null,null,null,null,null,null,null,null,null,null,null,null,null,null,null,null,null,null,null,null,null,null,null,null,null,"puławski","Kurów"]
[null,null,null,null,null,null,null,null,null,null,null,null,null,null,null,null,null,null,null,null,null,null,null,null,null,"puławski","Markuszów"]
[null,null,null,null,null,null,null,null,null,null,null,null,null,null,null,null,null,null,null,null,null,null,null,null,null,"puławski","Nałęczów"]
[null,null,null,null,null,null,null,null,null,null,null,null,null,null,null,null,null,null,null,null,null,null,null,null,null,"puławski","Puławy"]
[null,null,null,null,null,null,null,null,null,null,null,null,null,null,null,null,null,null,null,null,null,null,null,null,null,"puławski","Wąwolnica"]
[null,null,null,null,null,null,null,null,null,null,null,null,null,null,null,null,null,null,null,null,null,null,null,null,null,"puławski","Żyrzyn"]
[null,null,null,null,null,null,null,null,null,null,null,null,null,null,null,null,null,null,null,null,null,null,null,null,null,"rycki","Dęblin"]
[null,null,null,null,null,null,null,null,null,null,null,null,null,null,null,null,null,null,null,null,null,null,null,null,null,"rycki","Kłoczew"]
[null,null,null,null,null,null,null,null,null,null,null,null,null,null,null,null,null,null,null,null,null,null,null,null,null,"rycki","Nowodwór"]
[null,null,null,null,null,null,null,null,null,null,null,null,null,null,null,null,null,null,null,null,null,null,null,null,null,"rycki","Ryki"]
[null,null,null,null,null,null,null,null,null,null,null,null,null,null,null,null,null,null,null,null,null,null,null,null,null,"rycki","Stężyca"]
[null,null,null,null,null,null,null,null,null,null,null,null,null,null,null,null,null,null,null,null,null,null,null,null,null,"rycki","Ułęż"]
[null,null,null,null,null,null,null,null,null,null,null,null,null,null,null,null,null,null,null,null,null,null,null,null,null,"bieszczadzki","Czarna"]
[null,null,null,null,null,null,null,null,null,null,null,null,null,null,null,null,null,null,null,null,null,null,null,null,null,"bieszczadzki","Lutowiska"]
[null,null,null,null,null,null,null,null,null,null,null,null,null,null,null,null,null,null,null,null,null,null,null,null,null,"bieszczadzki","Ustrzyki Dolne"]
[null,null,null,null,null,null,null,null,null,null,null,null,null,null,null,null,null,null,null,null,null,null,null,null,null,"brzozowski","Brzozów"]
[null,null,null,null,null,null,null,null,null,null,null,null,null,null,null,null,null,null,null,null,null,null,null,null,null,"brzozowski","Domaradz"]
[null,null,null,null,null,null,null,null,null,null,null,null,null,null,null,null,null,null,null,null,null,null,null,null,null,"brzozowski","Dydnia"]
[null,null,null,null,null,null,null,null,null,null,null,null,null,null,null,null,null,null,null,null,null,null,null,null,null,"brzozowski","Haczów"]
[null,null,null,null,null,null,null,null,null,null,null,null,null,null,null,null,null,null,null,null,null,null,null,null,null,"brzozowski","Jasienica Rosielna"]
[null,null,null,null,null,null,null,null,null,null,null,null,null,null,null,null,null,null,null,null,null,null,null,null,null,"brzozowski","Nozdrzec"]
[null,null,null,null,null,null,null,null,null,null,null,null,null,null,null,null,null,null,null,null,null,null,null,null,null,"jasielski","Jasło"]
[null,null,null,null,null,null,null,null,null,null,null,null,null,null,null,null,null,null,null,null,null,null,null,null,null,"jasielski","Brzyska"]
[null,null,null,null,null,null,null,null,null,null,null,null,null,null,null,null,null,null,null,null,null,null,null,null,null,"jasielski","Dębowiec"]
[null,null,null,null,null,null,null,null,null,null,null,null,null,null,null,null,null,null,null,null,null,null,null,null,null,"jasielski","Jasło"]
[null,null,null,null,null,null,null,null,null,null,null,null,null,null,null,null,null,null,null,null,null,null,null,null,null,"jasielski","Kołaczyce"]
[null,null,null,null,null,null,null,null,null,null,null,null,null,null,null,null,null,null,null,null,null,null,null,null,null,"jasielski","Krempna"]
[null,null,null,null,null,null,null,null,null,null,null,null,null,null,null,null,null,null,null,null,null,null,null,null,null,"jasielski","Nowy Żmigród"]
[null,null,null,null,null,null,null,null,null,null,null,null,null,null,null,null,null,null,null,null,null,null,null,null,null,"jasielski","Osiek Jasielski"]
[null,null,null,null,null,null,null,null,null,null,null,null,null,null,null,null,null,null,null,null,null,null,null,null,null,"jasielski","Skołyszyn"]
[null,null,null,null,null,null,null,null,null,null,null,null,null,null,null,null,null,null,null,null,null,null,null,null,null,"jasielski","Tarnowiec"]
[null,null,null,null,null,null,null,null,null,null,null,null,null,null,null,null,null,null,null,null,null,null,null,null,null,"krośnieński","Chorkówka"]
[null,null,null,null,null,null,null,null,null,null,null,null,null,null,null,null,null,null,null,null,null,null,null,null,null,"krośnieński","Dukla"]
[null,null,null,null,null,null,null,null,null,null,null,null,null,null,null,null,null,null,null,null,null,null,null,null,null,"krośnieński","Iwonicz-Zdrój"]
[null,null,null,null,null,null,null,null,null,null,null,null,null,null,null,null,null,null,null,null,null,null,null,null,null,"krośnieński","Jedlicze"]
[null,null,null,null,null,null,null,null,null,null,null,null,null,null,null,null,null,null,null,null,null,null,null,null,null,"krośnieński","Korczyna"]
[null,null,null,null,null,null,null,null,null,null,null,null,null,null,null,null,null,null,null,null,null,null,null,null,null,"krośnieński","Krościenko Wyżne"]
[null,null,null,null,null,null,null,null,null,null,null,null,null,null,null,null,null,null,null,null,null,null,null,null,null,"krośnieński","Miejsce Piastowe"]
[null,null,null,null,null,null,null,null,null,null,null,null,null,null,null,null,null,null,null,null,null,null,null,null,null,"krośnieński","Rymanów"]
[null,null,null,null,null,null,null,null,null,null,null,null,null,null,null,null,null,null,null,null,null,null,null,null,null,"krośnieński","Wojaszówka"]
[null,null,null,null,null,null,null,null,null,null,null,null,null,null,null,null,null,null,null,null,null,null,null,null,null,"krośnieński","Jaśliska"]
[null,null,null,null,null,null,null,null,null,null,null,null,null,null,null,null,null,null,null,null,null,null,null,null,null,"sanocki","Sanok"]
[null,null,null,null,null,null,null,null,null,null,null,null,null,null,null,null,null,null,null,null,null,null,null,null,null,"sanocki","Besko"]
[null,null,null,null,null,null,null,null,null,null,null,null,null,null,null,null,null,null,null,null,null,null,null,null,null,"sanocki","Bukowsko"]
[null,null,null,null,null,null,null,null,null,null,null,null,null,null,null,null,null,null,null,null,null,null,null,null,null,"sanocki","Komańcza"]
[null,null,null,null,null,null,null,null,null,null,null,null,null,null,null,null,null,null,null,null,null,null,null,null,null,"sanocki","Sanok"]
[null,null,null,null,null,null,null,null,null,null,null,null,null,null,null,null,null,null,null,null,null,null,null,null,null,"sanocki","Tyrawa Wołoska"]
[null,null,null,null,null,null,null,null,null,null,null,null,null,null,null,null,null,null,null,null,null,null,null,null,null,"sanocki","Zagórz"]
[null,null,null,null,null,null,null,null,null,null,null,null,null,null,null,null,null,null,null,null,null,null,null,null,null,"sanocki","Zarszyn"]
[null,null,null,null,null,null,null,null,null,null,null,null,null,null,null,null,null,null,null,null,null,null,null,null,null,"leski","Baligród"]
[null,null,null,null,null,null,null,null,null,null,null,null,null,null,null,null,null,null,null,null,null,null,null,null,null,"leski","Cisna"]
[null,null,null,null,null,null,null,null,null,null,null,null,null,null,null,null,null,null,null,null,null,null,null,null,null,"leski","Lesko"]
[null,null,null,null,null,null,null,null,null,null,null,null,null,null,null,null,null,null,null,null,null,null,null,null,null,"leski","Olszanica"]
[null,null,null,null,null,null,null,null,null,null,null,null,null,null,null,null,null,null,null,null,null,null,null,null,null,"leski","Solina"]
[null,null,null,null,null,null,null,null,null,null,null,null,null,null,null,null,null,null,null,null,null,null,null,null,null,"Krosno","Krosno"]
[null,null,null,null,null,null,null,null,null,null,null,null,null,null,null,null,null,null,null,null,null,null,null,null,null,"jarosławski","Jarosław"]
[null,null,null,null,null,null,null,null,null,null,null,null,null,null,null,null,null,null,null,null,null,null,null,null,null,"jarosławski","Radymno"]
[null,null,null,null,null,null,null,null,null,null,null,null,null,null,null,null,null,null,null,null,null,null,null,null,null,"jarosławski","Chłopice"]
[null,null,null,null,null,null,null,null,null,null,null,null,null,null,null,null,null,null,null,null,null,null,null,null,null,"jarosławski","Jarosław"]
[null,null,null,null,null,null,null,null,null,null,null,null,null,null,null,null,null,null,null,null,null,null,null,null,null,"jarosławski","Laszki"]
[null,null,null,null,null,null,null,null,null,null,null,null,null,null,null,null,null,null,null,null,null,null,null,null,null,"jarosławski","Pawłosiów"]
[null,null,null,null,null,null,null,null,null,null,null,null,null,null,null,null,null,null,null,null,null,null,null,null,null,"jarosławski","Pruchnik"]
[null,null,null,null,null,null,null,null,null,null,null,null,null,null,null,null,null,null,null,null,null,null,null,null,null,"jarosławski","Radymno"]
[null,null,null,null,null,null,null,null,null,null,null,null,null,null,null,null,null,null,null,null,null,null,null,null,null,"jarosławski","Rokietnica"]
[null,null,null,null,null,null,null,null,null,null,null,null,null,null,null,null,null,null,null,null,null,null,null,null,null,"jarosławski","Roźwienica"]
[null,null,null,null,null,null,null,null,null,null,null,null,null,null,null,null,null,null,null,null,null,null,null,null,null,"jarosławski","Wiązownica"]
[null,null,null,null,null,null,null,null,null,null,null,null,null,null,null,null,null,null,null,null,null,null,null,null,null,"lubaczowski","Lubaczów"]
[null,null,null,null,null,null,null,null,null,null,null,null,null,null,null,null,null,null,null,null,null,null,null,null,null,"lubaczowski","Cieszanów"]
[null,null,null,null,null,null,null,null,null,null,null,null,null,null,null,null,null,null,null,null,null,null,null,null,null,"lubaczowski","Horyniec-Zdrój"]
[null,null,null,null,null,null,null,null,null,null,null,null,null,null,null,null,null,null,null,null,null,null,null,null,null,"lubaczowski","Lubaczów"]
[null,null,null,null,null,null,null,null,null,null,null,null,null,null,null,null,null,null,null,null,null,null,null,null,null,"lubaczowski","Narol"]
[null,null,null,null,null,null,null,null,null,null,null,null,null,null,null,null,null,null,null,null,null,null,null,null,null,"lubaczowski","Oleszyce"]
[null,null,null,null,null,null,null,null,null,null,null,null,null,null,null,null,null,null,null,null,null,null,null,null,null,"lubaczowski","Stary Dzików"]
[null,null,null,null,null,null,null,null,null,null,null,null,null,null,null,null,null,null,null,null,null,null,null,null,null,"lubaczowski","Wielkie Oczy"]
[null,null,null,null,null,null,null,null,null,null,null,null,null,null,null,null,null,null,null,null,null,null,null,null,null,"przemyski","Bircza"]
[null,null,null,null,null,null,null,null,null,null,null,null,null,null,null,null,null,null,null,null,null,null,null,null,null,"przemyski","Dubiecko"]
[null,null,null,null,null,null,null,null,null,null,null,null,null,null,null,null,null,null,null,null,null,null,null,null,null,"przemyski","Fredropol"]
[null,null,null,null,null,null,null,null,null,null,null,null,null,null,null,null,null,null,null,null,null,null,null,null,null,"przemyski","Krasiczyn"]
[null,null,null,null,null,null,null,null,null,null,null,null,null,null,null,null,null,null,null,null,null,null,null,null,null,"przemyski","Krzywcza"]
[null,null,null,null,null,null,null,null,null,null,null,null,null,null,null,null,null,null,null,null,null,null,null,null,null,"przemyski","Medyka"]
[null,null,null,null,null,null,null,null,null,null,null,null,null,null,null,null,null,null,null,null,null,null,null,null,null,"przemyski","Orły"]
[null,null,null,null,null,null,null,null,null,null,null,null,null,null,null,null,null,null,null,null,null,null,null,null,null,"przemyski","Przemyśl"]
[null,null,null,null,null,null,null,null,null,null,null,null,null,null,null,null,null,null,null,null,null,null,null,null,null,"przemyski","Stubno"]
[null,null,null,null,null,null,null,null,null,null,null,null,null,null,null,null,null,null,null,null,null,null,null,null,null,"przemyski","Żurawica"]
[null,null,null,null,null,null,null,null,null,null,null,null,null,null,null,null,null,null,null,null,null,null,null,null,null,"przeworski","Przeworsk"]
[null,null,null,null,null,null,null,null,null,null,null,null,null,null,null,null,null,null,null,null,null,null,null,null,null,"przeworski","Adamówka"]
[null,null,null,null,null,null,null,null,null,null,null,null,null,null,null,null,null,null,null,null,null,null,null,null,null,"przeworski","Gać"]
[null,null,null,null,null,null,null,null,null,null,null,null,null,null,null,null,null,null,null,null,null,null,null,null,null,"przeworski","Jawornik Polski"]
[null,null,null,null,null,null,null,null,null,null,null,null,null,null,null,null,null,null,null,null,null,null,null,null,null,"przeworski","Kańczuga"]
[null,null,null,null,null,null,null,null,null,null,null,null,null,null,null,null,null,null,null,null,null,null,null,null,null,"przeworski","Przeworsk"]
[null,null,null,null,null,null,null,null,null,null,null,null,null,null,null,null,null,null,null,null,null,null,null,null,null,"przeworski","Sieniawa"]
[null,null,null,null,null,null,null,null,null,null,null,null,null,null,null,null,null,null,null,null,null,null,null,null,null,"przeworski","Tryńcza"]
[null,null,null,null,null,null,null,null,null,null,null,null,null,null,null,null,null,null,null,null,null,null,null,null,null,"przeworski","Zarzecze"]
[null,null,null,null,null,null,null,null,null,null,null,null,null,null,null,null,null,null,null,null,null,null,null,null,null,"Przemyśl","Przemyśl"]
[null,null,null,null,null,null,null,null,null,null,null,null,null,null,null,null,null,null,null,null,null,null,null,null,null,"kolbuszowski","Cmolas"]
[null,null,null,null,null,null,null,null,null,null,null,null,null,null,null,null,null,null,null,null,null,null,null,null,null,"kolbuszowski","Kolbuszowa"]
[null,null,null,null,null,null,null,null,null,null,null,null,null,null,null,null,null,null,null,null,null,null,null,null,null,"kolbuszowski","Majdan Królewski"]
[null,null,null,null,null,null,null,null,null,null,null,null,null,null,null,null,null,null,null,null,null,null,null,null,null,"kolbuszowski","Niwiska"]
[null,null,null,null,null,null,null,null,null,null,null,null,null,null,null,null,null,null,null,null,null,null,null,null,null,"kolbuszowski","Raniżów"]
[null,null,null,null,null,null,null,null,null,null,null,null,null,null,null,null,null,null,null,null,null,null,null,null,null,"kolbuszowski","Dzikowiec"]
[null,null,null,null,null,null,null,null,null,null,null,null,null,null,null,null,null,null,null,null,null,null,null,null,null,"łańcucki","Łańcut"]
[null,null,null,null,null,null,null,null,null,null,null,null,null,null,null,null,null,null,null,null,null,null,null,null,null,"łańcucki","Białobrzegi"]
[null,null,null,null,null,null,null,null,null,null,null,null,null,null,null,null,null,null,null,null,null,null,null,null,null,"łańcucki","Czarna"]
[null,null,null,null,null,null,null,null,null,null,null,null,null,null,null,null,null,null,null,null,null,null,null,null,null,"łańcucki","Łańcut"]
[null,null,null,null,null,null,null,null,null,null,null,null,null,null,null,null,null,null,null,null,null,null,null,null,null,"łańcucki","Markowa"]
[null,null,null,null,null,null,null,null,null,null,null,null,null,null,null,null,null,null,null,null,null,null,null,null,null,"łańcucki","Rakszawa"]
[null,null,null,null,null,null,null,null,null,null,null,null,null,null,null,null,null,null,null,null,null,null,null,null,null,"łańcucki","Żołynia"]
[null,null,null,null,null,null,null,null,null,null,null,null,null,null,null,null,null,null,null,null,null,null,null,null,null,"ropczycko-sędziszowski","Iwierzyce"]
[null,null,null,null,null,null,null,null,null,null,null,null,null,null,null,null,null,null,null,null,null,null,null,null,null,"ropczycko-sędziszowski","Ostrów"]
[null,null,null,null,null,null,null,null,null,null,null,null,null,null,null,null,null,null,null,null,null,null,null,null,null,"ropczycko-sędziszowski","Ropczyce"]
[null,null,null,null,null,null,null,null,null,null,null,null,null,null,null,null,null,null,null,null,null,null,null,null,null,"ropczycko-sędziszowski","Sędziszów Małopolski"]
[null,null,null,null,null,null,null,null,null,null,null,null,null,null,null,null,null,null,null,null,null,null,null,null,null,"ropczycko-sędziszowski","Wielopole Skrzyńskie"]
[null,null,null,null,null,null,null,null,null,null,null,null,null,null,null,null,null,null,null,null,null,null,null,null,null,"rzeszowski","Dynów"]
[null,null,null,null,null,null,null,null,null,null,null,null,null,null,null,null,null,null,null,null,null,null,null,null,null,"rzeszowski","Błażowa"]
[null,null,null,null,null,null,null,null,null,null,null,null,null,null,null,null,null,null,null,null,null,null,null,null,null,"rzeszowski","Boguchwała"]
[null,null,null,null,null,null,null,null,null,null,null,null,null,null,null,null,null,null,null,null,null,null,null,null,null,"rzeszowski","Chmielnik"]
[null,null,null,null,null,null,null,null,null,null,null,null,null,null,null,null,null,null,null,null,null,null,null,null,null,"rzeszowski","Dynów"]
[null,null,null,null,null,null,null,null,null,null,null,null,null,null,null,null,null,null,null,null,null,null,null,null,null,"rzeszowski","Głogów Małopolski"]
[null,null,null,null,null,null,null,null,null,null,null,null,null,null,null,null,null,null,null,null,null,null,null,null,null,"rzeszowski","Hyżne"]
[null,null,null,null,null,null,null,null,null,null,null,null,null,null,null,null,null,null,null,null,null,null,null,null,null,"rzeszowski","Kamień"]
[null,null,null,null,null,null,null,null,null,null,null,null,null,null,null,null,null,null,null,null,null,null,null,null,null,"rzeszowski","Krasne"]
[null,null,null,null,null,null,null,null,null,null,null,null,null,null,null,null,null,null,null,null,null,null,null,null,null,"rzeszowski","Lubenia"]
[null,null,null,null,null,null,null,null,null,null,null,null,null,null,null,null,null,null,null,null,null,null,null,null,null,"rzeszowski","Sokołów Małopolski"]
[null,null,null,null,null,null,null,null,null,null,null,null,null,null,null,null,null,null,null,null,null,null,null,null,null,"rzeszowski","Świlcza"]
[null,null,null,null,null,null,null,null,null,null,null,null,null,null,null,null,null,null,null,null,null,null,null,null,null,"rzeszowski","Trzebownisko"]
[null,null,null,null,null,null,null,null,null,null,null,null,null,null,null,null,null,null,null,null,null,null,null,null,null,"rzeszowski","Tyczyn"]
[null,null,null,null,null,null,null,null,null,null,null,null,null,null,null,null,null,null,null,null,null,null,null,null,null,"strzyżowski","Czudec"]
[null,null,null,null,null,null,null,null,null,null,null,null,null,null,null,null,null,null,null,null,null,null,null,null,null,"strzyżowski","Frysztak"]
[null,null,null,null,null,null,null,null,null,null,null,null,null,null,null,null,null,null,null,null,null,null,null,null,null,"strzyżowski","Niebylec"]
[null,null,null,null,null,null,null,null,null,null,null,null,null,null,null,null,null,null,null,null,null,null,null,null,null,"strzyżowski","Strzyżów"]
[null,null,null,null,null,null,null,null,null,null,null,null,null,null,null,null,null,null,null,null,null,null,null,null,null,"strzyżowski","Wiśniowa"]
[null,null,null,null,null,null,null,null,null,null,null,null,null,null,null,null,null,null,null,null,null,null,null,null,null,"Rzeszów","Rzeszów"]
[null,null,null,null,null,null,null,null,null,null,null,null,null,null,null,null,null,null,null,null,null,null,null,null,null,"dębicki","Dębica"]
[null,null,null,null,null,null,null,null,null,null,null,null,null,null,null,null,null,null,null,null,null,null,null,null,null,"dębicki","Brzostek"]
[null,null,null,null,null,null,null,null,null,null,null,null,null,null,null,null,null,null,null,null,null,null,null,null,null,"dębicki","Czarna"]
[null,null,null,null,null,null,null,null,null,null,null,null,null,null,null,null,null,null,null,null,null,null,null,null,null,"dębicki","Dębica"]
[null,null,null,null,null,null,null,null,null,null,null,null,null,null,null,null,null,null,null,null,null,null,null,null,null,"dębicki","Jodłowa"]
[null,null,null,null,null,null,null,null,null,null,null,null,null,null,null,null,null,null,null,null,null,null,null,null,null,"dębicki","Pilzno"]
[null,null,null,null,null,null,null,null,null,null,null,null,null,null,null,null,null,null,null,null,null,null,null,null,null,"dębicki","Żyraków"]
[null,null,null,null,null,null,null,null,null,null,null,null,null,null,null,null,null,null,null,null,null,null,null,null,null,"leżajski","Leżajsk"]
[null,null,null,null,null,null,null,null,null,null,null,null,null,null,null,null,null,null,null,null,null,null,null,null,null,"leżajski","Grodzisko Dolne"]
[null,null,null,null,null,null,null,null,null,null,null,null,null,null,null,null,null,null,null,null,null,null,null,null,null,"leżajski","Kuryłówka"]
[null,null,null,null,null,null,null,null,null,null,null,null,null,null,null,null,null,null,null,null,null,null,null,null,null,"leżajski","Leżajsk"]
[null,null,null,null,null,null,null,null,null,null,null,null,null,null,null,null,null,null,null,null,null,null,null,null,null,"leżajski","Nowa Sarzyna"]
[null,null,null,null,null,null,null,null,null,null,null,null,null,null,null,null,null,null,null,null,null,null,null,null,null,"mielecki","Mielec"]
[null,null,null,null,null,null,null,null,null,null,null,null,null,null,null,null,null,null,null,null,null,null,null,null,null,"mielecki","Borowa"]
[null,null,null,null,null,null,null,null,null,null,null,null,null,null,null,null,null,null,null,null,null,null,null,null,null,"mielecki","Czermin"]
[null,null,null,null,null,null,null,null,null,null,null,null,null,null,null,null,null,null,null,null,null,null,null,null,null,"mielecki","Gawłuszowice"]
[null,null,null,null,null,null,null,null,null,null,null,null,null,null,null,null,null,null,null,null,null,null,null,null,null,"mielecki","Mielec"]
[null,null,null,null,null,null,null,null,null,null,null,null,null,null,null,null,null,null,null,null,null,null,null,null,null,"mielecki","Padew Narodowa"]
[null,null,null,null,null,null,null,null,null,null,null,null,null,null,null,null,null,null,null,null,null,null,null,null,null,"mielecki","Przecław"]
[null,null,null,null,null,null,null,null,null,null,null,null,null,null,null,null,null,null,null,null,null,null,null,null,null,"mielecki","Radomyśl Wielki"]
[null,null,null,null,null,null,null,null,null,null,null,null,null,null,null,null,null,null,null,null,null,null,null,null,null,"mielecki","Tuszów Narodowy"]
[null,null,null,null,null,null,null,null,null,null,null,null,null,null,null,null,null,null,null,null,null,null,null,null,null,"mielecki","Wadowice Górne"]
[null,null,null,null,null,null,null,null,null,null,null,null,null,null,null,null,null,null,null,null,null,null,null,null,null,"niżański","Harasiuki"]
[null,null,null,null,null,null,null,null,null,null,null,null,null,null,null,null,null,null,null,null,null,null,null,null,null,"niżański","Jarocin"]
[null,null,null,null,null,null,null,null,null,null,null,null,null,null,null,null,null,null,null,null,null,null,null,null,null,"niżański","Jeżowe"]
[null,null,null,null,null,null,null,null,null,null,null,null,null,null,null,null,null,null,null,null,null,null,null,null,null,"niżański","Krzeszów"]
[null,null,null,null,null,null,null,null,null,null,null,null,null,null,null,null,null,null,null,null,null,null,null,null,null,"niżański","Nisko"]
[null,null,null,null,null,null,null,null,null,null,null,null,null,null,null,null,null,null,null,null,null,null,null,null,null,"niżański","Rudnik nad Sanem"]
[null,null,null,null,null,null,null,null,null,null,null,null,null,null,null,null,null,null,null,null,null,null,null,null,null,"niżański","Ulanów"]
[null,null,null,null,null,null,null,null,null,null,null,null,null,null,null,null,null,null,null,null,null,null,null,null,null,"stalowowolski","Stalowa Wola"]
[null,null,null,null,null,null,null,null,null,null,null,null,null,null,null,null,null,null,null,null,null,null,null,null,null,"stalowowolski","Bojanów"]
[null,null,null,null,null,null,null,null,null,null,null,null,null,null,null,null,null,null,null,null,null,null,null,null,null,"stalowowolski","Pysznica"]
[null,null,null,null,null,null,null,null,null,null,null,null,null,null,null,null,null,null,null,null,null,null,null,null,null,"stalowowolski","Radomyśl nad Sanem"]
[null,null,null,null,null,null,null,null,null,null,null,null,null,null,null,null,null,null,null,null,null,null,null,null,null,"stalowowolski","Zaklików"]
[null,null,null,null,null,null,null,null,null,null,null,null,null,null,null,null,null,null,null,null,null,null,null,null,null,"stalowowolski","Zaleszany"]
[null,null,null,null,null,null,null,null,null,null,null,null,null,null,null,null,null,null,null,null,null,null,null,null,null,"tarnobrzeski","Baranów Sandomierski"]
[null,null,null,null,null,null,null,null,null,null,null,null,null,null,null,null,null,null,null,null,null,null,null,null,null,"tarnobrzeski","Gorzyce"]
[null,null,null,null,null,null,null,null,null,null,null,null,null,null,null,null,null,null,null,null,null,null,null,null,null,"tarnobrzeski","Grębów"]
[null,null,null,null,null,null,null,null,null,null,null,null,null,null,null,null,null,null,null,null,null,null,null,null,null,"tarnobrzeski","Nowa Dęba"]
[null,null,null,null,null,null,null,null,null,null,null,null,null,null,null,null,null,null,null,null,null,null,null,null,null,"Tarnobrzeg","Tarnobrzeg"]
[null,null,null,null,null,null,null,null,null,null,null,null,null,null,null,null,null,null,null,null,null,null,null,null,null,"białostocki","Choroszcz"]
[null,null,null,null,null,null,null,null,null,null,null,null,null,null,null,null,null,null,null,null,null,null,null,null,null,"białostocki","Czarna Białostocka"]
[null,null,null,null,null,null,null,null,null,null,null,null,null,null,null,null,null,null,null,null,null,null,null,null,null,"białostocki","Dobrzyniewo Duże"]
[null,null,null,null,null,null,null,null,null,null,null,null,null,null,null,null,null,null,null,null,null,null,null,null,null,"białostocki","Gródek"]
[null,null,null,null,null,null,null,null,null,null,null,null,null,null,null,null,null,null,null,null,null,null,null,null,null,"białostocki","Juchnowiec Kościelny"]
[null,null,null,null,null,null,null,null,null,null,null,null,null,null,null,null,null,null,null,null,null,null,null,null,null,"białostocki","Łapy"]
[null,null,null,null,null,null,null,null,null,null,null,null,null,null,null,null,null,null,null,null,null,null,null,null,null,"białostocki","Michałowo"]
[null,null,null,null,null,null,null,null,null,null,null,null,null,null,null,null,null,null,null,null,null,null,null,null,null,"białostocki","Poświętne"]
[null,null,null,null,null,null,null,null,null,null,null,null,null,null,null,null,null,null,null,null,null,null,null,null,null,"białostocki","Supraśl"]
[null,null,null,null,null,null,null,null,null,null,null,null,null,null,null,null,null,null,null,null,null,null,null,null,null,"białostocki","Suraż"]
[null,null,null,null,null,null,null,null,null,null,null,null,null,null,null,null,null,null,null,null,null,null,null,null,null,"białostocki","Turośń Kościelna"]
[null,null,null,null,null,null,null,null,null,null,null,null,null,null,null,null,null,null,null,null,null,null,null,null,null,"białostocki","Tykocin"]
[null,null,null,null,null,null,null,null,null,null,null,null,null,null,null,null,null,null,null,null,null,null,null,null,null,"białostocki","Wasilków"]
[null,null,null,null,null,null,null,null,null,null,null,null,null,null,null,null,null,null,null,null,null,null,null,null,null,"białostocki","Zabłudów"]
[null,null,null,null,null,null,null,null,null,null,null,null,null,null,null,null,null,null,null,null,null,null,null,null,null,"białostocki","Zawady"]
[null,null,null,null,null,null,null,null,null,null,null,null,null,null,null,null,null,null,null,null,null,null,null,null,null,"sokólski","Dąbrowa Białostocka"]
[null,null,null,null,null,null,null,null,null,null,null,null,null,null,null,null,null,null,null,null,null,null,null,null,null,"sokólski","Janów"]
[null,null,null,null,null,null,null,null,null,null,null,null,null,null,null,null,null,null,null,null,null,null,null,null,null,"sokólski","Korycin"]
[null,null,null,null,null,null,null,null,null,null,null,null,null,null,null,null,null,null,null,null,null,null,null,null,null,"sokólski","Krynki"]
[null,null,null,null,null,null,null,null,null,null,null,null,null,null,null,null,null,null,null,null,null,null,null,null,null,"sokólski","Kuźnica"]
[null,null,null,null,null,null,null,null,null,null,null,null,null,null,null,null,null,null,null,null,null,null,null,null,null,"sokólski","Nowy Dwór"]
[null,null,null,null,null,null,null,null,null,null,null,null,null,null,null,null,null,null,null,null,null,null,null,null,null,"sokólski","Sidra"]
[null,null,null,null,null,null,null,null,null,null,null,null,null,null,null,null,null,null,null,null,null,null,null,null,null,"sokólski","Sokółka"]
[null,null,null,null,null,null,null,null,null,null,null,null,null,null,null,null,null,null,null,null,null,null,null,null,null,"sokólski","Suchowola"]
[null,null,null,null,null,null,null,null,null,null,null,null,null,null,null,null,null,null,null,null,null,null,null,null,null,"sokólski","Szudziałowo"]
[null,null,null,null,null,null,null,null,null,null,null,null,null,null,null,null,null,null,null,null,null,null,null,null,null,"Białystok","Białystok"]
[null,null,null,null,null,null,null,null,null,null,null,null,null,null,null,null,null,null,null,null,null,null,null,null,null,"bielski","Brańsk"]
[null,null,null,null,null,null,null,null,null,null,null,null,null,null,null,null,null,null,null,null,null,null,null,null,null,"bielski","Bielsk Podlaski"]
[null,null,null,null,null,null,null,null,null,null,null,null,null,null,null,null,null,null,null,null,null,null,null,null,null,"bielski","Boćki"]
[null,null,null,null,null,null,null,null,null,null,null,null,null,null,null,null,null,null,null,null,null,null,null,null,null,"bielski","Brańsk"]
[null,null,null,null,null,null,null,null,null,null,null,null,null,null,null,null,null,null,null,null,null,null,null,null,null,"bielski","Orla"]
[null,null,null,null,null,null,null,null,null,null,null,null,null,null,null,null,null,null,null,null,null,null,null,null,null,"bielski","Rudka"]
[null,null,null,null,null,null,null,null,null,null,null,null,null,null,null,null,null,null,null,null,null,null,null,null,null,"bielski","Wyszki"]
[null,null,null,null,null,null,null,null,null,null,null,null,null,null,null,null,null,null,null,null,null,null,null,null,null,"hajnowski","Hajnówka"]
[null,null,null,null,null,null,null,null,null,null,null,null,null,null,null,null,null,null,null,null,null,null,null,null,null,"hajnowski","Białowieża"]
[null,null,null,null,null,null,null,null,null,null,null,null,null,null,null,null,null,null,null,null,null,null,null,null,null,"hajnowski","Czeremcha"]
[null,null,null,null,null,null,null,null,null,null,null,null,null,null,null,null,null,null,null,null,null,null,null,null,null,"hajnowski","Czyże"]
[null,null,null,null,null,null,null,null,null,null,null,null,null,null,null,null,null,null,null,null,null,null,null,null,null,"hajnowski","Dubicze Cerkiewne"]
[null,null,null,null,null,null,null,null,null,null,null,null,null,null,null,null,null,null,null,null,null,null,null,null,null,"hajnowski","Hajnówka"]
[null,null,null,null,null,null,null,null,null,null,null,null,null,null,null,null,null,null,null,null,null,null,null,null,null,"hajnowski","Kleszczele"]
[null,null,null,null,null,null,null,null,null,null,null,null,null,null,null,null,null,null,null,null,null,null,null,null,null,"hajnowski","Narew"]
[null,null,null,null,null,null,null,null,null,null,null,null,null,null,null,null,null,null,null,null,null,null,null,null,null,"hajnowski","Narewka"]
[null,null,null,null,null,null,null,null,null,null,null,null,null,null,null,null,null,null,null,null,null,null,null,null,null,"kolneński","Kolno"]
[null,null,null,null,null,null,null,null,null,null,null,null,null,null,null,null,null,null,null,null,null,null,null,null,null,"kolneński","Grabowo"]
[null,null,null,null,null,null,null,null,null,null,null,null,null,null,null,null,null,null,null,null,null,null,null,null,null,"kolneński","Kolno"]
[null,null,null,null,null,null,null,null,null,null,null,null,null,null,null,null,null,null,null,null,null,null,null,null,null,"kolneński","Mały Płock"]
[null,null,null,null,null,null,null,null,null,null,null,null,null,null,null,null,null,null,null,null,null,null,null,null,null,"kolneński","Stawiski"]
[null,null,null,null,null,null,null,null,null,null,null,null,null,null,null,null,null,null,null,null,null,null,null,null,null,"kolneński","Turośl"]
[null,null,null,null,null,null,null,null,null,null,null,null,null,null,null,null,null,null,null,null,null,null,null,null,null,"łomżyński","Jedwabne"]
[null,null,null,null,null,null,null,null,null,null,null,null,null,null,null,null,null,null,null,null,null,null,null,null,null,"łomżyński","Łomża"]
[null,null,null,null,null,null,null,null,null,null,null,null,null,null,null,null,null,null,null,null,null,null,null,null,null,"łomżyński","Miastkowo"]
[null,null,null,null,null,null,null,null,null,null,null,null,null,null,null,null,null,null,null,null,null,null,null,null,null,"łomżyński","Nowogród"]
[null,null,null,null,null,null,null,null,null,null,null,null,null,null,null,null,null,null,null,null,null,null,null,null,null,"łomżyński","Piątnica"]
[null,null,null,null,null,null,null,null,null,null,null,null,null,null,null,null,null,null,null,null,null,null,null,null,null,"łomżyński","Przytuły"]
[null,null,null,null,null,null,null,null,null,null,null,null,null,null,null,null,null,null,null,null,null,null,null,null,null,"łomżyński","Śniadowo"]
[null,null,null,null,null,null,null,null,null,null,null,null,null,null,null,null,null,null,null,null,null,null,null,null,null,"łomżyński","Wizna"]
[null,null,null,null,null,null,null,null,null,null,null,null,null,null,null,null,null,null,null,null,null,null,null,null,null,"łomżyński","Zbójna"]
[null,null,null,null,null,null,null,null,null,null,null,null,null,null,null,null,null,null,null,null,null,null,null,null,null,"siemiatycki","Siemiatycze"]
[null,null,null,null,null,null,null,null,null,null,null,null,null,null,null,null,null,null,null,null,null,null,null,null,null,"siemiatycki","Drohiczyn"]
[null,null,null,null,null,null,null,null,null,null,null,null,null,null,null,null,null,null,null,null,null,null,null,null,null,"siemiatycki","Dziadkowice"]
[null,null,null,null,null,null,null,null,null,null,null,null,null,null,null,null,null,null,null,null,null,null,null,null,null,"siemiatycki","Grodzisk"]
[null,null,null,null,null,null,null,null,null,null,null,null,null,null,null,null,null,null,null,null,null,null,null,null,null,"siemiatycki","Mielnik"]
[null,null,null,null,null,null,null,null,null,null,null,null,null,null,null,null,null,null,null,null,null,null,null,null,null,"siemiatycki","Milejczyce"]
[null,null,null,null,null,null,null,null,null,null,null,null,null,null,null,null,null,null,null,null,null,null,null,null,null,"siemiatycki","Nurzec-Stacja"]
[null,null,null,null,null,null,null,null,null,null,null,null,null,null,null,null,null,null,null,null,null,null,null,null,null,"siemiatycki","Perlejewo"]
[null,null,null,null,null,null,null,null,null,null,null,null,null,null,null,null,null,null,null,null,null,null,null,null,null,"siemiatycki","Siemiatycze"]
[null,null,null,null,null,null,null,null,null,null,null,null,null,null,null,null,null,null,null,null,null,null,null,null,null,"wysokomazowiecki","Ciechanowiec"]
[null,null,null,null,null,null,null,null,null,null,null,null,null,null,null,null,null,null,null,null,null,null,null,null,null,"wysokomazowiecki","Czyżew"]
[null,null,null,null,null,null,null,null,null,null,null,null,null,null,null,null,null,null,null,null,null,null,null,null,null,"wysokomazowiecki","Klukowo"]
[null,null,null,null,null,null,null,null,null,null,null,null,null,null,null,null,null,null,null,null,null,null,null,null,null,"wysokomazowiecki","Kobylin-Borzymy"]
[null,null,null,null,null,null,null,null,null,null,null,null,null,null,null,null,null,null,null,null,null,null,null,null,null,"wysokomazowiecki","Kulesze Kościelne"]
[null,null,null,null,null,null,null,null,null,null,null,null,null,null,null,null,null,null,null,null,null,null,null,null,null,"wysokomazowiecki","Nowe Piekuty"]
[null,null,null,null,null,null,null,null,null,null,null,null,null,null,null,null,null,null,null,null,null,null,null,null,null,"wysokomazowiecki","Sokoły"]
[null,null,null,null,null,null,null,null,null,null,null,null,null,null,null,null,null,null,null,null,null,null,null,null,null,"wysokomazowiecki","Szepietowo"]
[null,null,null,null,null,null,null,null,null,null,null,null,null,null,null,null,null,null,null,null,null,null,null,null,null,"wysokomazowiecki","Wysokie Mazowieckie"]
[null,null,null,null,null,null,null,null,null,null,null,null,null,null,null,null,null,null,null,null,null,null,null,null,null,"zambrowski","Zambrów"]
[null,null,null,null,null,null,null,null,null,null,null,null,null,null,null,null,null,null,null,null,null,null,null,null,null,"zambrowski","Kołaki Kościelne"]
[null,null,null,null,null,null,null,null,null,null,null,null,null,null,null,null,null,null,null,null,null,null,null,null,null,"zambrowski","Rutki"]
[null,null,null,null,null,null,null,null,null,null,null,null,null,null,null,null,null,null,null,null,null,null,null,null,null,"zambrowski","Szumowo"]
[null,null,null,null,null,null,null,null,null,null,null,null,null,null,null,null,null,null,null,null,null,null,null,null,null,"zambrowski","Zambrów"]
[null,null,null,null,null,null,null,null,null,null,null,null,null,null,null,null,null,null,null,null,null,null,null,null,null,"Łomża","Łomża"]
[null,null,null,null,null,null,null,null,null,null,null,null,null,null,null,null,null,null,null,null,null,null,null,null,null,"augustowski","Augustów"]
[null,null,null,null,null,null,null,null,null,null,null,null,null,null,null,null,null,null,null,null,null,null,null,null,null,"augustowski","Bargłów Kościelny"]
[null,null,null,null,null,null,null,null,null,null,null,null,null,null,null,null,null,null,null,null,null,null,null,null,null,"augustowski","Lipsk"]
[null,null,null,null,null,null,null,null,null,null,null,null,null,null,null,null,null,null,null,null,null,null,null,null,null,"augustowski","Nowinka"]
[null,null,null,null,null,null,null,null,null,null,null,null,null,null,null,null,null,null,null,null,null,null,null,null,null,"augustowski","Płaska"]
[null,null,null,null,null,null,null,null,null,null,null,null,null,null,null,null,null,null,null,null,null,null,null,null,null,"augustowski","Sztabin"]
[null,null,null,null,null,null,null,null,null,null,null,null,null,null,null,null,null,null,null,null,null,null,null,null,null,"grajewski","Grajewo"]
[null,null,null,null,null,null,null,null,null,null,null,null,null,null,null,null,null,null,null,null,null,null,null,null,null,"grajewski","Radziłów"]
[null,null,null,null,null,null,null,null,null,null,null,null,null,null,null,null,null,null,null,null,null,null,null,null,null,"grajewski","Rajgród"]
[null,null,null,null,null,null,null,null,null,null,null,null,null,null,null,null,null,null,null,null,null,null,null,null,null,"grajewski","Szczuczyn"]
[null,null,null,null,null,null,null,null,null,null,null,null,null,null,null,null,null,null,null,null,null,null,null,null,null,"grajewski","Wąsosz"]
[null,null,null,null,null,null,null,null,null,null,null,null,null,null,null,null,null,null,null,null,null,null,null,null,null,"moniecki","Goniądz"]
[null,null,null,null,null,null,null,null,null,null,null,null,null,null,null,null,null,null,null,null,null,null,null,null,null,"moniecki","Jasionówka"]
[null,null,null,null,null,null,null,null,null,null,null,null,null,null,null,null,null,null,null,null,null,null,null,null,null,"moniecki","Jaświły"]
[null,null,null,null,null,null,null,null,null,null,null,null,null,null,null,null,null,null,null,null,null,null,null,null,null,"moniecki","Knyszyn"]
[null,null,null,null,null,null,null,null,null,null,null,null,null,null,null,null,null,null,null,null,null,null,null,null,null,"moniecki","Krypno"]
[null,null,null,null,null,null,null,null,null,null,null,null,null,null,null,null,null,null,null,null,null,null,null,null,null,"moniecki","Mońki"]
[null,null,null,null,null,null,null,null,null,null,null,null,null,null,null,null,null,null,null,null,null,null,null,null,null,"moniecki","Trzcianne"]
[null,null,null,null,null,null,null,null,null,null,null,null,null,null,null,null,null,null,null,null,null,null,null,null,null,"sejneński","Sejny"]
[null,null,null,null,null,null,null,null,null,null,null,null,null,null,null,null,null,null,null,null,null,null,null,null,null,"sejneński","Giby"]
[null,null,null,null,null,null,null,null,null,null,null,null,null,null,null,null,null,null,null,null,null,null,null,null,null,"sejneński","Krasnopol"]
[null,null,null,null,null,null,null,null,null,null,null,null,null,null,null,null,null,null,null,null,null,null,null,null,null,"sejneński","Puńsk"]
[null,null,null,null,null,null,null,null,null,null,null,null,null,null,null,null,null,null,null,null,null,null,null,null,null,"sejneński","Sejny"]
[null,null,null,null,null,null,null,null,null,null,null,null,null,null,null,null,null,null,null,null,null,null,null,null,null,"suwalski","Bakałarzewo"]
[null,null,null,null,null,null,null,null,null,null,null,null,null,null,null,null,null,null,null,null,null,null,null,null,null,"suwalski","Filipów"]
[null,null,null,null,null,null,null,null,null,null,null,null,null,null,null,null,null,null,null,null,null,null,null,null,null,"suwalski","Jeleniewo"]
[null,null,null,null,null,null,null,null,null,null,null,null,null,null,null,null,null,null,null,null,null,null,null,null,null,"suwalski","Przerośl"]
[null,null,null,null,null,null,null,null,null,null,null,null,null,null,null,null,null,null,null,null,null,null,null,null,null,"suwalski","Raczki"]
[null,null,null,null,null,null,null,null,null,null,null,null,null,null,null,null,null,null,null,null,null,null,null,null,null,"suwalski","Rutka-Tartak"]
[null,null,null,null,null,null,null,null,null,null,null,null,null,null,null,null,null,null,null,null,null,null,null,null,null,"suwalski","Suwałki"]
[null,null,null,null,null,null,null,null,null,null,null,null,null,null,null,null,null,null,null,null,null,null,null,null,null,"suwalski","Szypliszki"]
[null,null,null,null,null,null,null,null,null,null,null,null,null,null,null,null,null,null,null,null,null,null,null,null,null,"suwalski","Wiżajny"]
[null,null,null,null,null,null,null,null,null,null,null,null,null,null,null,null,null,null,null,null,null,null,null,null,null,"Suwałki","Suwałki"]
[null,null,null,null,null,null,null,null,null,null,null,null,null,null,null,null,null,null,null,null,null,null,null,null,null,"Warszawa","Warszawa"]
[null,null,null,null,null,null,null,null,null,null,null,null,null,null,null,null,null,null,null,null,null,null,null,null,null,"Warszawa","Bemowo"]
[null,null,null,null,null,null,null,null,null,null,null,null,null,null,null,null,null,null,null,null,null,null,null,null,null,"Warszawa","Białołęka"]
[null,null,null,null,null,null,null,null,null,null,null,null,null,null,null,null,null,null,null,null,null,null,null,null,null,"Warszawa","Bielany"]
[null,null,null,null,null,null,null,null,null,null,null,null,null,null,null,null,null,null,null,null,null,null,null,null,null,"Warszawa","Mokotów"]
[null,null,null,null,null,null,null,null,null,null,null,null,null,null,null,null,null,null,null,null,null,null,null,null,null,"Warszawa","Ochota"]
[null,null,null,null,null,null,null,null,null,null,null,null,null,null,null,null,null,null,null,null,null,null,null,null,null,"Warszawa","Praga-Południe"]
[null,null,null,null,null,null,null,null,null,null,null,null,null,null,null,null,null,null,null,null,null,null,null,null,null,"Warszawa","Praga-Północ"]
[null,null,null,null,null,null,null,null,null,null,null,null,null,null,null,null,null,null,null,null,null,null,null,null,null,"Warszawa","Rembertów"]
[null,null,null,null,null,null,null,null,null,null,null,null,null,null,null,null,null,null,null,null,null,null,null,null,null,"Warszawa","Śródmieście"]
[null,null,null,null,null,null,null,null,null,null,null,null,null,null,null,null,null,null,null,null,null,null,null,null,null,"Warszawa","Targówek"]
[null,null,null,null,null,null,null,null,null,null,null,null,null,null,null,null,null,null,null,null,null,null,null,null,null,"Warszawa","Ursus"]
[null,null,null,null,null,null,null,null,null,null,null,null,null,null,null,null,null,null,null,null,null,null,null,null,null,"Warszawa","Ursynów"]
[null,null,null,null,null,null,null,null,null,null,null,null,null,null,null,null,null,null,null,null,null,null,null,null,null,"Warszawa","Wawer"]
[null,null,null,null,null,null,null,null,null,null,null,null,null,null,null,null,null,null,null,null,null,null,null,null,null,"Warszawa","Wesoła"]
[null,null,null,null,null,null,null,null,null,null,null,null,null,null,null,null,null,null,null,null,null,null,null,null,null,"Warszawa","Wilanów"]
[null,null,null,null,null,null,null,null,null,null,null,null,null,null,null,null,null,null,null,null,null,null,null,null,null,"Warszawa","Włochy"]
[null,null,null,null,null,null,null,null,null,null,null,null,null,null,null,null,null,null,null,null,null,null,null,null,null,"Warszawa","Wola"]
[null,null,null,null,null,null,null,null,null,null,null,null,null,null,null,null,null,null,null,null,null,null,null,null,null,"Warszawa","Żoliborz"]
[null,null,null,null,null,null,null,null,null,null,null,null,null,null,null,null,null,null,null,null,null,null,null,null,null,"legionowski","Legionowo"]
[null,null,null,null,null,null,null,null,null,null,null,null,null,null,null,null,null,null,null,null,null,null,null,null,null,"legionowski","Jabłonna"]
[null,null,null,null,null,null,null,null,null,null,null,null,null,null,null,null,null,null,null,null,null,null,null,null,null,"legionowski","Nieporęt"]
[null,null,null,null,null,null,null,null,null,null,null,null,null,null,null,null,null,null,null,null,null,null,null,null,null,"legionowski","Serock"]
[null,null,null,null,null,null,null,null,null,null,null,null,null,null,null,null,null,null,null,null,null,null,null,null,null,"legionowski","Wieliszew"]
[null,null,null,null,null,null,null,null,null,null,null,null,null,null,null,null,null,null,null,null,null,null,null,null,null,"miński","Mińsk Mazowiecki"]
[null,null,null,null,null,null,null,null,null,null,null,null,null,null,null,null,null,null,null,null,null,null,null,null,null,"miński","Cegłów"]
[null,null,null,null,null,null,null,null,null,null,null,null,null,null,null,null,null,null,null,null,null,null,null,null,null,"miński","Dębe Wielkie"]
[null,null,null,null,null,null,null,null,null,null,null,null,null,null,null,null,null,null,null,null,null,null,null,null,null,"miński","Dobre"]
[null,null,null,null,null,null,null,null,null,null,null,null,null,null,null,null,null,null,null,null,null,null,null,null,null,"miński","Halinów"]
[null,null,null,null,null,null,null,null,null,null,null,null,null,null,null,null,null,null,null,null,null,null,null,null,null,"miński","Jakubów"]
[null,null,null,null,null,null,null,null,null,null,null,null,null,null,null,null,null,null,null,null,null,null,null,null,null,"miński","Kałuszyn"]
[null,null,null,null,null,null,null,null,null,null,null,null,null,null,null,null,null,null,null,null,null,null,null,null,null,"miński","Latowicz"]
[null,null,null,null,null,null,null,null,null,null,null,null,null,null,null,null,null,null,null,null,null,null,null,null,null,"miński","Mińsk Mazowiecki"]
[null,null,null,null,null,null,null,null,null,null,null,null,null,null,null,null,null,null,null,null,null,null,null,null,null,"miński","Mrozy"]
[null,null,null,null,null,null,null,null,null,null,null,null,null,null,null,null,null,null,null,null,null,null,null,null,null,"miński","Siennica"]
[null,null,null,null,null,null,null,null,null,null,null,null,null,null,null,null,null,null,null,null,null,null,null,null,null,"miński","Stanisławów"]
[null,null,null,null,null,null,null,null,null,null,null,null,null,null,null,null,null,null,null,null,null,null,null,null,null,"miński","Sulejówek"]
[null,null,null,null,null,null,null,null,null,null,null,null,null,null,null,null,null,null,null,null,null,null,null,null,null,"otwocki","Józefów"]
[null,null,null,null,null,null,null,null,null,null,null,null,null,null,null,null,null,null,null,null,null,null,null,null,null,"otwocki","Otwock"]
[null,null,null,null,null,null,null,null,null,null,null,null,null,null,null,null,null,null,null,null,null,null,null,null,null,"otwocki","Celestynów"]
[null,null,null,null,null,null,null,null,null,null,null,null,null,null,null,null,null,null,null,null,null,null,null,null,null,"otwocki","Karczew"]
[null,null,null,null,null,null,null,null,null,null,null,null,null,null,null,null,null,null,null,null,null,null,null,null,null,"otwocki","Kołbiel"]
[null,null,null,null,null,null,null,null,null,null,null,null,null,null,null,null,null,null,null,null,null,null,null,null,null,"otwocki","Osieck"]
[null,null,null,null,null,null,null,null,null,null,null,null,null,null,null,null,null,null,null,null,null,null,null,null,null,"otwocki","Sobienie-Jeziory"]
[null,null,null,null,null,null,null,null,null,null,null,null,null,null,null,null,null,null,null,null,null,null,null,null,null,"otwocki","Wiązowna"]
[null,null,null,null,null,null,null,null,null,null,null,null,null,null,null,null,null,null,null,null,null,null,null,null,null,"wołomiński","Kobyłka"]
[null,null,null,null,null,null,null,null,null,null,null,null,null,null,null,null,null,null,null,null,null,null,null,null,null,"wołomiński","Marki"]
[null,null,null,null,null,null,null,null,null,null,null,null,null,null,null,null,null,null,null,null,null,null,null,null,null,"wołomiński","Ząbki"]
[null,null,null,null,null,null,null,null,null,null,null,null,null,null,null,null,null,null,null,null,null,null,null,null,null,"wołomiński","Zielonka"]
[null,null,null,null,null,null,null,null,null,null,null,null,null,null,null,null,null,null,null,null,null,null,null,null,null,"wołomiński","Dąbrówka"]
[null,null,null,null,null,null,null,null,null,null,null,null,null,null,null,null,null,null,null,null,null,null,null,null,null,"wołomiński","Jadów"]
[null,null,null,null,null,null,null,null,null,null,null,null,null,null,null,null,null,null,null,null,null,null,null,null,null,"wołomiński","Klembów"]
[null,null,null,null,null,null,null,null,null,null,null,null,null,null,null,null,null,null,null,null,null,null,null,null,null,"wołomiński","Poświętne"]
[null,null,null,null,null,null,null,null,null,null,null,null,null,null,null,null,null,null,null,null,null,null,null,null,null,"wołomiński","Radzymin"]
[null,null,null,null,null,null,null,null,null,null,null,null,null,null,null,null,null,null,null,null,null,null,null,null,null,"wołomiński","Strachówka"]
[null,null,null,null,null,null,null,null,null,null,null,null,null,null,null,null,null,null,null,null,null,null,null,null,null,"wołomiński","Tłuszcz"]
[null,null,null,null,null,null,null,null,null,null,null,null,null,null,null,null,null,null,null,null,null,null,null,null,null,"wołomiński","Wołomin"]
[null,null,null,null,null,null,null,null,null,null,null,null,null,null,null,null,null,null,null,null,null,null,null,null,null,"grodziski","Milanówek"]
[null,null,null,null,null,null,null,null,null,null,null,null,null,null,null,null,null,null,null,null,null,null,null,null,null,"grodziski","Podkowa Leśna"]
[null,null,null,null,null,null,null,null,null,null,null,null,null,null,null,null,null,null,null,null,null,null,null,null,null,"grodziski","Baranów"]
[null,null,null,null,null,null,null,null,null,null,null,null,null,null,null,null,null,null,null,null,null,null,null,null,null,"grodziski","Grodzisk Mazowiecki"]
[null,null,null,null,null,null,null,null,null,null,null,null,null,null,null,null,null,null,null,null,null,null,null,null,null,"grodziski","Jaktorów"]
[null,null,null,null,null,null,null,null,null,null,null,null,null,null,null,null,null,null,null,null,null,null,null,null,null,"grodziski","Żabia Wola"]
[null,null,null,null,null,null,null,null,null,null,null,null,null,null,null,null,null,null,null,null,null,null,null,null,null,"nowodworski","Nowy Dwór Mazowiecki"]
[null,null,null,null,null,null,null,null,null,null,null,null,null,null,null,null,null,null,null,null,null,null,null,null,null,"nowodworski","Czosnów"]
[null,null,null,null,null,null,null,null,null,null,null,null,null,null,null,null,null,null,null,null,null,null,null,null,null,"nowodworski","Leoncin"]
[null,null,null,null,null,null,null,null,null,null,null,null,null,null,null,null,null,null,null,null,null,null,null,null,null,"nowodworski","Nasielsk"]
[null,null,null,null,null,null,null,null,null,null,null,null,null,null,null,null,null,null,null,null,null,null,null,null,null,"nowodworski","Pomiechówek"]
[null,null,null,null,null,null,null,null,null,null,null,null,null,null,null,null,null,null,null,null,null,null,null,null,null,"nowodworski","Zakroczym"]
[null,null,null,null,null,null,null,null,null,null,null,null,null,null,null,null,null,null,null,null,null,null,null,null,null,"piaseczyński","Góra Kalwaria"]
[null,null,null,null,null,null,null,null,null,null,null,null,null,null,null,null,null,null,null,null,null,null,null,null,null,"piaseczyński","Konstancin-Jeziorna"]
[null,null,null,null,null,null,null,null,null,null,null,null,null,null,null,null,null,null,null,null,null,null,null,null,null,"piaseczyński","Lesznowola"]
[null,null,null,null,null,null,null,null,null,null,null,null,null,null,null,null,null,null,null,null,null,null,null,null,null,"piaseczyński","Piaseczno"]
[null,null,null,null,null,null,null,null,null,null,null,null,null,null,null,null,null,null,null,null,null,null,null,null,null,"piaseczyński","Prażmów"]
[null,null,null,null,null,null,null,null,null,null,null,null,null,null,null,null,null,null,null,null,null,null,null,null,null,"piaseczyński","Tarczyn"]
[null,null,null,null,null,null,null,null,null,null,null,null,null,null,null,null,null,null,null,null,null,null,null,null,null,"pruszkowski","Piastów"]
[null,null,null,null,null,null,null,null,null,null,null,null,null,null,null,null,null,null,null,null,null,null,null,null,null,"pruszkowski","Pruszków"]
[null,null,null,null,null,null,null,null,null,null,null,null,null,null,null,null,null,null,null,null,null,null,null,null,null,"pruszkowski","Brwinów"]
[null,null,null,null,null,null,null,null,null,null,null,null,null,null,null,null,null,null,null,null,null,null,null,null,null,"pruszkowski","Michałowice"]
[null,null,null,null,null,null,null,null,null,null,null,null,null,null,null,null,null,null,null,null,null,null,null,null,null,"pruszkowski","Nadarzyn"]
[null,null,null,null,null,null,null,null,null,null,null,null,null,null,null,null,null,null,null,null,null,null,null,null,null,"pruszkowski","Raszyn"]
[null,null,null,null,null,null,null,null,null,null,null,null,null,null,null,null,null,null,null,null,null,null,null,null,null,"warszawski zachodni","Błonie"]
[null,null,null,null,null,null,null,null,null,null,null,null,null,null,null,null,null,null,null,null,null,null,null,null,null,"warszawski zachodni","Izabelin"]
[null,null,null,null,null,null,null,null,null,null,null,null,null,null,null,null,null,null,null,null,null,null,null,null,null,"warszawski zachodni","Kampinos"]
[null,null,null,null,null,null,null,null,null,null,null,null,null,null,null,null,null,null,null,null,null,null,null,null,null,"warszawski zachodni","Leszno"]
[null,null,null,null,null,null,null,null,null,null,null,null,null,null,null,null,null,null,null,null,null,null,null,null,null,"warszawski zachodni","Łomianki"]
[null,null,null,null,null,null,null,null,null,null,null,null,null,null,null,null,null,null,null,null,null,null,null,null,null,"warszawski zachodni","Ożarów Mazowiecki"]
[null,null,null,null,null,null,null,null,null,null,null,null,null,null,null,null,null,null,null,null,null,null,null,null,null,"warszawski zachodni","Stare Babice"]
[null,null,null,null,null,null,null,null,null,null,null,null,null,null,null,null,null,null,null,null,null,null,null,null,null,"ciechanowski","Ciechanów"]
[null,null,null,null,null,null,null,null,null,null,null,null,null,null,null,null,null,null,null,null,null,null,null,null,null,"ciechanowski","Glinojeck"]
[null,null,null,null,null,null,null,null,null,null,null,null,null,null,null,null,null,null,null,null,null,null,null,null,null,"ciechanowski","Gołymin-Ośrodek"]
[null,null,null,null,null,null,null,null,null,null,null,null,null,null,null,null,null,null,null,null,null,null,null,null,null,"ciechanowski","Grudusk"]
[null,null,null,null,null,null,null,null,null,null,null,null,null,null,null,null,null,null,null,null,null,null,null,null,null,"ciechanowski","Ojrzeń"]
[null,null,null,null,null,null,null,null,null,null,null,null,null,null,null,null,null,null,null,null,null,null,null,null,null,"ciechanowski","Opinogóra Górna"]
[null,null,null,null,null,null,null,null,null,null,null,null,null,null,null,null,null,null,null,null,null,null,null,null,null,"ciechanowski","Regimin"]
[null,null,null,null,null,null,null,null,null,null,null,null,null,null,null,null,null,null,null,null,null,null,null,null,null,"ciechanowski","Sońsk"]
[null,null,null,null,null,null,null,null,null,null,null,null,null,null,null,null,null,null,null,null,null,null,null,null,null,"mławski","Mława"]
[null,null,null,null,null,null,null,null,null,null,null,null,null,null,null,null,null,null,null,null,null,null,null,null,null,"mławski","Dzierzgowo"]
[null,null,null,null,null,null,null,null,null,null,null,null,null,null,null,null,null,null,null,null,null,null,null,null,null,"mławski","Lipowiec Kościelny"]
[null,null,null,null,null,null,null,null,null,null,null,null,null,null,null,null,null,null,null,null,null,null,null,null,null,"mławski","Radzanów"]
[null,null,null,null,null,null,null,null,null,null,null,null,null,null,null,null,null,null,null,null,null,null,null,null,null,"mławski","Strzegowo"]
[null,null,null,null,null,null,null,null,null,null,null,null,null,null,null,null,null,null,null,null,null,null,null,null,null,"mławski","Stupsk"]
[null,null,null,null,null,null,null,null,null,null,null,null,null,null,null,null,null,null,null,null,null,null,null,null,null,"mławski","Szreńsk"]
[null,null,null,null,null,null,null,null,null,null,null,null,null,null,null,null,null,null,null,null,null,null,null,null,null,"mławski","Szydłowo"]
[null,null,null,null,null,null,null,null,null,null,null,null,null,null,null,null,null,null,null,null,null,null,null,null,null,"mławski","Wieczfnia Kościelna"]
[null,null,null,null,null,null,null,null,null,null,null,null,null,null,null,null,null,null,null,null,null,null,null,null,null,"mławski","Wiśniewo"]
[null,null,null,null,null,null,null,null,null,null,null,null,null,null,null,null,null,null,null,null,null,null,null,null,null,"płoński","Płońsk"]
[null,null,null,null,null,null,null,null,null,null,null,null,null,null,null,null,null,null,null,null,null,null,null,null,null,"płoński","Raciąż"]
[null,null,null,null,null,null,null,null,null,null,null,null,null,null,null,null,null,null,null,null,null,null,null,null,null,"płoński","Baboszewo"]
[null,null,null,null,null,null,null,null,null,null,null,null,null,null,null,null,null,null,null,null,null,null,null,null,null,"płoński","Czerwińsk nad Wisłą"]
[null,null,null,null,null,null,null,null,null,null,null,null,null,null,null,null,null,null,null,null,null,null,null,null,null,"płoński","Dzierzążnia"]
[null,null,null,null,null,null,null,null,null,null,null,null,null,null,null,null,null,null,null,null,null,null,null,null,null,"płoński","Joniec"]
[null,null,null,null,null,null,null,null,null,null,null,null,null,null,null,null,null,null,null,null,null,null,null,null,null,"płoński","Naruszewo"]
[null,null,null,null,null,null,null,null,null,null,null,null,null,null,null,null,null,null,null,null,null,null,null,null,null,"płoński","Nowe Miasto"]
[null,null,null,null,null,null,null,null,null,null,null,null,null,null,null,null,null,null,null,null,null,null,null,null,null,"płoński","Płońsk"]
[null,null,null,null,null,null,null,null,null,null,null,null,null,null,null,null,null,null,null,null,null,null,null,null,null,"płoński","Raciąż"]
[null,null,null,null,null,null,null,null,null,null,null,null,null,null,null,null,null,null,null,null,null,null,null,null,null,"płoński","Sochocin"]
[null,null,null,null,null,null,null,null,null,null,null,null,null,null,null,null,null,null,null,null,null,null,null,null,null,"płoński","Załuski"]
[null,null,null,null,null,null,null,null,null,null,null,null,null,null,null,null,null,null,null,null,null,null,null,null,null,"pułtuski","Gzy"]
[null,null,null,null,null,null,null,null,null,null,null,null,null,null,null,null,null,null,null,null,null,null,null,null,null,"pułtuski","Obryte"]
[null,null,null,null,null,null,null,null,null,null,null,null,null,null,null,null,null,null,null,null,null,null,null,null,null,"pułtuski","Pokrzywnica"]
[null,null,null,null,null,null,null,null,null,null,null,null,null,null,null,null,null,null,null,null,null,null,null,null,null,"pułtuski","Pułtusk"]
[null,null,null,null,null,null,null,null,null,null,null,null,null,null,null,null,null,null,null,null,null,null,null,null,null,"pułtuski","Świercze"]
[null,null,null,null,null,null,null,null,null,null,null,null,null,null,null,null,null,null,null,null,null,null,null,null,null,"pułtuski","Winnica"]
[null,null,null,null,null,null,null,null,null,null,null,null,null,null,null,null,null,null,null,null,null,null,null,null,null,"pułtuski","Zatory"]
[null,null,null,null,null,null,null,null,null,null,null,null,null,null,null,null,null,null,null,null,null,null,null,null,null,"żuromiński","Bieżuń"]
[null,null,null,null,null,null,null,null,null,null,null,null,null,null,null,null,null,null,null,null,null,null,null,null,null,"żuromiński","Kuczbork-Osada"]
[null,null,null,null,null,null,null,null,null,null,null,null,null,null,null,null,null,null,null,null,null,null,null,null,null,"żuromiński","Lubowidz"]
[null,null,null,null,null,null,null,null,null,null,null,null,null,null,null,null,null,null,null,null,null,null,null,null,null,"żuromiński","Lutocin"]
[null,null,null,null,null,null,null,null,null,null,null,null,null,null,null,null,null,null,null,null,null,null,null,null,null,"żuromiński","Siemiątkowo"]
[null,null,null,null,null,null,null,null,null,null,null,null,null,null,null,null,null,null,null,null,null,null,null,null,null,"żuromiński","Żuromin"]
[null,null,null,null,null,null,null,null,null,null,null,null,null,null,null,null,null,null,null,null,null,null,null,null,null,"makowski","Maków Mazowiecki"]
[null,null,null,null,null,null,null,null,null,null,null,null,null,null,null,null,null,null,null,null,null,null,null,null,null,"makowski","Czerwonka"]
[null,null,null,null,null,null,null,null,null,null,null,null,null,null,null,null,null,null,null,null,null,null,null,null,null,"makowski","Karniewo"]
[null,null,null,null,null,null,null,null,null,null,null,null,null,null,null,null,null,null,null,null,null,null,null,null,null,"makowski","Krasnosielc"]
[null,null,null,null,null,null,null,null,null,null,null,null,null,null,null,null,null,null,null,null,null,null,null,null,null,"makowski","Młynarze"]
[null,null,null,null,null,null,null,null,null,null,null,null,null,null,null,null,null,null,null,null,null,null,null,null,null,"makowski","Płoniawy-Bramura"]
[null,null,null,null,null,null,null,null,null,null,null,null,null,null,null,null,null,null,null,null,null,null,null,null,null,"makowski","Różan"]
[null,null,null,null,null,null,null,null,null,null,null,null,null,null,null,null,null,null,null,null,null,null,null,null,null,"makowski","Rzewnie"]
[null,null,null,null,null,null,null,null,null,null,null,null,null,null,null,null,null,null,null,null,null,null,null,null,null,"makowski","Sypniewo"]
[null,null,null,null,null,null,null,null,null,null,null,null,null,null,null,null,null,null,null,null,null,null,null,null,null,"makowski","Szelków"]
[null,null,null,null,null,null,null,null,null,null,null,null,null,null,null,null,null,null,null,null,null,null,null,null,null,"ostrołęcki","Baranowo"]
[null,null,null,null,null,null,null,null,null,null,null,null,null,null,null,null,null,null,null,null,null,null,null,null,null,"ostrołęcki","Czarnia"]
[null,null,null,null,null,null,null,null,null,null,null,null,null,null,null,null,null,null,null,null,null,null,null,null,null,"ostrołęcki","Czerwin"]
[null,null,null,null,null,null,null,null,null,null,null,null,null,null,null,null,null,null,null,null,null,null,null,null,null,"ostrołęcki","Goworowo"]
[null,null,null,null,null,null,null,null,null,null,null,null,null,null,null,null,null,null,null,null,null,null,null,null,null,"ostrołęcki","Kadzidło"]
[null,null,null,null,null,null,null,null,null,null,null,null,null,null,null,null,null,null,null,null,null,null,null,null,null,"ostrołęcki","Lelis"]
[null,null,null,null,null,null,null,null,null,null,null,null,null,null,null,null,null,null,null,null,null,null,null,null,null,"ostrołęcki","Łyse"]
[null,null,null,null,null,null,null,null,null,null,null,null,null,null,null,null,null,null,null,null,null,null,null,null,null,"ostrołęcki","Myszyniec"]
[null,null,null,null,null,null,null,null,null,null,null,null,null,null,null,null,null,null,null,null,null,null,null,null,null,"ostrołęcki","Olszewo-Borki"]
[null,null,null,null,null,null,null,null,null,null,null,null,null,null,null,null,null,null,null,null,null,null,null,null,null,"ostrołęcki","Rzekuń"]
[null,null,null,null,null,null,null,null,null,null,null,null,null,null,null,null,null,null,null,null,null,null,null,null,null,"ostrołęcki","Troszyn"]
[null,null,null,null,null,null,null,null,null,null,null,null,null,null,null,null,null,null,null,null,null,null,null,null,null,"ostrowski","Ostrów Mazowiecka"]
[null,null,null,null,null,null,null,null,null,null,null,null,null,null,null,null,null,null,null,null,null,null,null,null,null,"ostrowski","Andrzejewo"]
[null,null,null,null,null,null,null,null,null,null,null,null,null,null,null,null,null,null,null,null,null,null,null,null,null,"ostrowski","Boguty-Pianki"]
[null,null,null,null,null,null,null,null,null,null,null,null,null,null,null,null,null,null,null,null,null,null,null,null,null,"ostrowski","Brok"]
[null,null,null,null,null,null,null,null,null,null,null,null,null,null,null,null,null,null,null,null,null,null,null,null,null,"ostrowski","Małkinia Górna"]
[null,null,null,null,null,null,null,null,null,null,null,null,null,null,null,null,null,null,null,null,null,null,null,null,null,"ostrowski","Nur"]
[null,null,null,null,null,null,null,null,null,null,null,null,null,null,null,null,null,null,null,null,null,null,null,null,null,"ostrowski","Ostrów Mazowiecka"]
[null,null,null,null,null,null,null,null,null,null,null,null,null,null,null,null,null,null,null,null,null,null,null,null,null,"ostrowski","Stary Lubotyń"]
[null,null,null,null,null,null,null,null,null,null,null,null,null,null,null,null,null,null,null,null,null,null,null,null,null,"ostrowski","Szulborze Wielkie"]
[null,null,null,null,null,null,null,null,null,null,null,null,null,null,null,null,null,null,null,null,null,null,null,null,null,"ostrowski","Wąsewo"]
[null,null,null,null,null,null,null,null,null,null,null,null,null,null,null,null,null,null,null,null,null,null,null,null,null,"ostrowski","Zaręby Kościelne"]
[null,null,null,null,null,null,null,null,null,null,null,null,null,null,null,null,null,null,null,null,null,null,null,null,null,"przasnyski","Przasnysz"]
[null,null,null,null,null,null,null,null,null,null,null,null,null,null,null,null,null,null,null,null,null,null,null,null,null,"przasnyski","Chorzele"]
[null,null,null,null,null,null,null,null,null,null,null,null,null,null,null,null,null,null,null,null,null,null,null,null,null,"przasnyski","Czernice Borowe"]
[null,null,null,null,null,null,null,null,null,null,null,null,null,null,null,null,null,null,null,null,null,null,null,null,null,"przasnyski","Jednorożec"]
[null,null,null,null,null,null,null,null,null,null,null,null,null,null,null,null,null,null,null,null,null,null,null,null,null,"przasnyski","Krasne"]
[null,null,null,null,null,null,null,null,null,null,null,null,null,null,null,null,null,null,null,null,null,null,null,null,null,"przasnyski","Krzynowłoga Mała"]
[null,null,null,null,null,null,null,null,null,null,null,null,null,null,null,null,null,null,null,null,null,null,null,null,null,"przasnyski","Przasnysz"]
[null,null,null,null,null,null,null,null,null,null,null,null,null,null,null,null,null,null,null,null,null,null,null,null,null,"wyszkowski","Brańszczyk"]
[null,null,null,null,null,null,null,null,null,null,null,null,null,null,null,null,null,null,null,null,null,null,null,null,null,"wyszkowski","Długosiodło"]
[null,null,null,null,null,null,null,null,null,null,null,null,null,null,null,null,null,null,null,null,null,null,null,null,null,"wyszkowski","Rząśnik"]
[null,null,null,null,null,null,null,null,null,null,null,null,null,null,null,null,null,null,null,null,null,null,null,null,null,"wyszkowski","Somianka"]
[null,null,null,null,null,null,null,null,null,null,null,null,null,null,null,null,null,null,null,null,null,null,null,null,null,"wyszkowski","Wyszków"]
[null,null,null,null,null,null,null,null,null,null,null,null,null,null,null,null,null,null,null,null,null,null,null,null,null,"wyszkowski","Zabrodzie"]
[null,null,null,null,null,null,null,null,null,null,null,null,null,null,null,null,null,null,null,null,null,null,null,null,null,"Ostrołęka","Ostrołęka"]
[null,null,null,null,null,null,null,null,null,null,null,null,null,null,null,null,null,null,null,null,null,null,null,null,null,"białobrzeski","Białobrzegi"]
[null,null,null,null,null,null,null,null,null,null,null,null,null,null,null,null,null,null,null,null,null,null,null,null,null,"białobrzeski","Promna"]
[null,null,null,null,null,null,null,null,null,null,null,null,null,null,null,null,null,null,null,null,null,null,null,null,null,"białobrzeski","Radzanów"]
[null,null,null,null,null,null,null,null,null,null,null,null,null,null,null,null,null,null,null,null,null,null,null,null,null,"białobrzeski","Stara Błotnica"]
[null,null,null,null,null,null,null,null,null,null,null,null,null,null,null,null,null,null,null,null,null,null,null,null,null,"białobrzeski","Stromiec"]
[null,null,null,null,null,null,null,null,null,null,null,null,null,null,null,null,null,null,null,null,null,null,null,null,null,"białobrzeski","Wyśmierzyce"]
[null,null,null,null,null,null,null,null,null,null,null,null,null,null,null,null,null,null,null,null,null,null,null,null,null,"kozienicki","Garbatka-Letnisko"]
[null,null,null,null,null,null,null,null,null,null,null,null,null,null,null,null,null,null,null,null,null,null,null,null,null,"kozienicki","Głowaczów"]
[null,null,null,null,null,null,null,null,null,null,null,null,null,null,null,null,null,null,null,null,null,null,null,null,null,"kozienicki","Gniewoszów"]
[null,null,null,null,null,null,null,null,null,null,null,null,null,null,null,null,null,null,null,null,null,null,null,null,null,"kozienicki","Grabów nad Pilicą"]
[null,null,null,null,null,null,null,null,null,null,null,null,null,null,null,null,null,null,null,null,null,null,null,null,null,"kozienicki","Kozienice"]
[null,null,null,null,null,null,null,null,null,null,null,null,null,null,null,null,null,null,null,null,null,null,null,null,null,"kozienicki","Magnuszew"]
[null,null,null,null,null,null,null,null,null,null,null,null,null,null,null,null,null,null,null,null,null,null,null,null,null,"kozienicki","Sieciechów"]
[null,null,null,null,null,null,null,null,null,null,null,null,null,null,null,null,null,null,null,null,null,null,null,null,null,"lipski","Chotcza"]
[null,null,null,null,null,null,null,null,null,null,null,null,null,null,null,null,null,null,null,null,null,null,null,null,null,"lipski","Ciepielów"]
[null,null,null,null,null,null,null,null,null,null,null,null,null,null,null,null,null,null,null,null,null,null,null,null,null,"lipski","Lipsko"]
[null,null,null,null,null,null,null,null,null,null,null,null,null,null,null,null,null,null,null,null,null,null,null,null,null,"lipski","Rzeczniów"]
[null,null,null,null,null,null,null,null,null,null,null,null,null,null,null,null,null,null,null,null,null,null,null,null,null,"lipski","Sienno"]
[null,null,null,null,null,null,null,null,null,null,null,null,null,null,null,null,null,null,null,null,null,null,null,null,null,"lipski","Solec nad Wisłą"]
[null,null,null,null,null,null,null,null,null,null,null,null,null,null,null,null,null,null,null,null,null,null,null,null,null,"przysuski","Borkowice"]
[null,null,null,null,null,null,null,null,null,null,null,null,null,null,null,null,null,null,null,null,null,null,null,null,null,"przysuski","Gielniów"]
[null,null,null,null,null,null,null,null,null,null,null,null,null,null,null,null,null,null,null,null,null,null,null,null,null,"przysuski","Klwów"]
[null,null,null,null,null,null,null,null,null,null,null,null,null,null,null,null,null,null,null,null,null,null,null,null,null,"przysuski","Odrzywół"]
[null,null,null,null,null,null,null,null,null,null,null,null,null,null,null,null,null,null,null,null,null,null,null,null,null,"przysuski","Potworów"]
[null,null,null,null,null,null,null,null,null,null,null,null,null,null,null,null,null,null,null,null,null,null,null,null,null,"przysuski","Przysucha"]
[null,null,null,null,null,null,null,null,null,null,null,null,null,null,null,null,null,null,null,null,null,null,null,null,null,"przysuski","Rusinów"]
[null,null,null,null,null,null,null,null,null,null,null,null,null,null,null,null,null,null,null,null,null,null,null,null,null,"przysuski","Wieniawa"]
[null,null,null,null,null,null,null,null,null,null,null,null,null,null,null,null,null,null,null,null,null,null,null,null,null,"radomski","Pionki"]
[null,null,null,null,null,null,null,null,null,null,null,null,null,null,null,null,null,null,null,null,null,null,null,null,null,"radomski","Gózd"]
[null,null,null,null,null,null,null,null,null,null,null,null,null,null,null,null,null,null,null,null,null,null,null,null,null,"radomski","Iłża"]
[null,null,null,null,null,null,null,null,null,null,null,null,null,null,null,null,null,null,null,null,null,null,null,null,null,"radomski","Jastrzębia"]
[null,null,null,null,null,null,null,null,null,null,null,null,null,null,null,null,null,null,null,null,null,null,null,null,null,"radomski","Jedlińsk"]
[null,null,null,null,null,null,null,null,null,null,null,null,null,null,null,null,null,null,null,null,null,null,null,null,null,"radomski","Jedlnia-Letnisko"]
[null,null,null,null,null,null,null,null,null,null,null,null,null,null,null,null,null,null,null,null,null,null,null,null,null,"radomski","Kowala"]
[null,null,null,null,null,null,null,null,null,null,null,null,null,null,null,null,null,null,null,null,null,null,null,null,null,"radomski","Pionki"]
[null,null,null,null,null,null,null,null,null,null,null,null,null,null,null,null,null,null,null,null,null,null,null,null,null,"radomski","Przytyk"]
[null,null,null,null,null,null,null,null,null,null,null,null,null,null,null,null,null,null,null,null,null,null,null,null,null,"radomski","Skaryszew"]
[null,null,null,null,null,null,null,null,null,null,null,null,null,null,null,null,null,null,null,null,null,null,null,null,null,"radomski","Wierzbica"]
[null,null,null,null,null,null,null,null,null,null,null,null,null,null,null,null,null,null,null,null,null,null,null,null,null,"radomski","Wolanów"]
[null,null,null,null,null,null,null,null,null,null,null,null,null,null,null,null,null,null,null,null,null,null,null,null,null,"radomski","Zakrzew"]
[null,null,null,null,null,null,null,null,null,null,null,null,null,null,null,null,null,null,null,null,null,null,null,null,null,"szydłowiecki","Chlewiska"]
[null,null,null,null,null,null,null,null,null,null,null,null,null,null,null,null,null,null,null,null,null,null,null,null,null,"szydłowiecki","Jastrząb"]
[null,null,null,null,null,null,null,null,null,null,null,null,null,null,null,null,null,null,null,null,null,null,null,null,null,"szydłowiecki","Mirów"]
[null,null,null,null,null,null,null,null,null,null,null,null,null,null,null,null,null,null,null,null,null,null,null,null,null,"szydłowiecki","Orońsko"]
[null,null,null,null,null,null,null,null,null,null,null,null,null,null,null,null,null,null,null,null,null,null,null,null,null,"szydłowiecki","Szydłowiec"]
[null,null,null,null,null,null,null,null,null,null,null,null,null,null,null,null,null,null,null,null,null,null,null,null,null,"zwoleński","Kazanów"]
[null,null,null,null,null,null,null,null,null,null,null,null,null,null,null,null,null,null,null,null,null,null,null,null,null,"zwoleński","Policzna"]
[null,null,null,null,null,null,null,null,null,null,null,null,null,null,null,null,null,null,null,null,null,null,null,null,null,"zwoleński","Przyłęk"]
[null,null,null,null,null,null,null,null,null,null,null,null,null,null,null,null,null,null,null,null,null,null,null,null,null,"zwoleński","Tczów"]
[null,null,null,null,null,null,null,null,null,null,null,null,null,null,null,null,null,null,null,null,null,null,null,null,null,"zwoleński","Zwoleń"]
[null,null,null,null,null,null,null,null,null,null,null,null,null,null,null,null,null,null,null,null,null,null,null,null,null,"Radom","Radom"]
[null,null,null,null,null,null,null,null,null,null,null,null,null,null,null,null,null,null,null,null,null,null,null,null,null,"gostyniński","Gostynin"]
[null,null,null,null,null,null,null,null,null,null,null,null,null,null,null,null,null,null,null,null,null,null,null,null,null,"gostyniński","Pacyna"]
[null,null,null,null,null,null,null,null,null,null,null,null,null,null,null,null,null,null,null,null,null,null,null,null,null,"gostyniński","Sanniki"]
[null,null,null,null,null,null,null,null,null,null,null,null,null,null,null,null,null,null,null,null,null,null,null,null,null,"gostyniński","Szczawin Kościelny"]
[null,null,null,null,null,null,null,null,null,null,null,null,null,null,null,null,null,null,null,null,null,null,null,null,null,"płocki","Bielsk"]
[null,null,null,null,null,null,null,null,null,null,null,null,null,null,null,null,null,null,null,null,null,null,null,null,null,"płocki","Bodzanów"]
[null,null,null,null,null,null,null,null,null,null,null,null,null,null,null,null,null,null,null,null,null,null,null,null,null,"płocki","Brudzeń Duży"]
[null,null,null,null,null,null,null,null,null,null,null,null,null,null,null,null,null,null,null,null,null,null,null,null,null,"płocki","Bulkowo"]
[null,null,null,null,null,null,null,null,null,null,null,null,null,null,null,null,null,null,null,null,null,null,null,null,null,"płocki","Drobin"]
[null,null,null,null,null,null,null,null,null,null,null,null,null,null,null,null,null,null,null,null,null,null,null,null,null,"płocki","Gąbin"]
[null,null,null,null,null,null,null,null,null,null,null,null,null,null,null,null,null,null,null,null,null,null,null,null,null,"płocki","Łąck"]
[null,null,null,null,null,null,null,null,null,null,null,null,null,null,null,null,null,null,null,null,null,null,null,null,null,"płocki","Mała Wieś"]
[null,null,null,null,null,null,null,null,null,null,null,null,null,null,null,null,null,null,null,null,null,null,null,null,null,"płocki","Nowy Duninów"]
[null,null,null,null,null,null,null,null,null,null,null,null,null,null,null,null,null,null,null,null,null,null,null,null,null,"płocki","Radzanowo"]
[null,null,null,null,null,null,null,null,null,null,null,null,null,null,null,null,null,null,null,null,null,null,null,null,null,"płocki","Słubice"]
[null,null,null,null,null,null,null,null,null,null,null,null,null,null,null,null,null,null,null,null,null,null,null,null,null,"płocki","Słupno"]
[null,null,null,null,null,null,null,null,null,null,null,null,null,null,null,null,null,null,null,null,null,null,null,null,null,"płocki","Stara Biała"]
[null,null,null,null,null,null,null,null,null,null,null,null,null,null,null,null,null,null,null,null,null,null,null,null,null,"płocki","Staroźreby"]
[null,null,null,null,null,null,null,null,null,null,null,null,null,null,null,null,null,null,null,null,null,null,null,null,null,"płocki","Wyszogród"]
[null,null,null,null,null,null,null,null,null,null,null,null,null,null,null,null,null,null,null,null,null,null,null,null,null,"sierpecki","Sierpc"]
[null,null,null,null,null,null,null,null,null,null,null,null,null,null,null,null,null,null,null,null,null,null,null,null,null,"sierpecki","Gozdowo"]
[null,null,null,null,null,null,null,null,null,null,null,null,null,null,null,null,null,null,null,null,null,null,null,null,null,"sierpecki","Mochowo"]
[null,null,null,null,null,null,null,null,null,null,null,null,null,null,null,null,null,null,null,null,null,null,null,null,null,"sierpecki","Rościszewo"]
[null,null,null,null,null,null,null,null,null,null,null,null,null,null,null,null,null,null,null,null,null,null,null,null,null,"sierpecki","Sierpc"]
[null,null,null,null,null,null,null,null,null,null,null,null,null,null,null,null,null,null,null,null,null,null,null,null,null,"sierpecki","Szczutowo"]
[null,null,null,null,null,null,null,null,null,null,null,null,null,null,null,null,null,null,null,null,null,null,null,null,null,"sierpecki","Zawidz"]
[null,null,null,null,null,null,null,null,null,null,null,null,null,null,null,null,null,null,null,null,null,null,null,null,null,"Płock","Płock"]
[null,null,null,null,null,null,null,null,null,null,null,null,null,null,null,null,null,null,null,null,null,null,null,null,null,"garwoliński","Garwolin"]
[null,null,null,null,null,null,null,null,null,null,null,null,null,null,null,null,null,null,null,null,null,null,null,null,null,"garwoliński","Łaskarzew"]
[null,null,null,null,null,null,null,null,null,null,null,null,null,null,null,null,null,null,null,null,null,null,null,null,null,"garwoliński","Borowie"]
[null,null,null,null,null,null,null,null,null,null,null,null,null,null,null,null,null,null,null,null,null,null,null,null,null,"garwoliński","Garwolin"]
[null,null,null,null,null,null,null,null,null,null,null,null,null,null,null,null,null,null,null,null,null,null,null,null,null,"garwoliński","Górzno"]
[null,null,null,null,null,null,null,null,null,null,null,null,null,null,null,null,null,null,null,null,null,null,null,null,null,"garwoliński","Łaskarzew"]
[null,null,null,null,null,null,null,null,null,null,null,null,null,null,null,null,null,null,null,null,null,null,null,null,null,"garwoliński","Maciejowice"]
[null,null,null,null,null,null,null,null,null,null,null,null,null,null,null,null,null,null,null,null,null,null,null,null,null,"garwoliński","Miastków Kościelny"]
[null,null,null,null,null,null,null,null,null,null,null,null,null,null,null,null,null,null,null,null,null,null,null,null,null,"garwoliński","Parysów"]
[null,null,null,null,null,null,null,null,null,null,null,null,null,null,null,null,null,null,null,null,null,null,null,null,null,"garwoliński","Pilawa"]
[null,null,null,null,null,null,null,null,null,null,null,null,null,null,null,null,null,null,null,null,null,null,null,null,null,"garwoliński","Sobolew"]
[null,null,null,null,null,null,null,null,null,null,null,null,null,null,null,null,null,null,null,null,null,null,null,null,null,"garwoliński","Trojanów"]
[null,null,null,null,null,null,null,null,null,null,null,null,null,null,null,null,null,null,null,null,null,null,null,null,null,"garwoliński","Wilga"]
[null,null,null,null,null,null,null,null,null,null,null,null,null,null,null,null,null,null,null,null,null,null,null,null,null,"garwoliński","Żelechów"]
[null,null,null,null,null,null,null,null,null,null,null,null,null,null,null,null,null,null,null,null,null,null,null,null,null,"łosicki","Huszlew"]
[null,null,null,null,null,null,null,null,null,null,null,null,null,null,null,null,null,null,null,null,null,null,null,null,null,"łosicki","Łosice"]
[null,null,null,null,null,null,null,null,null,null,null,null,null,null,null,null,null,null,null,null,null,null,null,null,null,"łosicki","Olszanka"]
[null,null,null,null,null,null,null,null,null,null,null,null,null,null,null,null,null,null,null,null,null,null,null,null,null,"łosicki","Platerów"]
[null,null,null,null,null,null,null,null,null,null,null,null,null,null,null,null,null,null,null,null,null,null,null,null,null,"łosicki","Sarnaki"]
[null,null,null,null,null,null,null,null,null,null,null,null,null,null,null,null,null,null,null,null,null,null,null,null,null,"łosicki","Stara Kornica"]
[null,null,null,null,null,null,null,null,null,null,null,null,null,null,null,null,null,null,null,null,null,null,null,null,null,"siedlecki","Domanice"]
[null,null,null,null,null,null,null,null,null,null,null,null,null,null,null,null,null,null,null,null,null,null,null,null,null,"siedlecki","Korczew"]
[null,null,null,null,null,null,null,null,null,null,null,null,null,null,null,null,null,null,null,null,null,null,null,null,null,"siedlecki","Kotuń"]
[null,null,null,null,null,null,null,null,null,null,null,null,null,null,null,null,null,null,null,null,null,null,null,null,null,"siedlecki","Mokobody"]
[null,null,null,null,null,null,null,null,null,null,null,null,null,null,null,null,null,null,null,null,null,null,null,null,null,"siedlecki","Mordy"]
[null,null,null,null,null,null,null,null,null,null,null,null,null,null,null,null,null,null,null,null,null,null,null,null,null,"siedlecki","Paprotnia"]
[null,null,null,null,null,null,null,null,null,null,null,null,null,null,null,null,null,null,null,null,null,null,null,null,null,"siedlecki","Przesmyki"]
[null,null,null,null,null,null,null,null,null,null,null,null,null,null,null,null,null,null,null,null,null,null,null,null,null,"siedlecki","Siedlce"]
[null,null,null,null,null,null,null,null,null,null,null,null,null,null,null,null,null,null,null,null,null,null,null,null,null,"siedlecki","Skórzec"]
[null,null,null,null,null,null,null,null,null,null,null,null,null,null,null,null,null,null,null,null,null,null,null,null,null,"siedlecki","Suchożebry"]
[null,null,null,null,null,null,null,null,null,null,null,null,null,null,null,null,null,null,null,null,null,null,null,null,null,"siedlecki","Wiśniew"]
[null,null,null,null,null,null,null,null,null,null,null,null,null,null,null,null,null,null,null,null,null,null,null,null,null,"siedlecki","Wodynie"]
[null,null,null,null,null,null,null,null,null,null,null,null,null,null,null,null,null,null,null,null,null,null,null,null,null,"siedlecki","Zbuczyn"]
[null,null,null,null,null,null,null,null,null,null,null,null,null,null,null,null,null,null,null,null,null,null,null,null,null,"sokołowski","Sokołów Podlaski"]
[null,null,null,null,null,null,null,null,null,null,null,null,null,null,null,null,null,null,null,null,null,null,null,null,null,"sokołowski","Bielany"]
[null,null,null,null,null,null,null,null,null,null,null,null,null,null,null,null,null,null,null,null,null,null,null,null,null,"sokołowski","Ceranów"]
[null,null,null,null,null,null,null,null,null,null,null,null,null,null,null,null,null,null,null,null,null,null,null,null,null,"sokołowski","Jabłonna Lacka"]
[null,null,null,null,null,null,null,null,null,null,null,null,null,null,null,null,null,null,null,null,null,null,null,null,null,"sokołowski","Kosów Lacki"]
[null,null,null,null,null,null,null,null,null,null,null,null,null,null,null,null,null,null,null,null,null,null,null,null,null,"sokołowski","Repki"]
[null,null,null,null,null,null,null,null,null,null,null,null,null,null,null,null,null,null,null,null,null,null,null,null,null,"sokołowski","Sabnie"]
[null,null,null,null,null,null,null,null,null,null,null,null,null,null,null,null,null,null,null,null,null,null,null,null,null,"sokołowski","Sokołów Podlaski"]
[null,null,null,null,null,null,null,null,null,null,null,null,null,null,null,null,null,null,null,null,null,null,null,null,null,"sokołowski","Sterdyń"]
[null,null,null,null,null,null,null,null,null,null,null,null,null,null,null,null,null,null,null,null,null,null,null,null,null,"węgrowski","Węgrów"]
[null,null,null,null,null,null,null,null,null,null,null,null,null,null,null,null,null,null,null,null,null,null,null,null,null,"węgrowski","Grębków"]
[null,null,null,null,null,null,null,null,null,null,null,null,null,null,null,null,null,null,null,null,null,null,null,null,null,"węgrowski","Korytnica"]
[null,null,null,null,null,null,null,null,null,null,null,null,null,null,null,null,null,null,null,null,null,null,null,null,null,"węgrowski","Liw"]
[null,null,null,null,null,null,null,null,null,null,null,null,null,null,null,null,null,null,null,null,null,null,null,null,null,"węgrowski","Łochów"]
[null,null,null,null,null,null,null,null,null,null,null,null,null,null,null,null,null,null,null,null,null,null,null,null,null,"węgrowski","Miedzna"]
[null,null,null,null,null,null,null,null,null,null,null,null,null,null,null,null,null,null,null,null,null,null,null,null,null,"węgrowski","Sadowne"]
[null,null,null,null,null,null,null,null,null,null,null,null,null,null,null,null,null,null,null,null,null,null,null,null,null,"węgrowski","Stoczek"]
[null,null,null,null,null,null,null,null,null,null,null,null,null,null,null,null,null,null,null,null,null,null,null,null,null,"węgrowski","Wierzbno"]
[null,null,null,null,null,null,null,null,null,null,null,null,null,null,null,null,null,null,null,null,null,null,null,null,null,"Siedlce","Siedlce"]
[null,null,null,null,null,null,null,null,null,null,null,null,null,null,null,null,null,null,null,null,null,null,null,null,null,"grójecki","Belsk Duży"]
[null,null,null,null,null,null,null,null,null,null,null,null,null,null,null,null,null,null,null,null,null,null,null,null,null,"grójecki","Błędów"]
[null,null,null,null,null,null,null,null,null,null,null,null,null,null,null,null,null,null,null,null,null,null,null,null,null,"grójecki","Chynów"]
[null,null,null,null,null,null,null,null,null,null,null,null,null,null,null,null,null,null,null,null,null,null,null,null,null,"grójecki","Goszczyn"]
[null,null,null,null,null,null,null,null,null,null,null,null,null,null,null,null,null,null,null,null,null,null,null,null,null,"grójecki","Grójec"]
[null,null,null,null,null,null,null,null,null,null,null,null,null,null,null,null,null,null,null,null,null,null,null,null,null,"grójecki","Jasieniec"]
[null,null,null,null,null,null,null,null,null,null,null,null,null,null,null,null,null,null,null,null,null,null,null,null,null,"grójecki","Mogielnica"]
[null,null,null,null,null,null,null,null,null,null,null,null,null,null,null,null,null,null,null,null,null,null,null,null,null,"grójecki","Nowe Miasto nad Pilicą"]
[null,null,null,null,null,null,null,null,null,null,null,null,null,null,null,null,null,null,null,null,null,null,null,null,null,"grójecki","Pniewy"]
[null,null,null,null,null,null,null,null,null,null,null,null,null,null,null,null,null,null,null,null,null,null,null,null,null,"grójecki","Warka"]
[null,null,null,null,null,null,null,null,null,null,null,null,null,null,null,null,null,null,null,null,null,null,null,null,null,"sochaczewski","Sochaczew"]
[null,null,null,null,null,null,null,null,null,null,null,null,null,null,null,null,null,null,null,null,null,null,null,null,null,"sochaczewski","Brochów"]
[null,null,null,null,null,null,null,null,null,null,null,null,null,null,null,null,null,null,null,null,null,null,null,null,null,"sochaczewski","Iłów"]
[null,null,null,null,null,null,null,null,null,null,null,null,null,null,null,null,null,null,null,null,null,null,null,null,null,"sochaczewski","Młodzieszyn"]
[null,null,null,null,null,null,null,null,null,null,null,null,null,null,null,null,null,null,null,null,null,null,null,null,null,"sochaczewski","Nowa Sucha"]
[null,null,null,null,null,null,null,null,null,null,null,null,null,null,null,null,null,null,null,null,null,null,null,null,null,"sochaczewski","Rybno"]
[null,null,null,null,null,null,null,null,null,null,null,null,null,null,null,null,null,null,null,null,null,null,null,null,null,"sochaczewski","Sochaczew"]
[null,null,null,null,null,null,null,null,null,null,null,null,null,null,null,null,null,null,null,null,null,null,null,null,null,"sochaczewski","Teresin"]
[null,null,null,null,null,null,null,null,null,null,null,null,null,null,null,null,null,null,null,null,null,null,null,null,null,"żyrardowski","Żyrardów"]
[null,null,null,null,null,null,null,null,null,null,null,null,null,null,null,null,null,null,null,null,null,null,null,null,null,"żyrardowski","Mszczonów"]
[null,null,null,null,null,null,null,null,null,null,null,null,null,null,null,null,null,null,null,null,null,null,null,null,null,"żyrardowski","Puszcza Mariańska"]
[null,null,null,null,null,null,null,null,null,null,null,null,null,null,null,null,null,null,null,null,null,null,null,null,null,"żyrardowski","Radziejowice"]
[null,null,null,null,null,null,null,null,null,null,null,null,null,null,null,null,null,null,null,null,null,null,null,null,null,"żyrardowski","Wiskitki"]

{"sheet":"Annex 3 - PKD code classificati","index":4,"n_rows":1655,"n_cols":5,"rows_kept":1655,"cut":false,"hidden":false,"merged":[]}
[null,"PKD code classification"]
[]
[null,"Symbol","Name"]
[null,"01","A","2","CROP AND ANIMAL PRODUCTION, HUNTING, INCLUDING SERVICE ACTIVITIES"]
[null,"01.1","A","3","Growing of non-perennial crops"]
[null,"01.11","A","4","Growing of cereals, leguminous crops and oil plants, for seeds, except rice"]
[null,"01.11.Z","A","5","Growing of cereals, leguminous crops and oil plants, for seeds, except rice"]
[null,"01.12","A","4","Growing of rice"]
[null,"01.12.Z","A","5","Growing of rice"]
[null,"01.13","A","4","Growing of vegetables, including melons, and growing of roots and tubers"]
[null,"01.13.Z","A","5","Growing of vegetables, including melons, and of roots and tubers"]
[null,"01.14","A","4","Growing of sugar cane"]
[null,"01.14.Z","A","5","Growing of sugar cane"]
[null,"01.15","A","4","Growing of tobacco"]
[null,"01.15.Z","A","5","Growing of tobacco"]
[null,"01.16","A","4","Growing of fibre crops"]
[null,"01.16.Z","A","5","Growing of fibre crops"]
[null,"01.19","A","4","Growing of other non-perennial crops"]
[null,"01.19.Z","A","5","Growing of other non-perennial crops"]
[null,"01.2","A","3","Growing of perennial crops"]
[null,"01.21","A","4","Growing of grapes"]
[null,"01.21.Z","A","5","Growing of grapes"]
[null,"01.22","A","4","Growing of tree and bush tropical and subtropical fruits"]
[null,"01.22.Z","A","5","Growing of tree and bush tropical and subtropical fruits"]
[null,"01.23","A","4","Growing of  tree and bush citrus fruits"]
[null,"01.23.Z","A","5","Growing of  tree and bush citrus fruits"]
[null,"01.24","A","4","Growing of  tree and bush pome fruits and stone fruits"]
[null,"01.24.Z","A","5","Growing of  tree and bush pome fruits and stone fruits"]
[null,"01.25","A","4","Growing of other tree and bush fruits and nuts"]
[null,"01.25.Z","A","5","Growing of other tree and bush fruits and nuts"]
[null,"01.26","A","4","Growing of tree oleaginous fruits"]
[null,"01.26.Z","A","5","Growing of  tree oleaginous fruits"]
[null,"01.27","A","4","Growing of beverage crops"]
[null,"01.27.Z","A","5","Growing of beverage crops"]
[null,"01.28","A","4","Growing of spices, aromatic, drug and pharmaceutical crops"]
[null,"01.28.Z","A","5","Growing of spices, aromatic, drug and pharmaceutical crops"]
[null,"01.29","A","4","Growing of other perennial crops"]
[null,"01.29.Z","A","5","Growing of other perennial crops"]
[null,"01.3","A","3","Plant propagation"]
[null,"01.30","A","4","Plant propagation"]
[null,"01.30.Z","A","5","Plant propagation"]
[null,"01.4","A","3","Animal production"]
[null,"01.41","A","4","Raising of dairy cattle"]
[null,"01.41.Z","A","5","Raising of dairy cattle"]
[null,"01.42","A","4","Raising of other cattle and buffaloes"]
[null,"01.42.Z","A","5","Raising of other cattle and buffaloes"]
[null,"01.43","A","4","Raising of horses and other equines"]
[null,"01.43.Z","A","5","Raising of horses and other equines"]
[null,"01.44","A","4","Raising of camels and camelids"]
[null,"01.44.Z","A","5","Raising of camels and camelids"]
[null,"01.45","A","4","Raising of sheep and goats"]
[null,"01.45.Z","A","5","Raising of sheep and goats"]
[null,"01.46","A","4","Raising of swine/pigs"]
[null,"01.46.Z","A","5","Raising of swine/pigs"]
[null,"01.47","A","4","Raising of poultry"]
[null,"01.47.Z","A","5","Raising of poultry"]
[null,"01.49","A","4","Raising of other animals"]
[null,"01.49.Z","A","5","Raising of other animals"]
[null,"01.5","A","3","Agricultural cultivation together with raising of animals (mixed activity)"]
[null,"01.50","A","4","Agricultural cultivation together with raising of animals (mixed activity)"]
[null,"01.50.Z","A","5","Agricultural cultivation together with raising of animals (mixed activity)"]
[null,"01.6","A","3","Support activities to agriculture and post-harvest crop activities"]
[null,"01.61","A","4","Support activities for crop production"]
[null,"01.61.Z","A","5","Support activities for crop production"]
[null,"01.62","A","4","Support activities for farm animal production"]
[null,"01.62.Z","A","5","Support activities for farm animal production"]
[null,"01.63","A","4","Post-harvest crop activities"]
[null,"01.63.Z","A","5","Post-harvest crop activities"]
[null,"01.64","A","4","Seed processing for propagation"]
[null,"01.64.Z","A","5","Seed processing for propagation"]
[null,"01.7","A","3","Hunting and acquiring of hunting animals, including service activity"]
[null,"01.70","A","4","Hunting and acquiring of hunting animals, including service activity"]
[null,"01.70.Z","A","5","Hunting and acquiring of hunting animals, including service activity"]
[null,"02","A","2","FORESTRY AND LOGGING"]
[null,"02.1","A","3","Silviculture and other forestry activities, excluding gathering of forestry products"]
[null,"02.10","A","4","Silviculture and other forestry activities, excluding gathering of forestry products"]
[null,"02.10.Z","A","5","Silviculture and other forestry activities, excluding gathering of forestry products"]
[null,"02.2","A","3","Logging"]
[null,"02.20","A","4","Logging"]
[null,"02.20.Z","A","5","Logging"]
[null,"02.3","A","3","Gathering of wild growing forestry products, excluding wood "]
[null,"02.30","A","4","Gathering of wild growing forestry products, excluding wood "]
[null,"02.30.Z","A","5","Gathering of wild growing forestry products, excluding wood "]
[null,"02.4","A","3","Service activity related to forestry"]
[null,"02.40","A","4","Service activity related to forestry"]
[null,"02.40.Z","A","5","Service activity related to forestry"]
[null,"03","A","2","FISHING AND AQUACULTURE"]
[null,"03.1","A","3","Fishing"]
[null,"03.11","A","4","Marine fishing"]
[null,"03.11.Z","A","5","Marine fishing"]
[null,"03.12","A","4","Freshwater fishing"]
[null,"03.12.Z","A","5","Freshwater fishing"]
[null,"03.2","A","3","Aquaculture"]
[null,"03.21","A","4","Marine aquaculture"]
[null,"03.21.Z","A","5","Marine aquaculture"]
[null,"03.22","A","4","Freshwater aquaculture"]
[null,"03.22.Z","A","5","Freshwater aquaculture"]
[null,"B","B","1","MINING AND QUARRYING"]
[null,"05","B","2","MINING OF COAL AND LIGNITE"]
[null,"05.1","B","3","Mining of hard coal"]
[null,"05.10","B","4","Mining of hard coal"]
[null,"05.10.Z","B","5","Mining of hard coal"]
[null,"05.2","B","3","Mining of lignite"]
[null,"05.20","B","4","Mining of lignite"]
[null,"05.20.Z","B","5","Mining of lignite"]
[null,"06","B","2","EXTRACTION OF CRUDE PETROLEUM AND NATURAL GAS"]
[null,"06.1","B","3","Extraction of crude petroleum"]
[null,"06.10","B","4","Extraction of crude petroleum"]
[null,"06.10.Z","B","5","Extraction of crude petroleum"]
[null,"06.2","B","3","Extraction of natural gas"]
[null,"06.20","B","4","Extraction of natural gas"]
[null,"06.20.Z","B","5","Extraction of natural gas"]
[null,"07","B","2","MINING OF METAL ORES"]
[null,"07.1","B","3","Mining of iron ores"]
[null,"07.10","B","4","Mining of iron ores"]
[null,"07.10.Z","B","5","Mining of iron ores"]
[null,"07.2","B","3","Mining of non-ferrous metal ores"]
[null,"07.21","B","4","Mining of uranium and thorium ores"]
[null,"07.21.Z","B","5","Mining of uranium and thorium ores"]
[null,"07.29","B","4","Mining of other non-ferrous metal ores"]
[null,"07.29.Z","B","5","Mining of other non-ferrous metal ores"]
[null,"08","B","2","OTHER MINING AND QUARRYING"]
[null,"08.1","B","3","Quarrying of stone, sand and clay"]
[null,"08.11","B","4","Quarrying of ornamental and building stone, limestone, gypsum, chalk and slate"]
[null,"08.11.Z","B","5","Quarrying of ornamental and building stone, limestone, gypsum, chalk and slate"]
[null,"08.12","B","4","Operation of gravel and sand pits; mining of clays and kaolin"]
[null,"08.12.Z","B","5","Operation of gravel and sand pits; mining of clays and kaolin"]
[null,"08.9","B","3","Mining and quarrying not elsewhere classified"]
[null,"08.91","B","4","Mining of minerals for chemical industry and for production of fertilizers"]
[null,"08.91.Z","B","5","Mining of minerals for chemical industry and for production of fertilizers"]
[null,"08.92","B","4","Extraction of peat"]
[null,"08.92.Z","B","5","Extraction of peat"]
[null,"08.93","B","4","Extraction of salt"]
[null,"08.93.Z","B","5","Extraction of salt"]
[null,"08.99","B","4","Other mining and quarrying not elsewhere classified"]
[null,"08.99.Z","B","5","Other mining and quarrying not elsewhere classified"]
[null,"09","B","2","MINING AND QUARRYING SUPPORT SERVICE ACTIVITIES"]
[null,"09.1","B","3","Support activities for petroleum and natural gas extraction"]
[null,"09.10","B","4","Support activities for petroleum and natural gas extraction"]
[null,"09.10.Z","B","5","Support activities for petroleum and natural gas extraction"]
[null,"09.9","B","3","Support activities for other mining and quarrying"]
[null,"09.90","B","4","Support activities for other mining and quarrying"]
[null,"09.90.Z","B","5","Support activities for other mining and quarrying"]
[null,"C","C","1","MANUFACTURING"]
[null,"10","C","2","MANUFACTURE OF FOOD PRODUCTS"]
[null,"10.1","C","3","Processing and preserving of meat and production of meat products"]
[null,"10.11","C","4","Processing and preserving of meat, excluding poultry meat"]
[null,"10.11.Z","C","5","Processing and preserving of meat, excluding poultry meat"]
[null,"10.12","C","4","Processing and preserving of poultry meat"]
[null,"10.12.Z","C","5","Processing and preserving of poultry meat"]
[null,"10.13","C","4","Production of meat products, including poultry meat products"]
[null,"10.13.Z","C","5","Production of meat products, including poultry meat products"]
[null,"10.2","C","3","Processing and preserving of fish, crustaceans and molluscs"]
[null,"10.20","C","4","Processing and preserving of fish, crustaceans and molluscs"]
[null,"10.20.Z","C","5","Processing and preserving of fish, crustaceans and molluscs"]
[null,"10.3","C","3","Processing and preserving of fruit and vegetables"]
[null,"10.31","C","4","Processing and preserving of potatoes"]
[null,"10.31.Z","C","5","Processing and preserving of potatoes"]
[null,"10.32","C","4","Manufacture of fruit and vegetable juice"]
[null,"10.32.Z","C","5","Manufacture of fruit and vegetable juice"]
[null,"10.39","C","4","Other processing and preserving of fruit and vegetables"]
[null,"10.39.Z","C","5","Other processing and preserving of fruit and vegetables"]
[null,"10.4","C","3","Manufacture of vegetable and animal oils and fats"]
[null,"10.41","C","4","Manufacture of oils and other fluid fats"]
[null,"10.41.Z","C","5","Manufacture of oils and other fluid fats"]
[null,"10.42","C","4","Manufacture of margarine and similar edible fats"]
[null,"10.42.Z","C","5","Manufacture of margarine and similar edible fats"]
[null,"10.5","C","3","Manufacture of dairy products"]
[null,"10.51","C","4","Operation of dairies and cheese making"]
[null,"10.51.Z","C","5","Operation of dairies and cheese making"]
[null,"10.52","C","4","Manufacture of ice cream"]
[null,"10.52.Z","C","5","Manufacture of ice cream"]
[null,"10.6","C","3","Manufacture of grain mill products, starches and starch products"]
[null,"10.61","C","4","Manufacture of grain mill products"]
[null,"10.61.Z","C","5","Manufacture of grain mill products"]
[null,"10.62","C","4","Manufacture of starches and starch products"]
[null,"10.62.Z","C","5","Manufacture of starches and starch products"]
[null,"10.7","C","3","Manufacture of bakery and farinaceous products"]
[null,"10.71","C","4","Manufacture of bread; manufacture of fresh pastry goods and cakes"]
[null,"10.71.Z","C","5","Manufacture of bread; manufacture of fresh pastry goods and cakes"]
[null,"10.72","C","4","Manufacture of rusks and biscuits; manufacture of preserved pastry goods and cakes"]
[null,"10.72.Z","C","5","Manufacture of rusks and biscuits; manufacture of preserved pastry goods and cakes"]
[null,"10.73","C","4","Manufacture of macaroni, noodles, couscous and similar farinaceous products"]
[null,"10.73.Z","C","5","Manufacture of macaroni, noodles, couscous and similar farinaceous products"]
[null,"10.8","C","3","Manufacture of other food products"]
[null,"10.81","C","4","Manufacture of sugar"]
[null,"10.81.Z","C","5","Manufacture of sugar"]
[null,"10.82","C","4","Manufacture of cocoa, chocolate and sugar confectionery"]
[null,"10.82.Z","C","5","Manufacture of cocoa, chocolate and sugar confectionery"]
[null,"10.83","C","4","Processing of tea and coffee"]
[null,"10.83.Z","C","5","Processing of tea and coffee"]
[null,"10.84","C","4","Manufacture of condiments and seasonings"]
[null,"10.84.Z","C","5","Manufacture of condiments and seasonings"]
[null,"10.85","C","4","Manufacture of prepared meals and dishes"]
[null,"10.85.Z","C","5","Manufacture of prepared meals and dishes"]
[null,"10.86","C","4","Manufacture of homogenised food preparations and dietetic food"]
[null,"10.86.Z","C","5","Manufacture of homogenised food preparations and dietetic food"]
[null,"10.89","C","4","Manufacture of other food products not elsewhere classified"]
[null,"10.89.Z","C","5","Manufacture of other food products not elsewhere classified"]
[null,"10.9","C","3","Manufacture of prepared animal feeds"]
[null,"10.91","C","4","Manufacture of prepared feeds for farm animals"]
[null,"10.91.Z","C","5","Manufacture of prepared feeds for farm animals"]
[null,"10.92","C","4","Manufacture of prepared pet foods"]
[null,"10.92.Z","C","5","Manufacture of prepared pet foods"]
[null,"11","C","2","MANUFACTURE OF BEVERAGES"]
[null,"11.0","C","3","Manufacture of beverages"]
[null,"11.01","C","4","Distilling, rectifying and blending of spirits"]
[null,"11.01.Z","C","5","Distilling, rectifying and blending of spirits"]
[null,"11.02","C","4","Manufacture of wine from grape"]
[null,"11.02.Z","C","5","Manufacture of wine from grape"]
[null,"11.03","C","4","Manufacture of cider and other fruit wines"]
[null,"11.03.Z","C","5","Manufacture of cider and other fruit wines"]
[null,"11.04","C","4","Manufacture of other non-distilled fermented beverages"]
[null,"11.04.Z","C","5","Manufacture of other non-distilled fermented beverages"]
[null,"11.05","C","4","Manufacture of beer"]
[null,"11.05.Z","C","5","Manufacture of beer"]
[null,"11.06","C","4","Manufacture of malt"]
[null,"11.06.Z","C","5","Manufacture of malt"]
[null,"11.07","C","4","Manufacture of soft drinks; production of mineral waters and other bottled waters"]
[null,"11.07.Z","C","5","Manufacture of soft drinks; production of mineral waters and other bottled waters"]
[null,"12","C","2","MANUFACTURE OF TOBACCO PRODUCTS"]
[null,"12.0","C","3","Manufacture of tobacco products"]
[null,"12.00","C","4","Manufacture of tobacco products"]
[null,"12.00.Z","C","5","Manufacture of tobacco products"]
[null,"13","C","2","MANUFACTURE OF TEXTILES"]
[null,"13.1","C","3","Preparation and spinning of textile fibres"]
[null,"13.10","C","4","Preparation and spinning of textile fibres"]
[null,"13.10.A","C","5","Manufacture of cotton yarn"]
[null,"13.10.B","C","5","Manufacture of wool yarn"]
[null,"13.10.C","C","5","Manufacture of man-made fibres yarn"]
[null,"13.10.D","C","5","Manufacture of yarn from other textile fibres, including manufacture of sewing thread"]
[null,"13.2","C","3","Manufacture of woven fabrics"]
[null,"13.20","C","4","Manufacture of woven fabrics"]
[null,"13.20.A","C","5","Manufacture of cotton woven fabrics"]
[null,"13.20.B","C","5","Manufacture of wool woven fabrics"]
[null,"13.20.C","C","5","Manufacture of man-made woven fabrics"]
[null,"13.20.D","C","5","Manufacture of other woven fabrics"]
[null,"13.3","C","3","Finishing of textiles"]
[null,"13.30","C","4","Finishing of textiles"]
[null,"13.30.Z","C","5","Finishing of textiles"]
[null,"13.9","C","3","Manufacture of other textiles"]
[null,"13.91","C","4","Manufacture of knitted and crocheted fabrics"]
[null,"13.91.Z","C","5","Manufacture of knitted and crocheted fabrics"]
[null,"13.92","C","4","Manufacture of made-up textile articles"]
[null,"13.92.Z","C","5","Manufacture of made-up textile articles"]
[null,"13.93","C","4","Manufacture of carpets and rugs"]
[null,"13.93.Z","C","5","Manufacture of carpets and rugs"]
[null,"13.94","C","4","Manufacture of cordage, rope, twine and netting"]
[null,"13.94.Z","C","5","Manufacture of cordage, rope, twine and netting"]
[null,"13.95","C","4","Manufacture of non-wovens and articles made from non-wovens, except apparel"]
[null,"13.95.Z","C","5","Manufacture of non-wovens and articles made from non-wovens, except apparel"]
[null,"13.96","C","4","Manufacture of other technical and industrial textiles"]
[null,"13.96.Z","C","5","Manufacture of other technical and industrial textiles"]
[null,"13.99","C","4","Manufacture of other textiles not elsewhere classified"]
[null,"13.99.Z","C","5","Manufacture of other textiles not elsewhere classified"]
[null,"14","C","2","MANUFACTURE OF WEARING APPAREL"]
[null,"14.1","C","3","Manufacture of wearing apparel, except fur apparel"]
[null,"14.11","C","4","Manufacture of leather clothes"]
[null,"14.11.Z","C","5","Manufacture of leather clothes"]
[null,"14.12","C","4","Manufacture of workwear"]
[null,"14.12.Z","C","5","Manufacture of workwear"]
[null,"14.13","C","4","Manufacture of other outerwear"]
[null,"14.13.Z","C","5","Manufacture of other outerwear"]
[null,"14.14","C","4","Manufacture of underwear"]
[null,"14.14.Z","C","5","Manufacture of underwear"]
[null,"14.19","C","4","Manufacture of other wearing apparel and accessories"]
[null,"14.19.Z","C","5","Manufacture of other wearing apparel and accessories"]
[null,"14.2","C","3","Manufacture of articles of fur"]
[null,"14.20","C","4","Manufacture of articles of fur"]
[null,"14.20.Z","C","5","Manufacture of articles of fur"]
[null,"14.3","C","3","Manufacture of knitted and crocheted apparel"]
[null,"14.31","C","4","Manufacture of knitted and crocheted hosiery"]
[null,"14.31.Z","C","5","Manufacture of knitted and crocheted hosiery"]
[null,"14.39","C","4","Manufacture of other knitted and crocheted apparel"]
[null,"14.39.Z","C","5","Manufacture of other knitted and crocheted apparel"]
[null,"15","C","2","MANUFACTURE OF LEATHER AND RELATED PRODUCTS"]
[null,"15.1","C","3","Tanning and dressing of leather; dressing and dyeing of fur; manufacture of luggage, handbags and similar leather goods; manufacture of saddlery"]
[null,"15.11","C","4","Tanning and dressing of leather; dressing and dyeing of fur"]
[null,"15.11.Z","C","5","Tanning and dressing of leather; dressing and dyeing of fur"]
[null,"15.12","C","4","Manufacture of luggage, handbags and similar leather goods; manufacture of saddlery "]
[null,"15.12.Z","C","5","Manufacture of luggage, handbags and similar leather goods; manufacture of saddlery"]
[null,"15.2","C","3","Manufacture of footwear"]
[null,"15.20","C","4","Manufacture of footwear"]
[null,"15.20.Z","C","5","Manufacture of footwear"]
[null,"16","C","2","MANUFACTURE OF PRODUCTS OF WOOD AND CORK, EXCEPT FURNITURE; MANUFACTURE OF ARTICLES OF STRAW AND PLAITING MATERIALS"]
[null,"16.1","C","3","Sawmilling and planing of wood"]
[null,"16.10","C","4","Sawmilling and planing of wood"]
[null,"16.10.Z","C","5","Sawmilling and planing of wood"]
[null,"16.2","C","3","Manufacture of products of wood, cork, straw and plaiting materials"]
[null,"16.21","C","4","Manufacture of veneer sheets and wood-based panels"]
[null,"16.21.Z","C","5","Manufacture of veneer sheets and wood-based panels"]
[null,"16.22","C","4","Manufacture of assembled parquet floors"]
[null,"16.22.Z","C","5","Manufacture of assembled parquet floors"]
[null,"16.23","C","4","Manufacture of other builders' carpentry and joinery"]
[null,"16.23.Z","C","5","Manufacture of other builders' carpentry and joinery"]
[null,"16.24","C","4","Manufacture of wooden containers"]
[null,"16.24.Z","C","5","Manufacture of wooden containers"]
[null,"16.29","C","4","Manufacture of other products of wood; manufacture of articles of cork, straw and plaiting materials"]
[null,"16.29.Z","C","5","Manufacture of other products of wood; manufacture of articles of cork, straw and plaiting materials"]
[null,"17","C","2","MANUFACTURE OF PAPER AND PAPER PRODUCTS"]
[null,"17.1","C","3","Manufacture of pulp, paper and paperboard"]
[null,"17.11","C","4","Manufacture of pulp"]
[null,"17.11.Z","C","5","Manufacture of pulp"]
[null,"17.12","C","4","Manufacture of paper and paperboard"]
[null,"17.12.Z","C","5","Manufacture of paper and paperboard"]
[null,"17.2","C","3","Manufacture of articles of paper and paperboard "]
[null,"17.21","C","4","Manufacture of corrugated paper and paperboard and of containers of paper and paperboard"]
[null,"17.21.Z","C","5","Manufacture of corrugated paper and paperboard and of containers of paper and paperboard"]
[null,"17.22","C","4","Manufacture of household and sanitary goods and of toilet requisites"]
[null,"17.22.Z","C","5","Manufacture of household and sanitary goods and of toilet requisites"]
[null,"17.23","C","4","Manufacture of paper stationery"]
[null,"17.23.Z","C","5","Manufacture of paper stationery"]
[null,"17.24","C","4","Manufacture of wallpaper"]
[null,"17.24.Z","C","5","Manufacture of wallpaper"]
[null,"17.29","C","4","Manufacture of other articles of paper and paperboard"]
[null,"17.29.Z","C","5","Manufacture of other articles of paper and paperboard"]
[null,"18","C","2","PRINTING AND REPRODUCTION OF RECORDED MEDIA"]
[null,"18.1","C","3","Printing and service activities related to printing"]
[null,"18.11","C","4","Printing of newspapers"]
[null,"18.11.Z","C","5","Printing of newspapers"]
[null,"18.12","C","4","Other printing"]
[null,"18.12.Z","C","5","Other printing"]
[null,"18.13","C","4","Pre-press and pre-media services"]
[null,"18.13.Z","C","5","Pre-press and pre-media services"]
[null,"18.14","C","4","Binding and related services"]
[null,"18.14.Z","C","5","Binding and related services"]
[null,"18.2","C","3","Reproduction of recorded media"]
[null,"18.20","C","4","Reproduction of recorded media"]
[null,"18.20.Z","C","5","Reproduction of recorded media"]
[null,"19","C","2","MANUFACTURE AND PROCESSING OF COKE AND REFINED  PETROLEUM PRODUCTS"]
[null,"19.1","C","3","Manufacture and processing of coke"]
[null,"19.10","C","4","Manufacture and processing of coke"]
[null,"19.10.Z","C","5","Manufacture and processing of coke"]
[null,"19.2","C","3","Manufacture and processing of refind petroleum products"]
[null,"19.20","C","4","Manufacture and processing of refind petroleum products"]
[null,"19.20.Z","C","5","Manufacture and processing of refind petroleum products"]
[null,"20","C","2","MANUFACTURE OF CHEMICALS AND CHEMICAL PRODUCTS"]
[null,"20.1","C","3","Manufacture of basic chemicals, fertilisers and nitrogen compounds, plastics and synthetic rubber in primary forms"]
[null,"20.11","C","4","Manufacture of industrial gases"]
[null,"20.11.Z","C","5","Manufacture of industrial gases"]
[null,"20.12","C","4","Manufacture of dyes and pigments"]
[null,"20.12.Z","C","5","Manufacture of dyes and pigments"]
[null,"20.13","C","4","Manufacture of other inorganic basic chemicals"]
[null,"20.13.Z","C","5","Manufacture of other inorganic basic chemicals"]
[null,"20.14","C","4","Manufacture of other organic basic chemicals"]
[null,"20.14.Z","C","5","Manufacture of other organic basic chemicals"]
[null,"20.15","C","4","Manufacture of fertilisers and nitrogen compounds"]
[null,"20.15.Z","C","5","Manufacture of fertilisers and nitrogen compounds"]
[null,"20.16","C","4","Manufacture of plastics in primary forms"]
[null,"20.16.Z","C","5","Manufacture of plastics in primary forms"]
[null,"20.17","C","4","Manufacture of synthetic rubber in primary forms"]
[null,"20.17.Z","C","5","Manufacture of synthetic rubber in primary forms"]
[null,"20.2","C","3","Manufacture of pesticides and other agrochemical products"]
[null,"20.20","C","4","Manufacture of pesticides and other agrochemical products"]
[null,"20.20.Z","C","5","Manufacture of pesticides and other agrochemical products"]
[null,"20.3","C","3","Manufacture of paints, varnishes and similar coatings, printing ink and mastics"]
[null,"20.30","C","4","Manufacture of paints, varnishes and similar coatings, printing ink and mastics"]
[null,"20.30.Z","C","5","Manufacture of paints, varnishes and similar coatings, printing ink and mastics"]
[null,"20.4","C","3","Manufacture of soap and detergents, cleaning and polishing preparations, perfumes and toilet preparations"]
[null,"20.41","C","4","Manufacture of soap and detergents, cleaning and polishing preparations"]
[null,"20.41.Z","C","5","Manufacture of soap and detergents, cleaning and polishing preparations"]
[null,"20.42","C","4","Manufacture of perfumes and toilet preparations"]
[null,"20.42.Z","C","5","Manufacture of perfumes and toilet preparations"]
[null,"20.5","C","3","Manufacture of other chemical products"]
[null,"20.51","C","4","Manufacture of explosives"]
[null,"20.51.Z","C","5","Manufacture of explosives"]
[null,"20.52","C","4","Manufacture of glues"]
[null,"20.52.Z","C","5","Manufacture of glues"]
[null,"20.53","C","4","Manufacture of essential oils"]
[null,"20.53.Z","C","5","Manufacture of essential oils"]
[null,"20.59","C","4","Manufacture of other chemical products not elsewhere classified "]
[null,"20.59.Z","C","5","Manufacture of other chemical products not elsewhere classified "]
[null,"20.6","C","3","Manufacture of man-made fibres"]
[null,"20.60","C","4","Manufacture of man-made fibres"]
[null,"20.60.Z","C","5","Manufacture of man-made fibres"]
[null,"21","C","2","MANUFACTURE OF BASIC PHARMACEUTICAL SUBSTANCES AND MEDICINES AND OTHER PHARMACEUTICAL PRODUCTS"]
[null,"21.1","C","3","Manufacture of basic pharmaceutical substances"]
[null,"21.10","C","4","Manufacture of basic pharmaceutical substances"]
[null,"21.10.Z","C","5","Manufacture of basic pharmaceutical substances"]
[null,"21.2","C","3","Manufacture of  medicines and other pharmaceutical products"]
[null,"21.20","C","4","Manufacture of  medicines and other pharmaceutical products"]
[null,"21.20.Z","C","5","Manufacture of  medicines and other pharmaceutical products"]
[null,"22","C","2","MANUFACTURE OF RUBBER AND PLASTIC PRODUCTS"]
[null,"22.1","C","3","Manufacture of rubber products"]
[null,"22.11","C","4","Manufacture of rubber tyres and tubes; retreading and rebuilding of rubber tyres"]
[null,"22.11.Z","C","5","Manufacture of rubber tyres and tubes; retreading and rebuilding of rubber tyres"]
[null,"22.19","C","4","Manufacture of other rubber products"]
[null,"22.19.Z","C","5","Manufacture of other rubber products"]
[null,"22.2","C","3","Manufacture of plastic products"]
[null,"22.21","C","4","Manufacture of plastic plates, sheets, tubes and profiles"]
[null,"22.21.Z","C","5","Manufacture of plastic plates, sheets, tubes and profiles"]
[null,"22.22","C","4","Manufacture of plastic packing goods"]
[null,"22.22.Z","C","5","Manufacture of plastic packing goods"]
[null,"22.23","C","4","Manufacture of builders’ ware of plastic"]
[null,"22.23.Z","C","5","Manufacture of builders’ ware of plastic"]
[null,"22.29","C","4","Manufacture of other plastic products"]
[null,"22.29.Z","C","5","Manufacture of other plastic products"]
[null,"23","C","2","MANUFACTURE OF OTHER NON-METALLIC MINERAL PRODUCTS"]
[null,"23.1","C","3","Manufacture of glass and glass products"]
[null,"23.11","C","4","Manufacture of flat glass"]
[null,"23.11.Z","C","5","Manufacture of flat glass"]
[null,"23.12","C","4","Shaping and processing of flat glass"]
[null,"23.12.Z","C","5","Shaping and processing of flat glass"]
[null,"23.13","C","4","Manufacture of hollow glass"]
[null,"23.13.Z","C","5","Manufacture of hollow glass"]
[null,"23.14","C","4","Manufacture of glass fibres"]
[null,"23.14.Z","C","5","Manufacture of glass fibres"]
[null,"23.19","C","4","Manufacture and processing of other glass, including technical glassware"]
[null,"23.19.Z","C","5","Manufacture and processing of other glass, including technical glassware"]
[null,"23.2","C","3","Manufacture of refractory products"]
[null,"23.20","C","4","Manufacture of refractory products"]
[null,"23.20.Z","C","5","Manufacture of refractory products"]
[null,"23.3","C","3","Manufacture of ceramic building materials"]
[null,"23.31","C","4","Manufacture of ceramic tiles and flags"]
[null,"23.31.Z","C","5","Manufacture of ceramic tiles and flags"]
[null,"23.32","C","4","Manufacture of bricks, tiles and construction products, in baked clay"]
[null,"23.32.Z","C","5","Manufacture of bricks, tiles and construction products, in baked clay"]
[null,"23.4","C","3","Manufacture of other porcelain and ceramic products"]
[null,"23.41","C","4","Manufacture of ceramic tableware and ornamental articles"]
[null,"23.41.Z","C","5","Manufacture of ceramic tableware and ornamental articles"]
[null,"23.42","C","4","Manufacture of ceramic sanitary fixtures"]
[null,"23.42.Z","C","5","Manufacture of ceramic sanitary fixtures"]
[null,"23.43","C","4","Manufacture of ceramic insulators and hollow insulators "]
[null,"23.43.Z","C","5","Manufacture of ceramic insulators and hollow insulators "]
[null,"23.44","C","4","Manufacture of other technical ceramic products"]
[null,"23.44.Z","C","5","Manufacture of other technical ceramic products"]
[null,"23.49","C","4","Manufacture of other ceramic products"]
[null,"23.49.Z","C","5","Manufacture of other ceramic products"]
[null,"23.5","C","3","Manufacture of cement, lime and plaster"]
[null,"23.51","C","4","Manufacture of cement"]
[null,"23.51.Z","C","5","Manufacture of cement"]
[null,"23.52","C","4","Manufacture of lime and plaster"]
[null,"23.52.Z","C","5","Manufacture of lime and plaster"]
[null,"23.6","C","3","Manufacture of articles of concrete, cement and plaster"]
[null,"23.61","C","4","Manufacture of concrete products for construction purposes"]
[null,"23.61.Z","C","5","Manufacture of concrete products for construction purposes"]
[null,"23.62","C","4","Manufacture of plaster products for construction purposes"]
[null,"23.62.Z","C","5","Manufacture of plaster products for construction purposes"]
[null,"23.63","C","4","Manufacture of ready-mixed concrete"]
[null,"23.63.Z","C","5","Manufacture of ready-mixed concrete"]
[null,"23.64","C","4","Manufacture of mortars"]
[null,"23.64.Z","C","5","Manufacture of mortars"]
[null,"23.65","C","4","Manufacture of fibre cement"]
[null,"23.65.Z","C","5","Manufacture of fibre cement"]
[null,"23.69","C","4","Manufacture of other articles of concrete, plaster and cement"]
[null,"23.69.Z","C","5","Manufacture of other articles of concrete, plaster and cement"]
[null,"23.7","C","3","Cutting, shaping and finishing of stone"]
[null,"23.70","C","4","Cutting, shaping and finishing of stone"]
[null,"23.70.Z","C","5","Cutting, shaping and finishing of stone"]
[null,"23.9","C","3","Manufacture of abrasive products and others non-metallic mineral products not elsewhere classified "]
[null,"23.91","C","4","Production of abrasive products"]
[null,"23.91.Z","C","5","Production of abrasive products"]
[null,"23.99","C","4","Manufacture of abrasive products and others non-metallic mineral products not elsewhere classified "]
[null,"23.99.Z","C","5","Manufacture of abrasive products and others non-metallic mineral products not elsewhere classified "]
[null,"24","C","2","MANUFACTURE OF METALS"]
[null,"24.1","C","3","Manufacture of pig iron, ferro-alloys, basic iron and steel and metallurgic articles"]
[null,"24.10","C","4","Manufacture of pig iron, ferro-alloys, basic iron and steel and metallurgic articles"]
[null,"24.10.Z","C","5","Manufacture of pig iron, ferro-alloys, basic iron and steel and metallurgic articles"]
[null,"24.2","C","3","Manufacture of tubes and pipes, conduits, closed sections and connectors, of steel"]
[null,"24.20","C","4","Manufacture of tubes and pipes, conduits, closed sections and connectors, of steel"]
[null,"24.20.Z","C","5","Manufacture of tubes and pipes, conduits, closed sections and connectors, of steel"]
[null,"24.3","C","3","Manufacture of other products of first processing of steel"]
[null,"24.31","C","4","Cold drawing of bars"]
[null,"24.31.Z","C","5","Cold drawing of bars"]
[null,"24.32","C","4","Cold rolling of narrow strip"]
[null,"24.32.Z","C","5","Cold rolling of narrow strip"]
[null,"24.33","C","4","Manufacture of cold forming products"]
[null,"24.33.Z","C","5","Manufacture of cold forming products"]
[null,"24.34","C","4","Manufacture of wire"]
[null,"24.34.Z","C","5","Manufacture of wire"]
[null,"24.4","C","3","Manufacture of precious metals and other non-ferrous metals"]
[null,"24.41","C","4","Precious metals production"]
[null,"24.41.Z","C","5","Precious metals production"]
[null,"24.42","C","4","Aluminium production"]
[null,"24.42.A","C","5","Primary aluminium production"]
[null,"24.42.B","C","5","Aluminium and aluminium alloy goods production"]
[null,"24.43","C","4","Lead, zinc and tin production"]
[null,"24.43.Z","C","5","Lead, zinc and tin production"]
[null,"24.44","C","4","Copper production"]
[null,"24.44.Z","C","5","Copper production"]
[null,"24.45","C","4","Other non-ferrous metal production"]
[null,"24.45.Z","C","5","Other non-ferrous metal production"]
[null,"24.46","C","4","Nuclear fuel production"]
[null,"24.46.Z","C","5","Nuclear fuel production"]
[null,"24.5","C","3","Casting of metals"]
[null,"24.51","C","4","Casting of iron"]
[null,"24.51.Z","C","5","Casting of iron"]
[null,"24.52","C","4","Casting of steel"]
[null,"24.52.Z","C","5","Casting of steel"]
[null,"24.53","C","4","Casting of light metals"]
[null,"24.53.Z","C","5","Casting of light metals"]
[null,"24.54","C","4","Casting of other non-ferrous metals"]
[null,"24.54.A","C","5","Casting of copper and copper alloy"]
[null,"24.54.B","C","5","Casting of other non-ferrous metals not elsewhere classified "]
[null,"25","C","2","MANUFACTURE OF FABRICATED METAL PRODUCTS, EXCEPT MACHINERY AND EQUIPMENT"]
[null,"25.1","C","3","Manufacture of structural metal products"]
[null,"25.11","C","4","Manufacture of metal structures and parts of structures"]
[null,"25.11.Z","C","5","Manufacture of metal structures and parts of structures"]
[null,"25.12","C","4","Manufacture of metal elements of building woodwork"]
[null,"25.12.Z","C","5","Manufacture of metal elements of building woodwork"]
[null,"25.2","C","3","Manufacture of tanks, reservoirs and containers of metal"]
[null,"25.21","C","4","Manufacture of central heating radiators and boilers"]
[null,"25.21.Z","C","5","Manufacture of central heating radiators and boilers"]
[null,"25.29","C","4","Manufacture of other tanks, reservoirs and containers of metal"]
[null,"25.29.Z","C","5","Manufacture of other tanks, reservoirs and containers of metal"]
[null,"25.3","C","3","Manufacture of steam generators, except central heating hot water boilers"]
[null,"25.30","C","4","Manufacture of steam generators, except central heating hot water boilers"]
[null,"25.30.Z","C","5","Manufacture of steam generators, except central heating hot water boilers"]
[null,"25.4","C","3","Manufacture of weapons and ammunition"]
[null,"25.40","C","4","Manufacture of weapons and ammunition"]
[null,"25.40.Z","C","5","Manufacture of weapons and ammunition"]
[null,"25.5","C","3","Forging, pressing, stamping and roll-forming of metal; powder metallurgy"]
[null,"25.50","C","4","Forging, pressing, stamping and roll-forming of metal; powder metallurgy"]
[null,"25.50.Z","C","5","Forging, pressing, stamping and roll-forming of metal; powder metallurgy"]
[null,"25.6","C","3","Treatment and coating of metals; mechanical working of metal elements"]
[null,"25.61","C","4","Treatment and coating of metals"]
[null,"25.61.Z","C","5","Treatment and coating of metals"]
[null,"25.62","C","4","Mechanical working of metal elements"]
[null,"25.62.Z","C","5","Mechanical working of metal elements"]
[null,"25.7","C","3","Manufacture of cutlery, tools and general hardware"]
[null,"25.71","C","4","Manufacture of cutlery"]
[null,"25.71.Z","C","5","Manufacture of cutlery"]
[null,"25.72","C","4","Manufacture of locks and hinges"]
[null,"25.72.Z","C","5","Manufacture of locks and hinges"]
[null,"25.73","C","4","Manufacture of tools"]
[null,"25.73.Z","C","5","Manufacture of tools"]
[null,"25.9","C","3","Manufacture of other fabricated metal products"]
[null,"25.91","C","4","Manufacture of metal containers"]
[null,"25.91.Z","C","5","Manufacture of metal containers"]
[null,"25.92","C","4","Manufacture of metal packaging "]
[null,"25.92.Z","C","5","Manufacture of metal packaging"]
[null,"25.93","C","4","Manufacture of wire products, chains and springs"]
[null,"25.93.Z","C","5","Manufacture of wire products, chains and springs"]
[null,"25.94","C","4","Manufacture of fasteners and screws"]
[null,"25.94.Z","C","5","Manufacture of fasteners and screws"]
[null,"25.99","C","4","Manufacture of other fabricated metal products not elsewhere classified"]
[null,"25.99.Z","C","5","Manufacture of other fabricated metal products not elsewhere classified"]
[null,"26","C","2","MANUFACTURE OF COMPUTER, ELECTRONIC AND OPTICAL PRODUCTS"]
[null,"26.1","C","3","Manufacture of electronic components and printed circuits"]
[null,"26.11","C","4","Manufacture of electronic components"]
[null,"26.11.Z","C","5","Manufacture of electronic components"]
[null,"26.12","C","4","Manufacture of electronic printed circuits"]
[null,"26.12.Z","C","5","Manufacture of electronic printed circuits"]
[null,"26.2","C","3","Manufacture of computers and peripheral equipment"]
[null,"26.20","C","4","Manufacture of computers and peripheral equipment"]
[null,"26.20.Z","C","5","Manufacture of computers and peripheral equipment"]
[null,"26.3","C","3","Manufacture of (tele)communication equipment"]
[null,"26.30","C","4","Manufacture of (tele)communication equipment"]
[null,"26.30.Z","C","5","Manufacture of (tele)communication equipment"]
[null,"26.4","C","3","Manufacture of consumer electronics"]
[null,"26.40","C","4","Manufacture of consumer electronics"]
[null,"26.40.Z","C","5","Manufacture of consumer electronics"]
[null,"26.5","C","3","Manufacture of instruments and appliances for measuring, testing and navigation; watches and clocks"]
[null,"26.51","C","4","Manufacture of instruments and appliances for measuring, testing and navigation"]
[null,"26.51.Z","C","5","Manufacture of instruments and appliances for measuring, testing and navigation"]
[null,"26.52","C","4","Manufacture of watches and clocks"]
[null,"26.52.Z","C","5","Manufacture of watches and clocks"]
[null,"26.6","C","3","Manufacture of irradiation, electromedical and electrotherapeutic equipment"]
[null,"26.60","C","4","Manufacture of irradiation, electromedical and electrotherapeutic equipment"]
[null,"26.60.Z","C","5","Manufacture of irradiation, electromedical and electrotherapeutic equipment"]
[null,"26.7","C","3","Manufacture of optical instruments and photographic equipment"]
[null,"26.70","C","4","Manufacture of optical instruments and photographic equipment"]
[null,"26.70.Z","C","5","Manufacture of optical instruments and photographic equipment"]
[null,"26.8","C","3","Manufacture of unrecorded magnetic and optical media"]
[null,"26.80","C","4","Manufacture of unrecorded magnetic and optical media"]
[null,"26.80.Z","C","5","Manufacture of unrecorded magnetic and optical media"]
[null,"27","C","2","MANUFACTURE OF ELECTRICAL EQUIPMENT"]
[null,"27.1","C","3","Manufacture of electric motors, generators, transformers and electricity distribution and control apparatus"]
[null,"27.11","C","4","Manufacture of electric motors, generators and transformers"]
[null,"27.11.Z","C","5","Manufacture of electric motors, generators and transformers"]
[null,"27.12","C","4","Manufacture of electricity distribution and control apparatus"]
[null,"27.12.Z","C","5","Manufacture of electricity distribution and control apparatus"]
[null,"27.2","C","3","Manufacture of batteries and accumulators"]
[null,"27.20","C","4","Manufacture of batteries and accumulators"]
[null,"27.20.Z","C","5","Manufacture of batteries and accumulators"]
[null,"27.3","C","3","Manufacture of insulated wiring and installing equipment"]
[null,"27.31","C","4","Manufacture of fibre optic cables"]
[null,"27.31.Z","C","5","Manufacture of fibre optic cables"]
[null,"27.32","C","4","Manufacture of other electronic and electric wires and cables"]
[null,"27.32.Z","C","5","Manufacture of other electronic and electric wires and cables"]
[null,"27.33","C","4","Manufacture of installing equipment"]
[null,"27.33.Z","C","5","Manufacture of installing equipment"]
[null,"27.4","C","3","Manufacture of electric lighting equipment"]
[null,"27.40","C","4","Manufacture of electric lighting equipment"]
[null,"27.40.Z","C","5","Manufacture of electric lighting equipment"]
[null,"27.5","C","3","Manufacture of domestic appliances"]
[null,"27.51","C","4","Manufacture of electric domestic appliances"]
[null,"27.51.Z","C","5","Manufacture of electric domestic appliances"]
[null,"27.52","C","4","Manufacture of non-electric domestic appliances"]
[null,"27.52.Z","C","5","Manufacture of non-electric domestic appliances"]
[null,"27.9","C","3","Manufacture of other electrical equipment"]
[null,"27.90","C","4","Manufacture of other electrical equipment"]
[null,"27.90.Z","C","5","Manufacture of other electrical equipment"]
[null,"28","C","2","MANUFACTURE OF MACHINERY AND EQUIPMENT NOT ELSEWHERE CLASSIFIED"]
[null,"28.1","C","3","Manufacture of general-purpose machinery"]
[null,"28.11","C","4","Manufacture of engines and turbines, except aircraft, vehicle and cycle engines"]
[null,"28.11.Z","C","5","Manufacture of engines and turbines, except aircraft, vehicle and cycle engines"]
[null,"28.12","C","4","Manufacture of fluid power equipment"]
[null,"28.12.Z","C","5","Manufacture of fluid power equipment"]
[null,"28.13","C","4","Manufacture of other pumps and compressors"]
[null,"28.13.Z","C","5","Manufacture of other pumps and compressors"]
[null,"28.14","C","4","Manufacture of other taps and valves"]
[null,"28.14.Z","C","5","Manufacture of other taps and valves"]
[null,"28.15","C","4","Manufacture of bearings, gears, gearing and driving elements"]
[null,"28.15.Z","C","5","Manufacture of bearings, gears, gearing and driving elements"]
[null,"28.2","C","3","Manufacture of other general-purpose machinery"]
[null,"28.21","C","4","Manufacture of ovens, furnaces and furnace burners"]
[null,"28.21.Z","C","5","Manufacture of ovens, furnaces and furnace burners"]
[null,"28.22","C","4","Manufacture of lifting equipment and gripping devices "]
[null,"28.22.Z","C","5","Manufacture of lifting equipment and gripping devices "]
[null,"28.23","C","4","Manufacture of office machinery and equipment, except computers and peripheral equipment"]
[null,"28.23.Z","C","5","Manufacture of office machinery and equipment, except computers and peripheral equipment"]
[null,"28.24","C","4","Manufacture of power-driven hand tools"]
[null,"28.24.Z","C","5","Manufacture of power-driven hand tools"]
[null,"28.25","C","4","Manufacture of industrial cooling and ventilation equipment"]
[null,"28.25.Z","C","5","Manufacture of industrial cooling and ventilation equipment"]
[null,"28.29","C","4","Manufacture of other general-purpose machinery not elsewhere classified"]
[null,"28.29.Z","C","5","Manufacture of other general-purpose machinery not elsewhere classified"]
[null,"28.3","C","3","Manufacture of agricultural and forestry machinery"]
[null,"28.30","C","4","Manufacture of agricultural and forestry machinery"]
[null,"28.30.Z","C","5","Manufacture of agricultural and forestry machinery"]
[null,"28.4","C","3","Manufacture of machines and mechanical tools"]
[null,"28.41","C","4","Manufacture of metal forming machinery"]
[null,"28.41.Z","C","5","Manufacture of metal forming machinery"]
[null,"28.49","C","4","Manufacture of other mechanical tools"]
[null,"28.49.Z","C","5","Manufacture of other mechanical tools"]
[null,"28.9","C","3","Manufacture of other special-purpose machinery"]
[null,"28.91","C","4","Manufacture of machinery for metallurgy"]
[null,"28.91.Z","C","5","Manufacture of machinery for metallurgy"]
[null,"28.92","C","4","Manufacture of machinery for mining, quarrying and construction"]
[null,"28.92.Z","C","5","Manufacture of machinery for mining, quarrying and construction"]
[null,"28.93","C","4","Manufacture of machinery for food, beverage and tobacco processing"]
[null,"28.93.Z","C","5","Manufacture of machinery for food, beverage and tobacco processing"]
[null,"28.94","C","4","Manufacture of machinery for textile, apparel and leather production"]
[null,"28.94.Z","C","5","Manufacture of machinery for textile, apparel and leather production"]
[null,"28.95","C","4","Manufacture of machinery for paper and paperboard production"]
[null,"28.95.Z","C","5","Manufacture of machinery for paper and paperboard production"]
[null,"28.96","C","4","Manufacture of machinery for working rubber or plastics and for manufacture of the articles from these materials"]
[null,"28.96.Z","C","5","Manufacture of machinery for working rubber or plastics and for manufacture of the articles from these materials"]
[null,"28.99","C","4","Manufacture of other special-purpose machinery not elsewhere classified "]
[null,"28.99.Z","C","5","Manufacture of other special-purpose machinery not elsewhere classified "]
[null,"29","C","2","MANUFACTURE OF MOTOR VEHICLES, TRAILERS AND SEMI-TRAILERS EXCLUDING   MOTORCYCLES"]
[null,"29.1","C","3","Manufacture of motor vehicles excluding motorcycles"]
[null,"29.10","C","4","Manufacture of motor vehicles excluding motorcycles"]
[null,"29.10.A","C","5","Manufacture of engines for motor vehicles (excluding motorcycles) and for agricultural tractors"]
[null,"29.10.B","C","5","Manufacture of  cars"]
[null,"29.10.C","C","5","Manufacture of buses"]
[null,"29.10.D","C","5","Manufacture of motor vehicles for the transport of goods"]
[null,"29.10.E","C","5","Manufacture of other motor vehicles excluding motorcycles"]
[null,"29.2","C","3","Manufacture of bodies (coachwork) for motor vehicles; manufacture of trailers and semi-trailers"]
[null,"29.20","C","4","Manufacture of bodies (coachwork) for motor vehicles; manufacture of trailers and semi-trailers"]
[null,"29.20.Z","C","5","Manufacture of bodies (coachwork) for motor vehicles; manufacture of trailers and semi-trailers"]
[null,"29.3","C","3","Manufacture of parts and accessories for motor vehicles"]
[null,"29.31","C","4","Manufacture of electrical and electronic equipment for motor vehicles"]
[null,"29.31.Z","C","5","Manufacture of electrical and electronic equipment for motor vehicles"]
[null,"29.32","C","4","Manufacture of other parts and accessories for motor vehicles excluding motorcycles"]
[null,"29.32.Z","C","5","Manufacture of other parts and accessories for motor vehicles excluding motorcycles"]
[null,"30","C","2","MANUFACTURE OF OTHER TRANSPORT EQUIPMENT"]
[null,"30.1","C","3","Building of ships and boats"]
[null,"30.11","C","4","Building of ships and floating structures"]
[null,"30.11.Z","C","5","Building of ships and floating structures"]
[null,"30.12","C","4","Building of pleasure and sporting boats"]
[null,"30.12.Z","C","5","Building of pleasure and sporting boats"]
[null,"30.2","C","3","Manufacture of railway locomotives and rolling stock"]
[null,"30.20","C","4","Manufacture of railway locomotives and rolling stock"]
[null,"30.20.Z","C","5","Manufacture of railway locomotives and rolling stock"]
[null,"30.3","C","3","Manufacture of air and spacecraft and related machinery"]
[null,"30.30","C","4","Manufacture of air and spacecraft and related machinery"]
[null,"30.30.Z","C","5","Manufacture of air and spacecraft and related machinery"]
[null,"30.4","C","3","Manufacture of military fighting vehicles"]
[null,"30.40","C","4","Manufacture of military fighting vehicles"]
[null,"30.40.Z","C","5","Manufacture of military fighting vehicles"]
[null,"30.9","C","3","Manufacture of transport equipment not elsewhere classified"]
[null,"30.91","C","4","Manufacture of motorcycles"]
[null,"30.91.Z","C","5","Manufacture of motorcycles"]
[null,"30.92","C","4","Manufacture of bicycles and invalid carriages"]
[null,"30.92.Z","C","5","Manufacture of bicycles and invalid carriages"]
[null,"30.99","C","4","Manufacture of other transport equipment not elsewhere classified"]
[null,"30.99.Z","C","5","Manufacture of other transport equipment not elsewhere classified"]
[null,"31","C","2","MANUFACTURE OF FURNITURE"]
[null,"31.0","C","3","MANUFACTURE OF FURNITURE"]
[null,"31.01","C","4","Manufacture of office and shop furniture"]
[null,"31.01.Z","C","5","Manufacture of office and shop furniture"]
[null,"31.02","C","4","Manufacture of kitchen furniture"]
[null,"31.02.Z","C","5","Manufacture of kitchen furniture"]
[null,"31.03","C","4","Manufacture of mattresses"]
[null,"31.03.Z","C","5","Manufacture of mattresses"]
[null,"31.09","C","4","Manufacture of other furniture"]
[null,"31.09.Z","C","5","Manufacture of other furniture"]
[null,"32","C","2","OTHER MANUFACTURING"]
[null,"32.1","C","3","Manufacture of jewellery, bijouterie and related articles"]
[null,"32.11","C","4","Striking of coins"]
[null,"32.11.Z","C","5","Striking of coins"]
[null,"32.12","C","4","Manufacture of jewellery and related articles"]
[null,"32.12.Z","C","5","Manufacture of jewellery and related articles"]
[null,"32.13","C","4","Manufacture of imitation jewellery and related articles"]
[null,"32.13.Z","C","5","Manufacture of imitation jewellery and related articles"]
[null,"32.2","C","3","Manufacture of musical instruments"]
[null,"32.20","C","4","Manufacture of musical instruments"]
[null,"32.20.Z","C","5","Manufacture of musical instruments"]
[null,"32.3","C","3","Manufacture of sports goods"]
[null,"32.30","C","4","Manufacture of sports goods"]
[null,"32.30.Z","C","5","Manufacture of sports goods"]
[null,"32.4","C","3","Manufacture of games and toys"]
[null,"32.40","C","4","Manufacture of games and toys"]
[null,"32.40.Z","C","5","Manufacture of games and toys"]
[null,"32.5","C","3","Manufacture of medical and dental instruments and supplies"]
[null,"32.50","C","4","Manufacture of medical and dental instruments and supplies"]
[null,"32.50.Z","C","5","Manufacture of medical and dental instruments and supplies"]
[null,"32.9","C","3","Manufacturing not elsewhere classified "]
[null,"32.91","C","4","Manufacture of brooms and brushes"]
[null,"32.91.Z","C","5","Manufacture of brooms and brushes"]
[null,"32.99","C","4","Other manufacturing not elsewhere classified"]
[null,"32.99.Z","C","5","Other manufacturing not elsewhere classified"]
[null,"33","C","2","REPAIR, MAINTENANCE AND INSTALLATION OF MACHINERY AND EQUIPMENT"]
[null,"33.1","C","3","Repair and maintenance of fabricated metal products, machinery and equipment"]
[null,"33.11","C","4","Repair and maintenance of fabricated metal products"]
[null,"33.11.Z","C","5","Repair and maintenance of fabricated metal products"]
[null,"33.12","C","4","Repair and maintenance of machinery"]
[null,"33.12.Z","C","5","Repair and maintenance of machinery"]
[null,"33.13","C","4","Repair and maintenance of electronic and optical equipment"]
[null,"33.13.Z","C","5","Repair and maintenance of electronic and optical equipment"]
[null,"33.14","C","4","Repair and maintenance of electrical equipment"]
[null,"33.14.Z","C","5","Repair and maintenance of electrical equipment"]
[null,"33.15","C","4","Repair and maintenance of ships and boats"]
[null,"33.15.Z","C","5","Repair and maintenance of ships and boats"]
[null,"33.16","C","4","Repair and maintenance of aircraft and spacecraft"]
[null,"33.16.Z","C","5","Repair and maintenance of aircraft and spacecraft"]
[null,"33.17","C","4","Repair and maintenance of other transport equipment"]
[null,"33.17.Z","C","5","Repair and maintenance of other transport equipment"]
[null,"33.19","C","4","Repair and maintenance of other equipment "]
[null,"33.19.Z","C","5","Repair and maintenance of other equipment "]
[null,"33.2","C","3","Installation of industrial machinery and equipment"]
[null,"33.20","C","4","Installation of industrial machinery and equipment"]
[null,"33.20.Z","C","5","Installation of industrial machinery and equipment and outfit"]
[null,"D","D","1","ELECTRICITY, GAS, STEAM, HOT WATER AND AIR CONDITIONING MANUFACTURING AND   SUPPLY"]
[null,"35","D","2","ELECTRICITY, GAS, STEAM, HOT WATER AND AIR CONDITIONING MANUFACTURING AND   SUPPLY"]
[null,"35.1","D","3","Electric power generation, transmission and distribution"]
[null,"35.11","D","4","Production of electricity"]
[null,"35.11.Z","D","5","Production of electricity"]
[null,"35.12","D","4","Transmission of electricity"]
[null,"35.12.Z","D","5","Transmission of electricity"]
[null,"35.13","D","4","Distribution of electricity"]
[null,"35.13.Z","D","5","Distribution of electricity"]
[null,"35.14","D","4","Trade of electricity"]
[null,"35.14.Z","D","5","Trade of electricity"]
[null,"35.2","D","3","Manufacture of gaseous fuels; distribution and trade of gaseous fuels through mains"]
[null,"35.21","D","4","Manufacture of gaseous fuels"]
[null,"35.21.Z","D","5","Manufacture of gaseous fuels"]
[null,"35.22","D","4","Distribution of gaseous fuels through mains"]
[null,"35.22.Z","D","5","Distribution of gaseous fuels through mains"]
[null,"35.23","D","4","Trade of gaseous fuels through mains"]
[null,"35.23.Z","D","5","Trade of gaseous fuels through mains"]
[null,"35.3","D","3","Steam, hot water and air conditioning manufacturing and supply"]
[null,"35.30","D","4","Steam, hot water and air conditioning manufacturing and supply"]
[null,"35.30.Z","D","5","Steam, hot water and air conditioning manufacturing and supply"]
[null,"E","E","1","WATER SUPPLY; SEWERAGE, WASTE MANAGEMENT AND REMEDIATION ACTIVITIES"]
[null,"36","E","2","WATER COLLECTION, TREATMENT AND SUPPLY"]
[null,"36.0","E","3","Water collection, treatment and supply"]
[null,"36.00","E","4","Water collection, treatment and supply"]
[null,"36.00.Z","E","5","Water collection, treatment and supply"]
[null,"37","E","2","SEWAGE DISPOSAL AND TREATMENT"]
[null,"37.0","E","3","Sewage disposal and treatment"]
[null,"37.00","E","4","Sewage disposal and treatment"]
[null,"37.00.Z","E","5","Sewage disposal and treatment"]
[null,"38","E","2","WASTE COLLECTION, PROCESSING AND NEUTRALIZING ACTIVITIES; MATERIALS RECOVERY"]
[null,"38.1","E","3","Waste collection"]
[null,"38.11","E","4","Collection of non-hazardous waste"]
[null,"38.11.Z","E","5","Collection of non-hazardous waste"]
[null,"38.12","E","4","Collection of hazardous waste"]
[null,"38.12.Z","E","5","Collection of hazardous waste"]
[null,"38.2","E","3","Waste processing and neutralizing "]
[null,"38.21","E","4","Treatment and disposal of non-hazardous waste"]
[null,"38.21.Z","E","5","Treatment and disposal of non-hazardous waste"]
[null,"38.22","E","4","Hazardous waste processing and neutralizing"]
[null,"38.22.Z","E","5","Hazardous waste processing and neutralizing"]
[null,"38.3","E","3","Materials recovery"]
[null,"38.31","E","4","Dismantling of wrecks"]
[null,"38.31.Z","E","5","Dismantling of wrecks"]
[null,"38.32","E","4","Recovery of sorted materials"]
[null,"38.32.Z","E","5","Recovery of sorted materials"]
[null,"39","E","2","REMEDIATION ACTIVITIES AND OTHER WASTE MANAGEMENT SERVICES"]
[null,"39.0","E","3","Remediation activities and other waste management services"]
[null,"39.00","E","4","Remediation activities and other waste management services"]
[null,"39.00.Z","E","5","Remediation activities and other waste management services"]
[null,"F","F","1","CONSTRUCTION"]
[null,"41","F","2","Construction of buildings"]
[null,"41.1","F","3","Realization of building projects related to erection of buildings"]
[null,"41.10","F","4","Realization of building projects related to erection of buildings"]
[null,"41.10.Z","F","5","Realization of building projects related to erection of buildings"]
[null,"41.2","F","3","Building works related to erection of residential and non-residential buildings"]
[null,"41.20","F","4","Building works related to erection of residential and non-residential buildings"]
[null,"41.20.Z","F","5","Building works related to erection of residential and non-residential buildings"]
[null,"42","F","2","WORKS RELATED TO CONSTRUCTION OF CIVIL ENGINEERING"]
[null,"42.1","F","3","Works related to construction of roads and railways"]
[null,"42.11","F","4","Works related to construction of roads and motorways"]
[null,"42.11.Z","F","5","Works related to construction of roads and motorways"]
[null,"42.12","F","4","Works related to construction of railways and underground railways"]
[null,"42.12.Z","F","5","Works related to construction of railways and underground railways"]
[null,"42.13","F","4","Works related to construction of bridges and tunnels"]
[null,"42.13.Z","F","5","Works related to construction of bridges and tunnels"]
[null,"42.2","F","3","Works related to construction of pipelines, telecommunications and electricity lines"]
[null,"42.21","F","4","Works related to construction of transmit pipelines and distribution networs"]
[null,"42.21.Z","F","5","Works related to construction of transmission pipelines and distribution networks"]
[null,"42.22","F","4","Works related to construction of telecommunications and electricity lines"]
[null,"42.22.Z","F","5","Works related to construction of telecommunications and electricity lines"]
[null,"42.9","F","3","Works related to construction of other civil engineering projects"]
[null,"42.91","F","4","Works related to construction of water projects"]
[null,"42.91.Z","F","5","Works related to construction of water projects"]
[null,"42.99","F","4","Works related to construction of other civil engineering projects not elsewhere classified"]
[null,"42.99.Z","F","5","Works related to construction of other civil engineering projects not elsewhere classified"]
[null,"43","F","2","SPECIALISED CONSTRUCTION ACTIVITIES"]
[null,"43.1","F","3","Demolition and site preparation"]
[null,"43.11","F","4","Demolition"]
[null,"43.11.Z","F","5","Demolition"]
[null,"43.12","F","4","Site preparation"]
[null,"43.12.Z","F","5","Site preparation"]
[null,"43.13","F","4","Test drilling and boring"]
[null,"43.13.Z","F","5","Test drilling and boring"]
[null,"43.2","F","3","Electrical, plumbing and other construction installation activities"]
[null,"43.21","F","4","Electrical installation"]
[null,"43.21.Z","F","5","Electrical installation"]
[null,"43.22","F","4","Plumbing, heat and air-conditioning installation"]
[null,"43.22.Z","F","5","Plumbing, heat and air-conditioning installation"]
[null,"43.29","F","4","Other construction installation"]
[null,"43.29.Z","F","5","Other construction installation"]
[null,"43.3","F","3","Building completion and finishing"]
[null,"43.31","F","4","Plastering"]
[null,"43.31.Z","F","5","Plastering"]
[null,"43.32","F","4","Joinery installation"]
[null,"43.32.Z","F","5","Joinery installation"]
[null,"43.33","F","4","Floor and wall covering"]
[null,"43.33.Z","F","5","Floor and wall covering"]
[null,"43.34","F","4","Painting and glazing"]
[null,"43.34.Z","F","5","Painting and glazing"]
[null,"43.39","F","4","Other building completion and finishing"]
[null,"43.39.Z","F","5","Other building completion and finishing"]
[null,"43.9","F","3","Other specialised construction activities"]
[null,"43.91","F","4","Roofing activities"]
[null,"43.91.Z","F","5","Roofing activities"]
[null,"43.99","F","4","Other specialised construction activities not elsewhere classified"]
[null,"43.99.Z","F","5","Other specialised construction activities not elsewhere classified"]
[null,"G","G","1","WHOLESALE AND RETAIL TRADE; REPAIR OF MOTOR VEHICLES INCLUDING MOTORCYCLES"]
[null,"45","G","2","WHOLESALE AND RETAIL TRADE OF MOTOR VEHICLES; REPAIR OF MOTOR VEHICLES "]
[null,"45.1","G","3","Sale of motor vehicles, excluding motorcycles"]
[null,"45.11","G","4","Sale of cars and light motor vehicles"]
[null,"45.11.Z","G","5","Sale of cars and light motor vehicles"]
[null,"45.19","G","4","Sale of other motor vehicles, excluding motorcycles"]
[null,"45.19.Z","G","5","Sale of other motor vehicles, excluding motorcycles"]
[null,"45.2","G","3","Maintenance and repair of motor vehicles, excluding motorcycles"]
[null,"45.20","G","4","Maintenance and repair of motor vehicles, excluding motorcycles"]
[null,"45.20.Z","G","5","Maintenance and repair of motor vehicles, excluding motorcycles"]
[null,"45.3","G","3","Sale of motor vehicle parts and accessories, excluding motorcycles"]
[null,"45.31","G","4","Wholesale trade of motor vehicle parts and accessories, excluding motorcycles"]
[null,"45.31.Z","G","5","Wholesale trade of motor vehicle parts and accessories, excluding motorcycles"]
[null,"45.32","G","4","Retail trade of motor vehicle parts and accessories, excluding motorcycles"]
[null,"45.32.Z","G","5","Retail trade of motor vehicle parts and accessories, excluding motorcycles"]
[null,"45.4","G","3","Sale, maintenance and repair of motorcycles and related parts and accessories"]
[null,"45.40","G","4","Sale, maintenance and repair of motorcycles and related parts and accessories"]
[null,"45.40.Z","G","5","Sale, maintenance and repair of motorcycles and related parts and accessories"]
[null,"46","G","2","WHOLESALE TRADE, EXCLUDING MOTOR VEHICLES "]
[null,"46.1","G","3","Wholesale on a fee or contract basis"]
[null,"46.11","G","4","Agents involved in the sale of agricultural raw materials, live animals, textile raw materials and semi-finished goods"]
[null,"46.11.Z","G","5","Agents involved in the sale of agricultural raw materials, live animals, textile raw materials and semi-finished goods"]
[null,"46.12","G","4","Agents involved in the sale of fuels, ores, metals and industrial chemicals"]
[null,"46.12.Z","G","5","Agents involved in the sale of fuels, ores, metals and industrial chemicals"]
[null,"46.13","G","4","Agents involved in the sale of timber and building materials"]
[null,"46.13.Z","G","5","Agents involved in the sale of timber and building materials"]
[null,"46.14","G","4","Agents involved in the sale of machinery, industrial equipment, ships and aircraft"]
[null,"46.14.Z","G","5","Agents involved in the sale of machinery, industrial equipment, ships and aircraft"]
[null,"46.15","G","4","Agents involved in the sale of furniture, household goods, hardware and ironmongery"]
[null,"46.15.Z","G","5","Agents involved in the sale of furniture, household goods, hardware and ironmongery"]
[null,"46.16","G","4","Agents involved in the sale of textiles, clothing, fur, footwear and leather goods"]
[null,"46.16.Z","G","5","Agents involved in the sale of textiles, clothing, fur, footwear and leather goods"]
[null,"46.17","G","4","Agents involved in the sale of food, beverages and tobacco"]
[null,"46.17.Z","G","5","Agents involved in the sale of food, beverages and tobacco"]
[null,"46.18","G","4","Agents specialised in the sale of other particular products"]
[null,"46.18.Z","G","5","Agents specialised in the sale of other particular products"]
[null,"46.19","G","4","Agents involved in the sale of a variety of goods"]
[null,"46.19.Z","G","5","Agents involved in the sale of a variety of goods"]
[null,"46.2","G","3","Wholesale of agricultural raw materials and live animals"]
[null,"46.21","G","4","Wholesale of grain, unmanufactured tobacco, seeds and animal feeds"]
[null,"46.21.Z","G","5","Wholesale of grain, unmanufactured tobacco, seeds and animal feeds"]
[null,"46.22","G","4","Wholesale of flowers and plants"]
[null,"46.22.Z","G","5","Wholesale of flowers and plants"]
[null,"46.23","G","4","Wholesale of live animals"]
[null,"46.23.Z","G","5","Wholesale of live animals"]
[null,"46.24","G","4","Wholesale of hides, skins and leather"]
[null,"46.24.Z","G","5","Wholesale of hides, skins and leather"]
[null,"46.3","G","3","Wholesale of food, beverages and tobacco"]
[null,"46.31","G","4","Wholesale of fruit and vegetables"]
[null,"46.31.Z","G","5","Wholesale of fruit and vegetables"]
[null,"46.32","G","4","Wholesale of meat and meat products"]
[null,"46.32.Z","G","5","Wholesale of meat and meat products"]
[null,"46.33","G","4","Wholesale of dairy products, eggs and edible oils and fats"]
[null,"46.33.Z","G","5","Wholesale of dairy products, eggs and edible oils and fats"]
[null,"46.34","G","4","Wholesale of beverages"]
[null,"46.34.A","G","5","Wholesale of alcoholic beverages"]
[null,"46.34.B","G","5","Wholesale of non-alcoholic beverages"]
[null,"46.35","G","4","Wholesale of tobacco products"]
[null,"46.35.Z","G","5","Wholesale of tobacco products"]
[null,"46.36","G","4","Wholesale of sugar and chocolate and sugar confectionery"]
[null,"46.36.Z","G","5","Wholesale of sugar and chocolate and sugar confectionery"]
[null,"46.37","G","4","Wholesale of coffee, tea, cocoa and spices"]
[null,"46.37.Z","G","5","Wholesale of coffee, tea, cocoa and spices"]
[null,"46.38","G","4","Wholesale of other food, including fish, crustaceans and molluscs"]
[null,"46.38.Z","G","5","Wholesale of other food, including fish, crustaceans and molluscs"]
[null,"46.39","G","4","Non-specialised wholesale of food, beverages and tobacco"]
[null,"46.39.Z","G","5","Non-specialised wholesale of food, beverages and tobacco"]
[null,"46.4","G","3","Wholesale of household goods"]
[null,"46.41","G","4","Wholesale of textiles"]
[null,"46.41.Z","G","5","Wholesale of textiles"]
[null,"46.42","G","4","Wholesale of clothing and footwear"]
[null,"46.42.Z","G","5","Wholesale of clothing and footwear"]
[null,"46.43","G","4","Wholesale of electrical household appliances"]
[null,"46.43.Z","G","5","Wholesale of electrical household appliances"]
[null,"46.44","G","4","Wholesale of china, ceramics and glassware and cleaning materials"]
[null,"46.44.Z","G","5","Wholesale of china, ceramics and glassware and cleaning materials"]
[null,"46.45","G","4","Wholesale of perfume and cosmetics"]
[null,"46.45.Z","G","5","Wholesale of perfume and cosmetics"]
[null,"46.46","G","4","Wholesale of pharmaceutical goods"]
[null,"46.46.Z","G","5","Wholesale of pharmaceutical goods"]
[null,"46.47","G","4","Wholesale of furniture, carpets and lighting equipment"]
[null,"46.47.Z","G","5","Wholesale of furniture, carpets and lighting equipment"]
[null,"46.48","G","4","Wholesale of watches, clocks and jewellery"]
[null,"46.48.Z","G","5","Wholesale of watches, clocks and jewellery"]
[null,"46.49","G","4","Wholesale of other household goods"]
[null,"46.49.Z","G","5","Wholesale of other household goods"]
[null,"46.5","G","3","Wholesale of information and communication equipment"]
[null,"46.51","G","4","Wholesale of computers, peripheral equipment and software"]
[null,"46.51.Z","G","5","Wholesale of computers, peripheral equipment and software"]
[null,"46.52","G","4","Wholesale of electronic and telecommunications equipment and parts thereof"]
[null,"46.52.Z","G","5","Wholesale of electronic and telecommunications equipment and parts thereof"]
[null,"46.6","G","3","Wholesale of machinery, equipment and supplies"]
[null,"46.61","G","4","Wholesale of agricultural machinery, equipment and supplies"]
[null,"46.61.Z","G","5","Wholesale of agricultural machinery, equipment and supplies"]
[null,"46.62","G","4","Wholesale of machine tools"]
[null,"46.62.Z","G","5","Wholesale of machine tools"]
[null,"46.63","G","4","Wholesale of mining, construction and civil engineering machinery"]
[null,"46.63.Z","G","5","Wholesale of mining, construction and civil engineering machinery"]
[null,"46.64","G","4","Wholesale of machinery for the textile industry and of sewing and knitting machines"]
[null,"46.64.Z","G","5","Wholesale of machinery for the textile industry and of sewing and knitting machines"]
[null,"46.65","G","4","Wholesale of office furniture"]
[null,"46.65.Z","G","5","Wholesale of office furniture"]
[null,"46.66","G","4","Wholesale of other office machinery and equipment"]
[null,"46.66.Z","G","5","Wholesale of other office machinery and equipment"]
[null,"46.69","G","4","Wholesale of other machinery and equipment"]
[null,"46.69.Z","G","5","Wholesale of other machinery and equipment"]
[null,"46.7","G","3","Other specialised wholesale"]
[null,"46.71","G","4","Wholesale of fuels and related products"]
[null,"46.71.Z","G","5","Wholesale of fuels and related products"]
[null,"46.72","G","4","Wholesale of metals and metal ores"]
[null,"46.72.Z","G","5","Wholesale of metals and metal ores"]
[null,"46.73","G","4","Wholesale of wood, construction materials and sanitary equipment"]
[null,"46.73.Z","G","5","Wholesale of wood, construction materials and sanitary equipment"]
[null,"46.74","G","4","Wholesale of hardware and plumbing and heating equipment and supplies"]
[null,"46.74.Z","G","5","Wholesale of hardware and plumbing and heating equipment and supplies"]
[null,"46.75","G","4","Wholesale of chemical products"]
[null,"46.75.Z","G","5","Wholesale of chemical products"]
[null,"46.76","G","4","Wholesale of other intermediate products"]
[null,"46.76.Z","G","5","Wholesale of other intermediate products"]
[null,"46.77","G","4","Wholesale of waste and scrap"]
[null,"46.77.Z","G","5","Wholesale of waste and scrap"]
[null,"46.9","G","3","Non-specialised wholesale trade"]
[null,"46.90","G","4","Non-specialised wholesale trade"]
[null,"46.90.Z","G","5","Non-specialised wholesale trade"]
[null,"47","G","2","RETAIL TRADE, EXCEPT RETAIL TRADE OF MOTOR VEHICLES "]
[null,"47.1","G","3","Retail sale in non-specialised stores"]
[null,"47.11","G","4","Retail sale in non-specialised stores with food, beverages or tobacco predominating"]
[null,"47.11.Z","G","5","Retail sale in non-specialised stores with food, beverages or tobacco predominating"]
[null,"47.19","G","4","Other retail sale in non-specialised stores"]
[null,"47.19.Z","G","5","Other retail sale in non-specialised stores"]
[null,"47.2","G","3","Retail sale of food, beverages and tobacco in specialised stores"]
[null,"47.21","G","4","Retail sale of fruit and vegetables in specialised stores"]
[null,"47.21.Z","G","5","Retail sale of fruit and vegetables in specialised stores"]
[null,"47.22","G","4","Retail sale of meat and meat products in specialised stores"]
[null,"47.22.Z","G","5","Retail sale of meat and meat products in specialised stores"]
[null,"47.23","G","4","Retail sale of fish, crustaceans and molluscs in specialised stores"]
[null,"47.23.Z","G","5","Retail sale of fish, crustaceans and molluscs in specialised stores"]
[null,"47.24","G","4","Retail sale of bread, cakes, flour confectionery and sugar confectionery in specialised     stores"]
[null,"47.24.Z","G","5","Retail sale of bread, cakes, flour confectionery and sugar confectionery in specialised    stores"]
[null,"47.25","G","4","Retail sale of alcoholic and non-alcoholic beverages in specialised stores"]
[null,"47.25.Z","G","5","Retail sale of alcoholic and non-alcoholic beverages in specialised stores"]
[null,"47.26","G","4","Retail sale of tobacco products in specialised stores"]
[null,"47.26.Z","G","5","Retail sale of tobacco products in specialised stores"]
[null,"47.29","G","4","Other retail sale of food in specialised stores"]
[null,"47.29.Z","G","5","Other retail sale of food in specialised stores"]
[null,"47.3","G","3","Retail sale of fuel for motor vehicles in fuel stations"]
[null,"47.30","G","4","Retail sale of fuel for motor vehicles in fuel stations"]
[null,"47.30.Z","G","5","Retail sale of fuel for motor vehicles in fuel stations"]
[null,"47.4","G","3","Retail sale of information and communication equipment in specialised stores"]
[null,"47.41","G","4","Retail sale of computers, peripheral units and software in specialised stores"]
[null,"47.41.Z","G","5","Retail sale of computers, peripheral units and software in specialised stores"]
[null,"47.42","G","4","Retail sale of telecommunications equipment in specialised stores"]
[null,"47.42.Z","G","5","Retail sale of telecommunications equipment in specialised stores"]
[null,"47.43","G","4","Retail sale of audio and video equipment in specialised stores"]
[null,"47.43.Z","G","5","Retail sale of audio and video equipment in specialised stores"]
[null,"47.5","G","3","Retail sale of household equipment in specialised stores"]
[null,"47.51","G","4","Retail sale of textiles in specialised stores"]
[null,"47.51.Z","G","5","Retail sale of textiles in specialised stores"]
[null,"47.52","G","4","Retail sale of hardware, paints and glass in specialised stores"]
[null,"47.52.Z","G","5","Retail sale of hardware, paints and glass in specialised stores"]
[null,"47.53","G","4","Retail sale of carpets, rugs, wall and floor coverings in specialised stores"]
[null,"47.53.Z","G","5","Retail sale of carpets, rugs, wall and floor coverings in specialised stores"]
[null,"47.54","G","4","Retail sale of electrical household appliances in specialised stores"]
[null,"47.54.Z","G","5","Retail sale of electrical household appliances in specialised stores"]
[null,"47.59","G","4","Retail sale of furniture, lighting equipment and other household articles in specialised    stores"]
[null,"47.59.Z","G","5","Retail sale of furniture, lighting equipment and other household articles in specialised    stores"]
[null,"47.6","G","3","Retail sale of cultural and recreation goods in specialised stores"]
[null,"47.61","G","4","Retail sale of books in specialised stores"]
[null,"47.61.Z","G","5","Retail sale of books in specialised stores"]
[null,"47.62","G","4","Retail sale of newspapers and stationery in specialised stores"]
[null,"47.62.Z","G","5","Retail sale of newspapers and stationery in specialised stores"]
[null,"47.63","G","4","Retail sale of music and video recordings in specialised stores"]
[null,"47.63.Z","G","5","Retail sale of music and video recordings in specialised stores"]
[null,"47.64","G","4","Retail sale of sporting equipment in specialised stores"]
[null,"47.64.Z","G","5","Retail sale of sporting equipment in specialised stores"]
[null,"47.65","G","4","Retail sale of games and toys in specialised stores"]
[null,"47.65.Z","G","5","Retail sale of games and toys in specialised stores"]
[null,"47.7","G","3","Retail sale of other goods in specialised stores"]
[null,"47.71","G","4","Retail sale of clothing in specialised stores"]
[null,"47.71.Z","G","5","Retail sale of clothing in specialised stores"]
[null,"47.72","G","4","Retail sale of footwear and leather goods in specialised stores"]
[null,"47.72.Z","G","5","Retail sale of footwear and leather goods in specialised stores"]
[null,"47.73","G","4","Dispensing chemist in specialised stores"]
[null,"47.73.Z","G","5","Dispensing chemist in specialised stores"]
[null,"47.74","G","4","Retail sale of medical and orthopaedic goods in specialised stores"]
[null,"47.74.Z","G","5","Retail sale of medical and orthopaedic goods in specialised stores"]
[null,"47.75","G","4","Retail sale of cosmetic and toilet articles in specialised stores"]
[null,"47.75.Z","G","5","Retail sale of cosmetic and toilet articles in specialised stores"]
[null,"47.76","G","4","Retail sale of flowers, plants, seeds, fertilisers, pet animals and pet food in specialised    stores"]
[null,"47.76.Z","G","5","Retail sale of flowers, plants, seeds, fertilisers, pet animals and pet food in specialised    stores"]
[null,"47.77","G","4","Retail sale of watches, clocks and jewellery in specialised stores"]
[null,"47.77.Z","G","5","Retail sale of watches, clocks and jewellery in specialised stores"]
[null,"47.78","G","4","Other retail sale of new goods in specialised stores"]
[null,"47.78.Z","G","5","Other retail sale of new goods in specialised stores"]
[null,"47.79","G","4","Retail sale of second-hand goods in specialised stores"]
[null,"47.79.Z","G","5","Retail sale of second-hand goods in specialised stores"]
[null,"47.8","G","3","Retail sale via stalls and markets"]
[null,"47.81","G","4","Retail sale via stalls and markets of food, beverages and tobacco products"]
[null,"47.81.Z","G","5","Retail sale via stalls and markets of food, beverages and tobacco products"]
[null,"47.82","G","4","Retail sale via stalls and markets of textiles, clothing and footwear"]
[null,"47.82.Z","G","5","Retail sale via stalls and markets of textiles, clothing and footwear"]
[null,"47.89","G","4","Retail sale via stalls and markets of other goods"]
[null,"47.89.Z","G","5","Retail sale via stalls and markets of other goods"]
[null,"47.9","G","3","Retail sale not in stores, stalls or markets"]
[null,"47.91","G","4","Retail sale via mail order houses or via Internet"]
[null,"47.91.Z","G","5","Retail sale via mail order houses or via Internet"]
[null,"47.99","G","4","Other retail sale not in stores, stalls or markets"]
[null,"47.99.Z","G","5","Other retail sale not in stores, stalls or markets"]
[null,"H","H","1","TRANSPORTATION AND STORAGE"]
[null,"49","H","2","LAND TRANSPORT AND TRANSPORT VIA PIPELINES"]
[null,"49.1","H","3","Passenger rail transport, interurban"]
[null,"49.10","H","4","Passenger rail transport, interurban"]
[null,"49.10.Z","H","5","Passenger rail transport, interurban"]
[null,"49.2","H","3","Freight rail transport"]
[null,"49.20","H","4","Freight rail transport"]
[null,"49.20.Z","H","5","Freight rail transport"]
[null,"49.3","H","3","Other passenger land transport "]
[null,"49.31","H","4","Urban and suburban passenger land transport"]
[null,"49.31.Z","H","5","Urban and suburban passenger land transport"]
[null,"49.32","H","4","Taxi operation"]
[null,"49.32.Z","H","5","Taxi operation"]
[null,"49.39","H","4","Other passenger land transport not elsewhere classified"]
[null,"49.39.Z","H","5","Other passenger land transport not elsewhere classified"]
[null,"49.4","H","3","Freight transport by road and removal services"]
[null,"49.41","H","4","Freight transport by road"]
[null,"49.41.Z","H","5","Freight transport by road"]
[null,"49.42","H","4","Removal services"]
[null,"49.42.Z","H","5","Removal services"]
[null,"49.5","H","3","Transport via pipeline"]
[null,"49.50","H","4","Transport via pipeline"]
[null,"49.50.A","H","5","Transport via pipeline of fuel gases "]
[null,"49.50.B","H","5","Transport via pipeline of other commodities"]
[null,"50","H","2","WATER TRANSPORT"]
[null,"50.1","H","3","Sea and coastal passenger water transport"]
[null,"50.10","H","4","Sea and coastal passenger water transport"]
[null,"50.10.Z","H","5","Sea and coastal passenger water transport"]
[null,"50.2","H","3","Sea and coastal freight water transport"]
[null,"50.20","H","4","Sea and coastal freight water transport"]
[null,"50.20.Z","H","5","Sea and coastal freight water transport"]
[null,"50.3","H","3","Inland passenger water transport"]
[null,"50.30","H","4","Inland passenger water transport"]
[null,"50.30.Z","H","5","Inland passenger water transport"]
[null,"50.4","H","3","Inland freight water transport"]
[null,"50.40","H","4","Inland freight water transport"]
[null,"50.40.Z","H","5","Inland freight water transport"]
[null,"51","H","2","AIR TRANSPORT"]
[null,"51.1","H","3","Passenger air transport"]
[null,"51.10","H","4","Passenger air transport"]
[null,"51.10.Z","H","5","Passenger air transport"]
[null,"51.2","H","3","Freight air transport and space transport"]
[null,"51.21","H","4","Freight air transport"]
[null,"51.21.Z","H","5","Freight air transport"]
[null,"51.22","H","4","Space transport"]
[null,"51.22.Z","H","5","Space transport"]
[null,"52","H","2","WAREHOUSING AND SUPPORT ACTIVITIES FOR TRANSPORTATION"]
[null,"52.1","H","3","Warehousing and storage"]
[null,"52.10","H","4","Warehousing and storage"]
[null,"52.10.A","H","5","Warehousing and storage of fuel gases "]
[null,"52.10.B","H","5","Warehousing and storage of other goods"]
[null,"52.2","H","3","Support activities for transportation"]
[null,"52.21","H","4","Service activities incidental to land transportation"]
[null,"52.21.Z","H","5","Service activities incidental to land transportation"]
[null,"52.22","H","4","Service activities incidental to water transportation"]
[null,"52.22.A","H","5","Service activities incidental to sea transportation"]
[null,"52.22.B","H","5","Service activities incidental to inland transportation"]
[null,"52.23","H","4","Service activities incidental to air transportation"]
[null,"52.23.Z","H","5","Service activities incidental to air transportation"]
[null,"52.24","H","4","Cargo handling"]
[null,"52.24.A","H","5","Cargo handling in sea ports"]
[null,"52.24.B","H","5","Cargo handling in inland ports"]
[null,"52.24.C","H","5","Cargo handling in other reloading points"]
[null,"52.29","H","4","Other transportation support activities "]
[null,"52.29.A","H","5","Sea  transportation agencies activities"]
[null,"52.29.B","H","5","Inland transportation agencies activities"]
[null,"52.29.C","H","5","Other transportation agencies activities"]
[null,"53","H","2","POSTAL AND COURIER ACTIVITIES"]
[null,"53.1","H","3","Postal activities under universal service obligation (public operator)"]
[null,"53.10","H","4","Postal activities under universal service obligation (public operator)"]
[null,"53.10.Z","H","5","Postal activities under universal service obligation (public operator)"]
[null,"53.2","H","3","Other postal and courier activities"]
[null,"53.20","H","4","Other postal and courier activities"]
[null,"53.20.Z","H","5","Other postal and courier activities"]
[null,"I","I","1","ACCOMMODATION AND FOOD SERVICE ACTIVITIES"]
[null,"55","I","2","ACCOMMODATION "]
[null,"55.1","I","3","Hotels and similar accommodation"]
[null,"55.10","I","4","Hotels and similar accommodation"]
[null,"55.10.Z","I","5","Hotels and similar accommodation"]
[null,"55.2","I","3","Holiday and other short-stay accommodation"]
[null,"55.20","I","4","Holiday and other short-stay accommodation"]
[null,"55.20.Z","I","5","Holiday and other short-stay accommodation"]
[null,"55.3","I","3","Camping grounds (including grounds for camping vehicles), and campsites "]
[null,"55.30","I","4","Camping grounds (including grounds for camping vehicles), and campsites "]
[null,"55.30.Z","I","5","Camping grounds (including grounds for camping vehicles), and campsites "]
[null,"55.9","I","3","Other accommodation"]
[null,"55.90","I","4","Other accommodation"]
[null,"55.90.Z","I","5","Other accommodation"]
[null,"56","I","2","FOOD AND BEVERAGE SERVICE ACTIVITIES"]
[null,"56.1","I","3","Restaurants and other eating places"]
[null,"56.10","I","4","Restaurants and other eating places"]
[null,"56.10.A","I","5","Restaurants and other eating places"]
[null,"56.10.B","I","5","Mobile eating places"]
[null,"56.2","I","3","Event catering and other food service activities"]
[null,"56.21","I","4","Event catering activities"]
[null,"56.21.Z","I","5","Event catering activities"]
[null,"56.29","I","4","Other food service activities"]
[null,"56.29.Z","I","5","Other food service activities"]
[null,"56.3","I","3","Beverage serving activities"]
[null,"56.30","I","4","Beverage serving activities"]
[null,"56.30.Z","I","5","Beverage serving activities"]
[null,"J","J","1","INFORMATION AND COMMUNICATION"]
[null,"58","J","2","PUBLISHING ACTIVITIES"]
[null,"58.1","J","3","Publishing of books, periodicals and other publishing activities, excluding software      publishing"]
[null,"58.11","J","4","Book publishing"]
[null,"58.11.Z","J","5","Book publishing"]
[null,"58.12","J","4","Publishing of directories and registers (e.g. street, phone directory)"]
[null,"58.12.Z","J","5","Publishing of directories and registers (e.g. street, phone directory)"]
[null,"58.13","J","4","Publishing of newspapers"]
[null,"58.13.Z","J","5","Publishing of newspapers"]
[null,"58.14","J","4","Publishing of journals and periodicals"]
[null,"58.14.Z","J","5","Publishing of journals and periodicals"]
[null,"58.19","J","4","Other publishing activities"]
[null,"58.19.Z","J","5","Other publishing activities"]
[null,"58.2","J","3","Software publishing"]
[null,"58.21","J","4","Publishing of computer games"]
[null,"58.21.Z","J","5","Publishing of computer games"]
[null,"58.29","J","4","Other software publishing"]
[null,"58.29.Z","J","5","Other software publishing"]
[null,"59","J","2","MOTION PICTURE, VIDEO AND TELEVISION PROGRAMME PRODUCTION, SOUND RECORDING AND MUSIC PUBLISHING ACTIVITIES"]
[null,"59.1","J","3","Motion picture, video and television programme activities"]
[null,"59.11","J","4","Motion picture, video and television programme production activities"]
[null,"59.11.Z","J","5","Motion picture, video and television programme production activities"]
[null,"59.12","J","4","Motion picture, video and television programme post-production activities"]
[null,"59.12.Z","J","5","Motion picture, video and television programme post-production activities"]
[null,"59.13","J","4","Motion picture, video and television programme distribution activities"]
[null,"59.13.Z","J","5","Motion picture, video and television programme distribution activities"]
[null,"59.14","J","4","Motion picture projection activities"]
[null,"59.14.Z","J","5","Motion picture projection activities"]
[null,"59.2","J","3","Sound recording and music publishing activities"]
[null,"59.20","J","4","Sound recording and music publishing activities"]
[null,"59.20.Z","J","5","Sound recording and music publishing activities"]
[null,"60","J","2","PUBLIC AND LICENCE PROGRAMMES BROADCASTING"]
[null,"60.1","J","3","Radio broadcasting"]
[null,"60.10","J","4","Radio broadcasting"]
[null,"60.10.Z","J","5","Radio broadcasting"]
[null,"60.2","J","3","Public and licence television programmes broadcasting"]
[null,"60.20","J","4","Public and licence television programmes broadcasting"]
[null,"60.20.Z","J","5","Public and licence television programmes broadcasting"]
[null,"61","J","2","TELECOMMUNICATIONS"]
[null,"61.1","J","3","Wired telecommunications activities"]
[null,"61.10","J","4","Wired telecommunications activities"]
[null,"61.10.Z","J","5","Wired telecommunications activities"]
[null,"61.2","J","3","Wireless telecommunications activities, excluding satellite telecommunications activities"]
[null,"61.20","J","4","Wireless telecommunications activities, excluding satellite telecommunications activities"]
[null,"61.20.Z","J","5","Wireless telecommunications activities, excluding satellite telecommunications activities"]
[null,"61.3","J","3","Satellite telecommunications activities"]
[null,"61.30","J","4","Satellite telecommunications activities"]
[null,"61.30.Z","J","5","Satellite telecommunications activities"]
[null,"61.9","J","3","Other telecommunications activities"]
[null,"61.90","J","4","Other telecommunications activities"]
[null,"61.90.Z","J","5","Other telecommunications activities"]
[null,"62","J","2","COMPUTER PROGRAMMING, CONSULTANCY AND RELATED ACTIVITIES"]
[null,"62.0","J","3","Computer programming, consultancy and related activities"]
[null,"62.01","J","4","Computer programming activities"]
[null,"62.01.Z","J","5","Computer programming activities"]
[null,"62.02","J","4","Computer consultancy activities"]
[null,"62.02.Z","J","5","Computer consultancy activities"]
[null,"62.03","J","4","Computer facilities management activities"]
[null,"62.03.Z","J","5","Computer facilities management activities"]
[null,"62.09","J","4","Other information technology and computer service activities"]
[null,"62.09.Z","J","5","Other information technology and computer service activities"]
[null,"63","J","2","INFORMATION SERVICE ACTIVITIES"]
[null,"63.1","J","3","Data processing, hosting and related activities; web portals"]
[null,"63.11","J","4","Data processing, hosting and related activities"]
[null,"63.11.Z","J","5","Data processing, hosting and related activities"]
[null,"63.12","J","4","Web portals"]
[null,"63.12.Z","J","5","Web portals"]
[null,"63.9","J","3","Other information service activities"]
[null,"63.91","J","4","News agency activities"]
[null,"63.91.Z","J","5","News agency activities"]
[null,"63.99","J","4","Other information service activities not elsewhere classified"]
[null,"63.99.Z","J","5","Other information service activities not elsewhere classified"]
[null,"K","K","1","FINANCIAL AND INSURANCE ACTIVITIES"]
[null,"64","K","2","FINANCIAL SERVICE ACTIVITIES, EXCEPT INSURANCE AND PENSION FUNDING"]
[null,"64.1","K","3","Monetary intermediation"]
[null,"64.11","K","4","Central banking"]
[null,"64.11.Z","K","5","Central banking"]
[null,"64.19","K","4","Other monetary intermediation"]
[null,"64.19.Z","K","5","Other monetary intermediation"]
[null,"64.2","K","3","Activities of holding companies"]
[null,"64.20","K","4","Activities of holding companies"]
[null,"64.20.Z","K","5","Activities of holding companies"]
[null,"64.3","K","3","Trusts, funds and similar financial entities"]
[null,"64.30","K","4","Trusts, funds and similar financial entities"]
[null,"64.30.Z","K","5","Trusts, funds and similar financial entities"]
[null,"64.9","K","3","Other financial service activities, except insurance and pension funding"]
[null,"64.91","K","4","Financial leasing"]
[null,"64.91.Z","K","5","Financial leasing"]
[null,"64.92","K","4","Other credit granting"]
[null,"64.92.Z","K","5","Other credit granting"]
[null,"64.99","K","4","Other financial service activities, except insurance and pension funding not elsewhere classified"]
[null,"64.99.Z","K","5","Other financial service activities, except insurance and pension funding not elsewhere classified"]
[null,"65","K","2","INSURANCE, REINSURANCE AND PENSION FUNDING, EXCEPT COMPULSORY SOCIAL        SECURITY"]
[null,"65.1","K","3","Insurance"]
[null,"65.11","K","4","Life insurance"]
[null,"65.11.Z","K","5","Life insurance"]
[null,"65.12","K","4","Other personal and property insurance"]
[null,"65.12.Z","K","5","Other personal and property insurance"]
[null,"65.2","K","3","Reinsurance"]
[null,"65.20","K","4","Reinsurance"]
[null,"65.20.Z","K","5","Reinsurance"]
[null,"65.3","K","3","Pension funding"]
[null,"65.30","K","4","Pension funding"]
[null,"65.30.Z","K","5","Pension funding"]
[null,"66","K","2","ACTIVITIES AUXILIARY TO FINANCIAL SERVICES AND INSURANCE ACTIVITIES"]
[null,"66.1","K","3","Activities auxiliary to financial services, except insurance and pension funding"]
[null,"66.11","K","4","Administration of financial markets"]
[null,"66.11.Z","K","5","Administration of financial markets"]
[null,"66.12","K","4","Security and commodity contracts brokerage"]
[null,"66.12.Z","K","5","Security and commodity contracts brokerage"]
[null,"66.19","K","4","Other activities auxiliary to financial services, except insurance and pension funding"]
[null,"66.19.Z","K","5","Other activities auxiliary to financial services, except insurance and pension funding"]
[null,"66.2","K","3","Activities auxiliary to insurance and pension funding"]
[null,"66.21","K","4","Risk and damage evaluation"]
[null,"66.21.Z","K","5","Risk and damage evaluation"]
[null,"66.22","K","4","Activities of insurance agents and brokers"]
[null,"66.22.Z","K","5","Activities of insurance agents and brokers"]
[null,"66.29","K","4","Other activities auxiliary to insurance and pension funding"]
[null,"66.29.Z","K","5","Other activities auxiliary to insurance and pension funding"]
[null,"66.3","K","3","Fund management activities"]
[null,"66.30","K","4","Fund management activities"]
[null,"66.30.Z","K","5","Fund management activities"]
[null,"L","L","1","REAL ESTATE ACTIVITIES"]
[null,"68","L","2","Real estate activities"]
[null,"68.1","L","3","Buying and selling of own real estate"]
[null,"68.10","L","4","Buying and selling of own real estate"]
[null,"68.10.Z","L","5","Buying and selling of own real estate"]
[null,"68.2","L","3","Rental and operating of own or leased real estate"]
[null,"68.20","L","4","Rental and operating of own or leased real estate"]
[null,"68.20.Z","L","5","Rental and operating of own or leased real estate"]
[null,"68.3","L","3","Real estate activities on a fee or contract basis"]
[null,"68.31","L","4","Real estate agencies"]
[null,"68.31.Z","L","5","Real estate agencies"]
[null,"68.32","L","4","Management of real estate on a fee or contract basis"]
[null,"68.32.Z","L","5","Management of real estate on a fee or contract basis"]
[null,"M","M","1","PROFESSIONAL, SCIENTIFIC AND TECHNICAL ACTIVITIES"]
[null,"69","M","2","LEGAL, ACCOUNTING, BOOKKEEPING AND AUDITING ACTIVITIES; TAX CONSULTANCY"]
[null,"69.1","M","3","Legal activities"]
[null,"69.10","M","4","Legal activities"]
[null,"69.10.Z","M","5","Legal activities"]
[null,"69.2","M","3","Accounting, bookkeeping and auditing activities; tax consultancy"]
[null,"69.20","M","4","Accounting, bookkeeping and auditing activities; tax consultancy"]
[null,"69.20.Z","M","5","Accounting, bookkeeping and auditing activities; tax consultancy"]
[null,"70","M","2","ACTIVITIES OF HEAD OFFICES; MANAGEMENT CONSULTANCY ACTIVITIES"]
[null,"70.1","M","3","Activities of head office and holding companies, excluding financial holding companies "]
[null,"70.10","M","4","Activities of head office and holding companies, excluding financial holding companies "]
[null,"70.10.Z","M","5","Activities of head office and holding companies, excluding financial holding companies "]
[null,"70.2","M","3","Management consultancy activities"]
[null,"70.21","M","4","Public relations and communication activities"]
[null,"70.21.Z","M","5","Public relations and communication activities"]
[null,"70.22","M","4","Business and other management consultancy activities"]
[null,"70.22.Z","M","5","Business and other management consultancy activities"]
[null,"71","M","2","ARCHITECTURAL AND ENGINEERING ACTIVITIES; TECHNICAL TESTING AND ANALYSIS"]
[null,"71.1","M","3","Architectural and engineering activities and related technical consultancy"]
[null,"71.11","M","4","Architectural activities "]
[null,"71.11.Z","M","5","Architectural activities "]
[null,"71.12","M","4","Engineering activities and related technical consultancy"]
[null,"71.12.Z","M","5","Engineering activities and related technical consultancy"]
[null,"71.2","M","3","Technical testing and analysis"]
[null,"71.20","M","4","Technical testing and analysis"]
[null,"71.20.A","M","5","Food quality testing and analysis"]
[null,"71.20.B","M","5","Other technical testing and analysis"]
[null,"72","M","2","SCIENTIFIC RESEARCH AND DEVELOPMENT "]
[null,"72.1","M","3","Research and experimental development on natural sciences and engineering"]
[null,"72.11","M","4","Research and experimental development on biotechnology"]
[null,"72.11.Z","M","5","Research and experimental development on biotechnology"]
[null,"72.19","M","4","Other research and experimental development on natural sciences and engineering"]
[null,"72.19.Z","M","5","Other research and experimental development on natural sciences and engineering"]
[null,"72.2","M","3","Research and experimental development on social sciences and humanities"]
[null,"72.20","M","4","Research and experimental development on social sciences and humanities"]
[null,"72.20.Z","M","5","Research and experimental development on social sciences and humanities"]
[null,"73","M","2","ADVERTISING AND MARKET RESEARCH"]
[null,"73.1","M","3","Advertising"]
[null,"73.11","M","4","Advertising agencies activities"]
[null,"73.11.Z","M","5","Advertising agencies activities"]
[null,"73.12","M","4","Media representation activities"]
[null,"73.12.A","M","5","Intermediation in the sale of time and place on advertising aims in the radio  and       television"]
[null,"73.12.B","M","5","Intermediation in the sale of the place on advertising aims in printed media"]
[null,"73.12.C","M","5","Intermediation in the sale of the place on advertising aims in electronic media (Internet)"]
[null,"73.12.D","M","5","Intermediation in the sale of the place on advertising aims in other media"]
[null,"73.2","M","3","Market research and public opinion polling"]
[null,"73.20","M","4","Market research and public opinion polling"]
[null,"73.20.Z","M","5","Market research and public opinion polling"]
[null,"74","M","2","OTHER PROFESSIONAL, SCIENTIFIC AND TECHNICAL ACTIVITIES"]
[null,"74.1","M","3","Specialised design activities"]
[null,"74.10","M","4","Specialised design activities"]
[null,"74.10.Z","M","5","Specialised design activities"]
[null,"74.2","M","3","Photographic activities"]
[null,"74.20","M","4","Photographic activities"]
[null,"74.20.Z","M","5","Photographic activities"]
[null,"74.3","M","3","Translation and interpretation activities"]
[null,"74.30","M","4","Translation and interpretation activities"]
[null,"74.30.Z","M","5","Translation and interpretation activities"]
[null,"74.9","M","3","Other professional, scientific and technical activities not elsewhere classified"]
[null,"74.90","M","4","Other professional, scientific and technical activities not elsewhere classified"]
[null,"74.90.Z","M","5","Other professional, scientific and technical activities not elsewhere classified"]
[null,"75","M","2","VETERINARY ACTIVITIES"]
[null,"75.0","M","3","Veterinary activities"]
[null,"75.00","M","4","Veterinary activities"]
[null,"75.00.Z","M","5","Veterinary activities"]
[null,"N","N","1","ADMINISTRATIVE AND SUPPORT SERVICE ACTIVITIES"]
[null,"77","N","2","RENTAL AND LEASING ACTIVITIES"]
[null,"77.1","N","3","Rental and leasing of motor vehicles excluding motorcycles"]
[null,"77.11","N","4","Rental and leasing of cars and light motor vehicles"]
[null,"77.11.Z","N","5","Rental and leasing of cars and light motor vehicles"]
[null,"77.12","N","4","Rental and leasing of other motor vehicle, excluding motorcycles"]
[null,"77.12.Z","N","5","Rental and leasing of other motor vehicle, excluding motorcycles"]
[null,"77.2","N","3","Rental and leasing of personal and household goods"]
[null,"77.21","N","4","Rental and leasing of recreational and sports goods"]
[null,"77.21.Z","N","5","Rental and leasing of recreational and sports goods"]
[null,"77.22","N","4","Rental of video tapes and  CDs, DVDs etc."]
[null,"77.22.Z","N","5","Rental of video tapes and  CDs, DVDs etc."]
[null,"77.29","N","4","Rental and leasing of other personal and household goods"]
[null,"77.29.Z","N","5","Rental and leasing of other personal and household goods"]
[null,"77.3","N","3","Rental and leasing of other machinery, equipment and tangible goods"]
[null,"77.31","N","4","Rental and leasing of agricultural machinery and equipment"]
[null,"77.31.Z","N","5","Rental and leasing of agricultural machinery and equipment"]
[null,"77.32","N","4","Rental and leasing of construction machinery and equipment"]
[null,"77.32.Z","N","5","Rental and leasing of construction machinery and equipment"]
[null,"77.33","N","4","Rental and leasing of office machinery and equipment, including computers"]
[null,"77.33.Z","N","5","Rental and leasing of office machinery and equipment, including computers"]
[null,"77.34","N","4","Rental and leasing of water transport equipment"]
[null,"77.34.Z","N","5","Rental and leasing of water transport equipment"]
[null,"77.35","N","4","Rental and leasing of air transport equipment"]
[null,"77.35.Z","N","5","Rental and leasing of air transport equipment"]
[null,"77.39","N","4","Rental and leasing of other machinery, equipment and tangible goods not elsewhere classified"]
[null,"77.39.Z","N","5","Rental and leasing of other machinery, equipment and tangible goods not elsewhere classified"]
[null,"77.4","N","3","Leasing of intellectual property and similar products, except copyrighted works"]
[null,"77.40","N","4","Leasing of intellectual property and similar products, except copyrighted works"]
[null,"77.40.Z","N","5","Leasing of intellectual property and similar products, except copyrighted works"]
[null,"78","N","2","EMPLOYMENT ACTIVITIES"]
[null,"78.1","N","3","Activities of employment placement agencies"]
[null,"78.10","N","4","Activities of employment placement agencies"]
[null,"78.10.Z","N","5","Activities of employment placement agencies"]
[null,"78.2","N","3","Temporary employment agency activities"]
[null,"78.20","N","4","Temporary employment agency activities"]
[null,"78.20.Z","N","5","Temporary employment agency activities"]
[null,"78.3","N","3","Other human resources provision"]
[null,"78.30","N","4","Other human resources provision"]
[null,"78.30.Z","N","5","Other human resources provision"]
[null,"79","N","2","TOUR OPERATOR, MIDDLEMEN, AGENTS AND OTHER RESERVATION SERVICE AND RELATED ACTIVITIES"]
[null,"79.1","N","3","Tour agents, middlemen and tour operators activities"]
[null,"79.11","N","4","Tour agents and middlemen activities"]
[null,"79.11.A","N","5","Tour agents activities"]
[null,"79.11.B","N","5","Tour middlemen activities"]
[null,"79.12","N","4","Tour operator activities"]
[null,"79.12.Z","N","5","Tour operator activities"]
[null,"79.9","N","3","Other reservation service and related activities"]
[null,"79.90","N","4","Other reservation service and related activities"]
[null,"79.90.A","N","5","Couriers on package tours and tour guides activities"]
[null,"79.90.B","N","5","Tourist information activities"]
[null,"79.90.C","N","5","Other reservation service activities not elsewhere classified"]
[null,"80","N","2","SECURITY AND INVESTIGATION ACTIVITIES"]
[null,"80.1","N","3","Private security activities, excluding security systems service activities"]
[null,"80.10","N","4","Private security activities, excluding security systems service activities"]
[null,"80.10.Z","N","5","Private security activities, excluding security systems service activities"]
[null,"80.2","N","3","Security systems service activities"]
[null,"80.20","N","4","Security systems service activities"]
[null,"80.20.Z","N","5","Security systems service activities"]
[null,"80.3","N","3","Investigation activities"]
[null,"80.30","N","4","Investigation activities"]
[null,"80.30.Z","N","5","Investigation activities"]
[null,"81","N","2","SERVICES TO BUILDINGS AND LANDSCAPE ACTIVITIES"]
[null,"81.1","N","3","Buildings service support activities"]
[null,"81.10","N","4","Buildings service support activities"]
[null,"81.10.Z","N","5","Buildings service support activities"]
[null,"81.2","N","3","Objects cleaning activities"]
[null,"81.21","N","4","General cleaning of buildings"]
[null,"81.21.Z","N","5","General cleaning of buildings"]
[null,"81.22","N","4","Specialised building and industrial cleaning activities"]
[null,"81.22.Z","N","5","Specialised building and industrial cleaning activities"]
[null,"81.29","N","4","Other cleaning activities"]
[null,"81.29.Z","N","5","Other cleaning activities"]
[null,"81.3","N","3","Landscape service activities"]
[null,"81.30","N","4","Landscape service activities"]
[null,"81.30.Z","N","5","Landscape service activities"]
[null,"82","N","2","OFFICE ADMINISTRATIVE SERVICE ACTIVITIES AND OTHER BUSINESS SUPPORT ACTIVITIES"]
[null,"82.1","N","3","Office administrative services activities, including support activities"]
[null,"82.11","N","4","Office administrative service activities"]
[null,"82.11.Z","N","5","Office administrative service activities"]
[null,"82.19","N","4","Photocopying, document preparation and other specialised office support activities"]
[null,"82.19.Z","N","5","Photocopying, document preparation and other specialised office support activities"]
[null,"82.2","N","3","Activities of call centres"]
[null,"82.20","N","4","Activities of call centres"]
[null,"82.20.Z","N","5","Activities of call centres"]
[null,"82.3","N","3","Organisation of conventions and trade shows"]
[null,"82.30","N","4","Organisation of conventions and trade shows"]
[null,"82.30.Z","N","5","Organisation of conventions and trade shows"]
[null,"82.9","N","3","Commercial activities not elsewhere classified"]
[null,"82.91","N","4","Activities of collection agencies and credit bureaus"]
[null,"82.91.Z","N","5","Activities of collection agencies and credit bureaus"]
[null,"82.92","N","4","Packaging activities"]
[null,"82.92.Z","N","5","Packaging activities"]
[null,"82.99","N","4","Other business support service activities not elsewhere classified"]
[null,"82.99.Z","N","5","Other business support service activities not elsewhere classified"]
[null,"O","O","1","PUBLIC ADMINISTRATION AND DEFENCE; COMPULSORY SOCIAL SECURITY"]
[null,"84","O","2","Public administration and defence; compulsory social security"]
[null,"84.1","O","3","Public administration and the economic and social policy of the community"]
[null,"84.11","O","4","General public administration activities"]
[null,"84.11.Z","O","5","General public administration activities"]
[null,"84.12","O","4","Regulation of the activities of providing health care, education, cultural services and other social services, excluding social security"]
[null,"84.12.Z","O","5","Regulation of the activities of providing health care, education, cultural services and other social services, excluding social security"]
[null,"84.13","O","4","Regulation of and contribution to more efficient operation of businesses"]
[null,"84.13.Z","O","5","Regulation of and contribution to more efficient operation of businesses"]
[null,"84.2","O","3","Provision of services to the community as a whole"]
[null,"84.21","O","4","Foreign affairs"]
[null,"84.21.Z","O","5","Foreign affairs"]
[null,"84.22","O","4","Defence activities"]
[null,"84.22.Z","O","5","Defence activities"]
[null,"84.23","O","4","Justice and judicial activities"]
[null,"84.23.Z","O","5","Justice and judicial activities"]
[null,"84.24","O","4","Public order and safety activities"]
[null,"84.24.Z","O","5","Public order and safety activities"]
[null,"84.25","O","4","Fire service activities"]
[null,"84.25.Z","O","5","Fire service activities"]
[null,"84.3","O","3","Compulsory social security activities"]
[null,"84.30","O","4","Compulsory social security activities"]
[null,"84.30.Z","O","5","Compulsory social security activities"]
[null,"P","P","1","EDUCATION"]
[null,"85","P","2","Education"]
[null,"85.1","P","3","Pre-primary education establishments "]
[null,"85.10","P","4","Pre-primary education establishments "]
[null,"85.10.Z","P","5","Pre-primary education establishments "]
[null,"85.2","P","3","Primary education"]
[null,"85.20","P","4","Primary education "]
[null,"85.20.Z","P","5","Primary education "]
[null,"85.3","P","3","Lower secondary schools, post lower secondary schools, post-primary schools, excluding post-secondary schools"]
[null,"85.31","P","4","Lower secondary schools and general upper secondary schools"]
[null,"85.31.A","P","5","Lower secondary schools"]
[null,"85.31.B","P","5","General upper secondary schools"]
[null,"85.32","P","4","Vocational upper secondary schools (technical secondary schools and sectoral vocational schools), excluding post-secondary schools"]
[null,"85.32.A","P","5","Technical secondary schools"]
[null,"85.32.B","P","5","Stage one sectoral vocational schools"]
[null,"85.32.C","P","5","Special job-training schools"]
[null,"85.32.D",null,null,"Stage two sectoral vocational schools"]
[null,"85.4","P","3","Post-secondary schools and higher education institutions"]
[null,"85.41","P","4","Post-secondary schools, colleges of social work, initial teacher training institutions"]
[null,"85.41.A",null,null,"Post-secondary schools"]
[null,"85.41.B",null,null,"Colleges of social work"]
[null,"85.41.C",null,null,"Initial teacher training institutions"]
[null,"85.42","P","4","Higher education institutions"]
[null,"85.42.Z","P","5","Higher education institutions"]
[null,"85.5","P","3","Out-of-school forms of education"]
[null,"85.51","P","4","Out-of-school forms of sports and leisure education"]
[null,"85.51.Z","P","5","Out-of-school forms of sports and leisure education"]
[null,"85.52","P","4","Out-of-school forms of cultural education"]
[null,"85.52.Z","P","5","Out-of-school forms of cultural education"]
[null,"85.53","P","4","Out-of-school forms of driving education"]
[null,"85.53.Z","P","5","Out-of-school forms of driving education"]
[null,"85.59","P","4","Out-of-school forms of education, not elsewhere classified"]
[null,"85.59.A","P","5","Learning foreign languages"]
[null,"85.59.B","P","5","Other out-of-school forms of education, not elsewhere classified"]
[null,"85.6","P","3","Educational support activities"]
[null,"85.60","P","4","Educational support activities"]
[null,"85.60.Z","P","5","Educational support activities"]
[null,"Q","Q","1","HUMAN HEALTH AND SOCIAL WORK ACTIVITIES"]
[null,"86","Q","2","HUMAN HEALTH ACTIVITIES"]
[null,"86.1","Q","3","Hospital activities"]
[null,"86.10","Q","4","Hospital activities"]
[null,"86.10.Z","Q","5","Hospital activities"]
[null,"86.2","Q","3","Medical and dental practice activities"]
[null,"86.21","Q","4","General medical practice activities"]
[null,"86.21.Z","Q","5","General medical practice activities"]
[null,"86.22","Q","4","Specialist medical practice activities"]
[null,"86.22.Z","Q","5","Specialist medical practice activities"]
[null,"86.23","Q","4","Dental practice activities"]
[null,"86.23.Z","Q","5","Dental practice activities"]
[null,"86.9","Q","3","Other human health activities"]
[null,"86.90","Q","4","Other human health activities"]
[null,"86.90.A","Q","5","Physiotherapeutical activities"]
[null,"86.90.B","Q","5","Emergency ambulance activities"]
[null,"86.90.C","Q","5","Nurses and midwives activities"]
[null,"86.90.D","Q","5","Paramedical activities"]
[null,"86.90.E","Q","5","Other human health activities not elsewhere classified"]
[null,"87","Q","2","RESIDENTIAL CARE ACTIVITIES"]
[null,"87.1","Q","3","Residential nursing care activities"]
[null,"87.10","Q","4","Residential nursing care activities"]
[null,"87.10.Z","Q","5","Residential nursing care activities"]
[null,"87.2","Q","3","Residential care activities for mental retardation, mental health and substance abuse"]
[null,"87.20","Q","4","Residential care activities for mental retardation, mental health and substance abuse"]
[null,"87.20.Z","Q","5","Residential care activities for mental retardation, mental health and substance abuse"]
[null,"87.3","Q","3","Residential care activities for the elderly and disabled"]
[null,"87.30","Q","4","Residential care activities for the elderly and disabled"]
[null,"87.30.Z","Q","5","Residential care activities for the elderly and disabled"]
[null,"87.9","Q","3","Other residential care activities"]
[null,"87.90","Q","4","Other residential care activities"]
[null,"87.90.Z","Q","5","Other residential care activities"]
[null,"88","Q","2","SOCIAL WORK ACTIVITIES WITHOUT ACCOMMODATION"]
[null,"88.1","Q","3","Social work activities without accommodation for the elderly and disabled"]
[null,"88.10","Q","4","Social work activities without accommodation for the elderly and disabled"]
[null,"88.10.Z","Q","5","Social work activities without accommodation for the elderly and disabled"]
[null,"88.9","Q","3","Other social work activities without accommodation"]
[null,"88.91","Q","4","Child day-care activities"]
[null,"88.91.Z","Q","5","Child day-care activities"]
[null,"88.99","Q","4","Other social work activities without accommodation not elsewhere classified"]
[null,"88.99.Z","Q","5","Other social work activities without accommodation not elsewhere classified"]
[null,"R","R","1","ARTS, ENTERTAINMENT AND RECREATION ACTIVITIES"]
[null,"90","R","2","CREATIVE, ARTS AND ENTERTAINMENT ACTIVITIES"]
[null,"90.0","R","3","Creative, arts and entertainment activities"]
[null,"90.01","R","4","Performing arts activities"]
[null,"90.01.Z","R","5","Performing arts activities"]
[null,"90.02","R","4","Support activities to performing arts"]
[null,"90.02.Z","R","5","Support activities to performing arts"]
[null,"90.03","R","4","Artistic creation activities"]
[null,"90.03.Z","R","5","Artistic creation activities"]
[null,"90.04","R","4","Operation of arts facilities"]
[null,"90.04.Z","R","5","Operation of arts facilities"]
[null,"91","R","2","LIBRARIES, ARCHIVES, MUSEUMS AND OTHER CULTURAL ACTIVITIES"]
[null,"91.0","R","3","LIBRARIES, ARCHIVES, MUSEUMS AND OTHER CULTURAL ACTIVITIES"]
[null,"91.01","R","4","Library and archives activities"]
[null,"91.01.A","R","5","Library activities"]
[null,"91.01.B","R","5","Archives activities"]
[null,"91.02","R","4","Museums activities"]
[null,"91.02.Z","R","5","Museums activities"]
[null,"91.03","R","4","Operation of historical sites and buildings and similar visitor attractions"]
[null,"91.03.Z","R","5","Operation of historical sites and buildings and similar visitor attractions"]
[null,"91.04","R","4","Botanical and zoological gardens and nature reserves activities"]
[null,"91.04.Z","R","5","Botanical and zoological gardens and nature reserves activities"]
[null,"92","R","2","GAMBLING AND BETTING ACTIVITIES"]
[null,"92.0","R","3","Gambling and betting activities"]
[null,"92.00","R","4","Gambling and betting activities"]
[null,"92.00.Z","R","5","Gambling and betting activities"]
[null,"93","R","2","SPORTS ACTIVITIES AND AMUSEMENT AND RECREATION ACTIVITIES"]
[null,"93.1","R","3","Sports activities"]
[null,"93.11","R","4","Operation of sports facilities"]
[null,"93.11.Z","R","5","Operation of sports facilities"]
[null,"93.12","R","4","Activities of sports clubs"]
[null,"93.12.Z","R","5","Activities of sports clubs"]
[null,"93.13","R","4","Operation of fitness facilities"]
[null,"93.13.Z","R","5","Operation of fitness facilities"]
[null,"93.19","R","4","Other sports activities"]
[null,"93.19.Z","R","5","Other sports activities"]
[null,"93.2","R","3","Amusement and recreation activities"]
[null,"93.21","R","4","Activities of amusement parks and theme parks"]
[null,"93.21.Z","R","5","Activities of amusement parks and theme parks"]
[null,"93.29","R","4","Other amusement and recreation activities"]
[null,"93.29.A","R","5","Operation of mystery rooms, horror houses, dance floors, and other forms of amusement and recreation held indoors or in other premises with enclosed spaces"]
[null,"93.29.B",null,null,"Other amusement and recreation activities, n.e.c."]
[null,"S","S","1","OTHER SERVICE ACTIVITIES"]
[null,"94","S","2","ACTIVITIES OF MEMBERSHIP ORGANISATIONS"]
[null,"94.1","S","3","Activities of commercial, employers and professional organisations"]
[null,"94.11","S","4","Activities of commercial and employers organisations"]
[null,"94.11.Z","S","5","Activities of commercial and employers organisations"]
[null,"94.12","S","4","Activities of professional organisations"]
[null,"94.12.Z","S","5","Activities of professional organisations"]
[null,"94.2","S","3","Activities of trade unions"]
[null,"94.20","S","4","Activities of trade unions"]
[null,"94.20.Z","S","5","Activities of trade unions"]
[null,"94.9","S","3","Activities of other membership organisations"]
[null,"94.91","S","4","Activities of religious organisations"]
[null,"94.91.Z","S","5","Activities of religious organisations"]
[null,"94.92","S","4","Activities of political organisations"]
[null,"94.92.Z","S","5","Activities of political organisations"]
[null,"94.99","S","4","Activities of other membership organisations not elsewhere classified"]
[null,"94.99.Z","S","5","Activities of other membership organisations not elsewhere classified"]
[null,"95","S","2","REPAIR AND MAINTENANCE OF COMPUTERS AND PERSONAL AND HOUSEHOLD GOODS"]
[null,"95.1","S","3","Repair and maintenance of computers and communication equipment"]
[null,"95.11","S","4","Repair and maintenance of computers and peripheral equipment"]
[null,"95.11.Z","S","5","Repair and maintenance of computers and peripheral equipment"]
[null,"95.12","S","4","Repair and maintenance of (tele)communication equipment"]
[null,"95.12.Z","S","5","Repair and maintenance of (tele)communication equipment"]
[null,"95.2","S","3","Repair and maintenance of personal and household goods"]
[null,"95.21","S","4","Repair and maintenance of consumer electronics"]
[null,"95.21.Z","S","5","Repair and maintenance of consumer electronics"]
[null,"95.22","S","4","Repair and maintenance of household appliances and home and garden equipment"]
[null,"95.22.Z","S","5","Repair and maintenance of household appliances and home and garden equipment"]
[null,"95.23","S","4","Repair of footwear and leather goods"]
[null,"95.23.Z","S","5","Repair of footwear and leather goods"]
[null,"95.24","S","4","Repair and maintenance of furniture and home furnishings"]
[null,"95.24.Z","S","5","Repair and maintenance of furniture and home furnishings"]
[null,"95.25","S","4","Repair of watches, clocks and jewellery"]
[null,"95.25.Z","S","5","Repair of watches, clocks and jewellery"]
[null,"95.29","S","4","Repair of other personal and household goods"]
[null,"95.29.Z","S","5","Repair of other personal and household goods"]
[null,"96","S","2","OTHER PERSONAL SERVICE ACTIVITIES"]
[null,"96.0","S","3","Other personal service activities"]
[null,"96.01","S","4","Washing and (dry-)cleaning of textile and fur products"]
[null,"96.01.Z","S","5","Washing and (dry-)cleaning of textile and fur products"]
[null,"96.02","S","4","Hairdressing and other beauty treatment"]
[null,"96.02.Z","S","5","Hairdressing and other beauty treatment"]
[null,"96.03","S","4","Funeral and related activities"]
[null,"96.03.Z","S","5","Funeral and related activities"]
[null,"96.04","S","4","Physical well-being activities"]
[null,"96.04.Z","S","5","Physical well-being activities"]
[null,"96.09","S","4","Other personal service activities not elsewhere classified"]
[null,"96.09.Z","S","5","Other personal service activities not elsewhere classified"]
[null,"T","T","1","HOUSEHOLDS AS EMPLOYERS;  GOODS- AND SERVICES-PRODUCING ACTIVITIES OF HOUSEHOLDS FOR OWN USE"]
[null,"97","T","2","HOUSEHOLDS AS EMPLOYERS OF DOMESTIC PERSONNEL"]
[null,"97.0","T","3","Households as employers of domestic personnel"]
[null,"97.00","T","4","Households as employers of domestic personnel"]
[null,"97.00.Z","T","5","Households as employers of domestic personnel"]
[null,"98","T","2","GOODS- AND SERVICES-PRODUCING ACTIVITIES OF HOUSEHOLDS FOR OWN USE"]
[null,"98.1","T","3","Goods-producing activities of private households for own use"]
[null,"98.10","T","4","Goods-producing activities of private households for own use"]
[null,"98.10.Z","T","5","Goods-producing activities of private households for own use"]
[null,"98.2","T","3","Service-producing activities of private households for own use"]
[null,"98.20","T","4","Service-producing activities of private households for own use"]
[null,"98.20.Z","T","5","Service-producing activities of private households for own use"]
[null,"U","U","1","EXTRATERRITORIAL ORGANISATIONS AND BODIES"]
[null,"99","U","2","EXTRATERRITORIAL ORGANISATIONS AND BODIES"]
[null,"99.0","U","3","Extraterritorial organisations and bodies"]
[null,"99.00","U","4","Extraterritorial organisations and bodies"]
[null,"99.00.Z","U","5","Extraterritorial organisations and bodies"]
[null,"99.00.Z","Extraterritorial organisations and bodies"]