{"text_format":"1","workbook":"xlsx","n_sheets":5,"sheets":["Formularz","Załącznik 1 - Kryteria ","Załącznik 2 - Procesy","Back","Załącznik 3 - kody PKD"],"not_rendered":{"charts":0,"images":4,"macros":1,"external_links":0,"defined_names":60,"comments":1,"pivot_tables":0},"unopened":[],"bounds":{"document_bytes":16777216,"sheet_cells":100000,"rows_first":2000,"rows_last":500,"rows_between":2000,"halvings":0,"cell_chars":16384,"cell_head_chars":4096},"cells_cut":0,"cells_raw":0,"read":"whole","date_system":"1900"}

{"sheet":"Formularz","index":0,"n_rows":342,"n_cols":11,"rows_kept":342,"cut":false,"hidden":false,"merged":[[127,0,127,2],[128,0,128,2],[129,0,129,2],[129,4,129,9],[131,1,131,2],[131,3,131,10],[119,6,119,10],[115,1,115,7],[116,1,116,7],[117,1,117,7],[114,1,114,7],[106,1,106,7],[159,2,159,7],[159,8,159,9],[120,0,122,0],[127,4,127,9],[128,4,128,9],[146,6,146,8],[145,6,145,8],[147,6,147,8],[147,9,147,10],[145,1,147,5],[125,4,125,9],[145,0,147,0],[125,0,125,3],[146,9,146,10],[152,2,152,3],[150,1,150,10],[130,1,130,2],[126,4,126,9],[110,1,110,7],[105,1,105,7],[93,2,93,6],[94,2,94,6],[93,7,93,8],[94,7,94,8],[102,6,102,9],[91,1,91,5],[91,6,91,10],[107,1,107,7],[108,1,108,7],[226,3,226,5],[226,6,226,8],[226,9,226,10],[225,9,225,10],[222,3,222,5],[222,6,222,8],[222,9,222,10],[223,3,223,5],[223,6,223,8],[223,9,223,10],[220,3,220,5],[220,6,220,8],[220,9,220,10],[221,3,221,5],[221,6,221,8],[221,9,221,10],[61,3,61,8],[61,1,61,2],[267,1,267,5],[267,6,267,10],[266,4,266,5],[266,6,266,10],[229,9,229,10],[232,1,233,10],[243,2,243,3],[225,3,225,5],[225,6,225,8],[213,9,213,10],[216,3,216,5],[216,6,216,8],[216,9,216,10],[217,3,217,5],[217,6,217,8],[217,9,217,10],[279,9,279,10],[120,1,122,5],[120,6,122,10],[253,1,253,10],[255,1,255,7],[230,3,230,5],[230,6,230,8],[230,9,230,10],[231,3,231,5],[231,6,231,8],[231,9,231,10],[273,2,273,3],[273,4,273,5],[273,6,273,7],[268,0,268,1],[268,2,268,3],[268,4,268,5],[268,6,268,7],[273,8,273,10],[228,3,228,5],[228,6,228,8],[228,9,228,10],[229,3,229,5],[229,6,229,8],[292,6,292,10],[289,1,289,10],[277,6,277,7],[278,6,278,7],[279,6,279,7],[280,6,280,7],[281,6,281,7],[278,0,278,1],[278,2,278,3],[290,1,290,8],[291,1,291,8],[289,0,291,0],[290,9,290,10],[291,9,291,10],[281,0,281,1],[281,2,281,3],[280,4,280,5],[281,9,281,10],[277,9,277,10],[292,1,292,5],[283,1,283,5],[283,6,283,10],[280,0,280,1],[280,2,280,3],[305,6,305,10],[185,1,185,10],[187,2,187,3],[187,4,187,5],[187,6,187,7],[188,2,188,3],[188,4,188,5],[188,6,188,7],[234,1,234,5],[235,1,235,5],[236,1,236,10],[234,6,234,10],[235,6,235,10],[243,4,243,5],[243,6,243,7],[239,2,239,3],[240,2,240,3],[238,2,238,3],[227,3,227,5],[227,6,227,8],[227,9,227,10],[224,3,224,5],[224,6,224,8],[224,9,224,10],[308,0,308,10],[266,1,266,3],[263,0,264,0],[248,2,248,3],[248,4,248,6],[248,7,248,8],[245,1,245,10],[247,7,247,8],[247,4,247,6],[247,2,247,3],[258,1,258,7],[259,1,260,7],[260,8,260,9],[287,1,287,5],[287,6,287,10],[265,1,265,10],[280,9,280,10],[276,0,276,1],[278,4,278,5],[278,9,278,10],[279,0,279,1],[279,2,279,3],[279,4,279,5],[281,4,281,5],[330,0,330,10],[338,0,338,10],[103,0,118,0],[104,1,104,10],[103,1,103,10],[105,9,118,10],[118,1,118,8],[305,1,305,5],[310,1,310,5],[310,6,310,10],[252,0,252,10],[253,0,262,0],[296,2,296,7],[297,2,297,7],[299,1,299,10],[293,1,293,10],[295,2,295,7],[256,1,256,7],[241,2,241,3],[242,2,242,3],[238,6,238,7],[239,4,239,5],[123,1,123,10],[312,0,312,10],[340,7,340,9],[56,5,56,10],[71,5,71,10],[149,0,149,10],[150,0,159,0],[161,0,170,0],[192,0,192,10],[336,2,336,3],[332,4,332,9],[333,4,333,9],[334,4,334,9],[335,4,335,9],[336,4,336,9],[332,2,332,3],[333,2,333,3],[334,2,334,3],[335,2,335,3],[276,2,276,3],[276,4,276,5],[276,6,276,7],[276,9,276,10],[293,0,298,0],[299,0,304,0],[272,8,272,10],[269,8,269,10],[270,8,270,10],[271,8,271,10],[263,1,264,5],[263,6,264,10],[257,1,257,7],[238,4,238,5],[239,6,239,7],[240,4,240,5],[277,0,277,1],[277,2,277,3],[277,4,277,5],[240,6,240,7],[241,4,241,5],[241,6,241,7],[242,4,242,5],[242,6,242,7],[271,2,271,3],[271,4,271,5],[271,6,271,7],[272,0,272,1],[272,2,272,3],[272,4,272,5],[272,6,272,7],[273,0,273,1],[269,6,269,7],[270,0,270,1],[270,2,270,3],[270,4,270,5],[269,0,269,1],[269,2,269,3],[269,4,269,5],[16,1,28,9],[30,0,30,10],[48,1,48,4],[56,1,56,4],[35,2,35,3],[36,2,36,3],[35,4,35,5],[48,5,48,10],[35,6,35,7],[33,1,33,10],[33,0,37,0],[38,0,42,0],[38,1,38,10],[40,2,40,3],[40,4,40,5],[40,6,40,7],[41,2,41,3],[41,4,41,5],[41,6,41,7],[54,7,54,8],[49,1,49,4],[49,5,49,10],[45,2,45,3],[45,4,45,5],[6,0,8,9],[0,0,0,10],[1,0,1,10],[3,1,3,10],[4,1,4,10],[15,0,15,9],[9,0,10,9],[11,0,11,10],[12,0,12,8],[13,0,13,8],[14,0,14,8],[36,4,36,5],[36,6,36,7],[78,1,78,2],[80,1,80,2],[31,1,31,4],[53,3,53,4],[58,1,58,8],[59,1,59,8],[60,1,60,8],[62,1,62,8],[31,5,31,10],[32,1,32,4],[32,5,32,10],[73,5,73,10],[74,5,74,10],[64,1,64,10],[75,5,75,10],[79,1,79,2],[76,1,76,10],[75,1,75,4],[51,1,51,10],[45,6,45,7],[46,2,46,3],[68,4,68,8],[286,6,286,10],[286,1,286,5],[210,3,210,5],[210,6,210,8],[210,9,210,10],[211,3,211,5],[212,3,212,5],[212,6,212,8],[209,9,209,10],[209,6,209,8],[209,3,209,5],[218,3,218,5],[218,6,218,8],[218,9,218,10],[219,3,219,5],[219,6,219,8],[219,9,219,10],[212,9,212,10],[214,3,214,5],[214,6,214,8],[214,9,214,10],[215,3,215,5],[215,6,215,8],[215,9,215,10],[43,0,47,0],[43,1,43,10],[71,0,72,0],[72,1,72,4],[72,5,72,10],[85,0,85,2],[86,0,86,2],[58,9,58,10],[59,9,59,10],[60,9,60,10],[62,9,62,10],[57,1,57,10],[83,1,83,10],[64,0,70,0],[65,4,65,8],[66,4,66,8],[67,4,67,8],[71,1,71,4],[73,1,73,4],[74,1,74,4],[56,0,57,0],[48,0,49,0],[76,0,82,0],[180,9,180,10],[180,6,180,7],[205,1,205,9],[179,3,179,4],[180,3,180,4],[190,1,190,3],[190,4,190,9],[158,2,158,7],[46,4,46,5],[46,6,46,7],[198,1,198,7],[199,1,199,7],[200,1,200,7],[201,1,201,7],[202,1,203,9],[195,1,195,7],[196,1,196,7],[197,1,197,7],[194,1,194,9],[119,1,119,5],[111,1,111,7],[112,1,112,7],[113,1,113,7],[109,1,109,7],[132,1,132,10],[135,1,135,7],[153,2,153,3],[154,2,154,3],[155,2,155,3],[342,6,345,9],[166,4,166,9],[167,4,167,9],[168,4,168,9],[178,3,178,4],[177,6,177,7],[178,6,178,7],[179,6,179,7],[207,1,207,10],[183,1,183,5],[183,6,183,10],[184,1,184,5],[184,6,184,10],[166,2,166,3],[173,3,173,4],[174,3,174,4],[284,1,284,5],[284,6,284,10],[171,1,171,10],[285,1,285,5],[315,9,315,10],[316,9,316,10],[316,0,316,8],[317,0,317,8],[327,1,327,8],[283,0,285,0],[285,6,285,10],[143,1,143,7],[173,6,173,7],[176,6,176,7],[317,9,317,10],[323,0,323,8],[323,9,323,10],[324,0,324,8],[324,9,324,10],[144,1,144,10],[174,6,174,7],[153,4,153,9],[154,4,154,9],[155,4,155,9],[213,3,213,5],[213,6,213,8],[158,8,158,9],[141,1,141,7],[142,1,142,7],[165,2,165,3],[175,3,175,4],[176,3,176,4],[167,2,167,3],[168,2,168,3],[268,8,268,10],[211,6,211,8],[211,9,211,10],[165,4,165,9],[156,2,156,3],[157,2,157,3],[161,1,161,10],[164,2,164,3],[164,4,164,9],[152,4,152,9],[145,9,145,10],[156,4,156,9],[157,4,157,9],[177,3,177,4],[169,4,169,9],[169,2,169,3],[181,2,181,10],[65,1,69,3],[69,4,69,8],[261,1,261,5],[261,6,261,10],[314,1,314,10],[315,0,315,8],[53,5,53,6],[54,5,54,6],[50,1,50,10],[54,3,54,4],[54,1,54,2],[81,1,81,2],[87,0,87,2],[88,0,88,2],[126,0,126,2],[136,1,136,7],[137,1,137,7],[138,1,138,7],[139,1,139,7],[51,0,55,0],[270,6,270,7],[271,0,271,1],[175,6,175,7],[140,1,140,7],[328,1,328,8],[327,9,327,10],[328,9,328,10],[326,0,326,10],[318,0,318,8],[319,0,319,8],[320,0,320,8],[321,0,321,8],[322,0,322,8],[318,9,318,10],[319,9,319,10],[320,9,320,10],[321,9,321,10],[322,9,322,10]]}
["Program wspierania inwestycji o istotnym znaczeniu dla polskiej gospodarki na lata 2011-2030"]
["nr uchwały Programu 91/2023"]
[]
[null,"Aplikacja - Informacja o Projekcie"]
[]
[]
["Dokument Informacja o Projekcie stanowi formularz aplikacyjny na podstawie którego Polska Agencja Inwestycji i Handlu S.A. (dalej: \"PAIH\") dokonuje analizy przedstawionych przez inwestora danych pod kątem spełnienia wymogów formalnych Programu oraz rzetelności i realności podanych informacji o projekcie inwestycyjnym. W przypadku potrzeby zweryfikowania niektórych danych lub dokonania koniecznych uzupełnień PAIH może zwrócić się do inwestora (zamiennie w fomularzu jako \"beneficjent\") o złożenie pisemnych wyjaśnień lub korekt. "]
[]
[]
["INSTRUKCJA:\n1.\tFormularz powinien zostać wypełniony w języku polskim. \n2.\tFormularz powinien zostać wypełniony wyłącznie w miejscach do tego wyznaczonych. Pola instrukcji nie powinny być modyfikowane.                                                                                                                                                                                  3. Formularz powinien zostać wydrukowany i podpisany przez osoby upoważnione do reprezentowania inwestora oraz przesłany na adres PAIH, ul. Krucza 50, 00-025 Warszawa. Alternatywnie, formularz może zostać sporządzony w formie PDF podpisanej podpisem kwalifikowanym oraz przesłany na adres e-mailowy: grant@paih.gov.pl. \n4.\tNiezależnie od złożenia formularza w jednej z dwóch form wskazanych w powyższym punkcie 2. formularz należy również przesłać w formacie XLS na adres e-mailowy: grant@paih.gov.pl. \n5.\tLegenda kolorystyki: \n-\tkolor niebieski: wybierana lista,\n-\tkolor czerwony: automatyczne sumowanie wyników – pól nie należy wypełniać,\n-\tkolor zielony: pola zawierające dodatkowe objaśnienia. "]
[]
["5.\tPoprawnie złożony formularz musi zawierać: (Proszę zaznaczyć dołączone do formularza załączniki).\n'-\tkarta arkusza \"Załącznik 1 - Kryteria\","]
["-informacja z Systemu Udostępniania Danych o Pomocy Publicznej (SUDOP) o inwestycjach wspartych pomocą publiczną, rozpoczętych przez tego samego beneficjenta (na poziomie grupy) w okresie ostatnich 3 lat,"]
["-odpis aktualny z Krajowego Rejestru Sądowego (KRS), wydruk z Centralnej Ewidencji i Informacji o Działalności Gospodarczej (CEiDG), pełnomocnictwo, umowa spółki lub inny równoważny dokument z którego wynika umocowanie osoby podpisującej formularz, "]
["-\tAnaliza efektu zachęty - w przypadku posiadania statusu dużego przedsiębiorcy lub rozwijającego się przedsiębiorcy"]
["Podstawa prawna:\n-\tUchwała nr 91/2023 Rady Ministrów z dnia wraz z Załącznikiem \"Program wspierania inwestycji o istotnym znaczeniu dla gospodarki polskiej na lata 2011-2030\";\n-\tRozporządzenie Komisji (UE) nr 651/2014 z dnia 17 czerwca 2014 r. uznające niektóre rodzaje pomocy za zgodne z rynkiem wewnętrznym w zastosowaniu art. 107 i 108 Traktatu ."]
[]
[]
[]
[]
[]
[]
[]
[]
[]
[]
[]
[]
[]
[]
["I. Informacje o nowym projekcie"]
[1,"Nazwa beneficjenta (jeśli spółka nie jest zarejestrowana w Polsce, nazwa spółki, która aplikuje w imieniu beneficjenta)"]
[2,"Wielkość przedsiębiorstwa na poziomie grupy "]
[3,"Suma bilansowa za ostatnie 3 lata na poziomie grupy"]
[]
[null,null,"Rok",null,{"$f":"B_Start_3","v":"2021-05-07"},null,{"$f":"B_Start_2","v":"2022-05-07"},null,{"$f":"B_Start_1","v":"2023-05-07"}]
[null,null,"Suma bilansowa (EUR)",null,0,null,0,null,0]
[]
[4,"Obroty za ostatnie 3 lata – na poziomie grupy"]
[]
[null,null,"Rok",null,{"$f":"B_Start_3","v":"2021-05-07"},null,{"$f":"B_Start_2","v":"2022-05-07"},null,{"$f":"B_Start_1","v":"2023-05-07"}]
[null,null,"Obroty (EUR)",null,0,null,0,null,0]
[]
[5,"Liczba miejsc pracy za ostatnie 3 lata – na poziomie grupy"]
[]
[null,null,"Rok",null,{"$f":"B_Start_3","v":"2021-05-07"},null,{"$f":"B_Start_2","v":"2022-05-07"},null,{"$f":"B_Start_1","v":"2023-05-07"}]
[null,null,"Liczba miejsc pracy"]
[]
[6,"Typ inwestycji"]
[null,"Koszty kwalifikowane (PLN)"]
[null,{"$f":"Text_BusinessProcessesPrompt","v":""}]
[7,"Lokalizacja "]
[]
[null,"Województwo:",null,"Region NUTS 3:",null,null,null,"Powiat:"]
[null,"Gmina:",null,null,null,"Miejscowość:"]
[]
[8,"Czy lokalizacja zagrożona wykluczeniem? Jeżeli \"Tak\" - Proszę zaznaczyć podstawę wykluczenia"]
[null,"Podstawa wykluczenia:"]
[null,"a) w mieście średnim tracącym funkcje społeczno-gospodarcze, wymienionym w tabeli nr 3 w załączniku nr 1 do rozporządzenia Rady Ministrów z dnia 27 grudnia 2022 r. w sprawie pomocy publicznej udzielanej niektórym przedsiębiorcom na realizację nowych inwestycji (Dz. U. poz. 2861) "]
[null,"b) w gminie, na terenie której położone jest to miasto, o którym mowa w lit. a)"]
[null,"c) w gminie graniczącej z miastem, o którym mowa w lit. a) lub z gminą, o której mowa w lit. b)"]
[null,"Nazwa miasta, o którym mowa w lit. a) lub gminy, o której mowa w lit. b):"]
[null,"d) na obszarze powiatów lub miast na prawach powiatu, w którym stopa bezrobocia wynosi co najmniej 160% przeciętnej stopy bezrobocia w kraju"]
[]
[9,"Rodzaj inwestycji (można zaznaczyć więcej niż jedną odpowiedź)"]
[null,"Inwestycja początkowa ",null,null,{"$f":"EIT_1","v":"utworzenie nowego zakładu"}]
[null,null,null,null,{"$f":"EIT_2","v":"zwiększenie zdolności produkcyjnej istniejącego zakładu"}]
[null,null,null,null,{"$f":"EIT_3","v":"dywersyfikacja produkcji poprzez wprowadzenie produktów lub usług dotąd niewytwarzanych lub nieświadczonych przez ten zakład"}]
[null,null,null,null,{"$f":"EIT_4","v":"zasadnicza zmiana całościowego procesu produkcji produktu lub produktów, których dotyczy inwestycja w ten zakład"}]
[null,null,null,null,{"$f":"EIT_5","v":"nabycie aktywów należących do zakładu, który został zamknięty lub zostałby zamknięty, gdyby zakup nie nastąpił. Samo nabycie akcji lub udziałów przedsiębiorstwa nie stanowi inwestycji początkowej. Inwestycja odtworzeniowa nie stanowi zatem inwestycji początkowej"}]
[]
[10,"Czy projekt stanowi reinwestycję?"]
[null,"Liczba istniejących miejsc pracy w zakładzie w ciągu 12 miesięcy przed dniem złożenia wniosku o udzielenie pomocy publicznej:"]
[11,"Data rozpoczęcia projektu"]
[12,"Data zakończenia projektu"]
[13,"Czas trwania projektu (w latach)",null,null,null,{"$f":"ROUNDUP(IF((Project_End_Date-Project_Start_Date)/365=0,\" \",(Project_End_Date-Project_Start_Date)/365),0)","v":{"$error":"#VALUE!"}}]
["14","Nakłady inwestycyjne wg podziału na kategorie kosztów kwalifikowanych w rozbiciu na poszczególne lata (PLN) "]
[]
[null,"Rok",null,{"$f":"IF(Project_Start_Date=0,\" \",Project_Start_Date)","v":" "},{"$f":"A_Start_1","v":""},{"$f":"A_Start_2","v":""},{"$f":"A_Start_3","v":""},{"$f":"A_Start_4","v":""},{"$f":"A_Start_5","v":""},{"$f":"A_Start_6","v":""},"Łącznie"]
[null,"Nakłady na rzeczowe aktywa trwałe ",null,0,0,0,0,0,0,0,{"$f":"SUM(B80:J81)","v":0}]
[null,"Nakłady na wartości niematerialne i prawne ",null,0,0,0,0,0,0,0,{"$f":"SUM(B81:J82)","v":0}]
[null,"Razem",null,{"$f":"D80+D81","v":0},{"$f":"E80+E81","v":0},0,0,0,0,null,{"$f":"K80+K81","v":0}]
[]
[15,"Nowe miejsca pracy"]
[]
["Rok",null,null,{"$f":"IF(Project_Start_Date=0,\" \",Project_Start_Date)","v":" "},{"$f":"A_Start_1","v":""},{"$f":"A_Start_2","v":""},{"$f":"A_Start_3","v":""},{"$f":"A_Start_4","v":""},{"$f":"A_Start_5","v":""},{"$f":"A_Start_6","v":""},"Łącznie"]
["Liczba planowanych do utworzenia miejsc pracy netto (pełnych etatów) – pracownicy bez wyższego wykształcenia ",null,null,null,null,null,null,null,null,null,{"$f":"SUM(D87:J87)","v":0}]
["Liczba planowanych do utworzenia miejsc pracy netto (pełnych etatów) – pracownicy z wyższym wykształceniem ",null,null,null,null,null,null,null,null,null,{"$f":"SUM(D88:J88)","v":0}]
["Razem",null,null,{"$f":"D87+D88","v":0},0,0,0,0,0,0,0]
[]
[]
[16,"Zwiększenie wsparcia w związku ze szkoleniami"]
[]
[null,null,"Liczba pracowników objętych szkoleniami (nie większa niż liczba nowo tworzonych miejsc pracy) "]
[null,null,"Wartość szkoleń w przeliczeniu na jedną osobę  "]
[]
[]
[]
[]
[]
[]
[]
[]
[19,"Kryteria jakościowe "]
[]
[null,"Kryterium",null,null,null,null,null,null,"Deklaracja"]
[null,{"$f":"IF(Cost_Type=2,'Załącznik 1 - Kryteria '!A7,'Załącznik 1 - Kryteria '!A25)","v":"1. Inwestycja w sektorze strategicznym"}]
[null,{"$f":"IF(Cost_Type=2,'Załącznik 1 - Kryteria '!A8,'Załącznik 1 - Kryteria '!A26)","v":"2. Wykorzystanie potencjału zasobów ludzkich"}]
[null,{"$f":"IF(Cost_Type=2,'Załącznik 1 - Kryteria '!A9,'Załącznik 1 - Kryteria '!A27)","v":"3. Robotyzacja i automatyzacja procesów "}]
[null,{"$f":"IF(Cost_Type=2,'Załącznik 1 - Kryteria '!A10,'Załącznik 1 - Kryteria '!A28)","v":"4. Prowadzenie działalności B+R"}]
[null,{"$f":"IF(Cost_Type=2,'Załącznik 1 - Kryteria '!A11,'Załącznik 1 - Kryteria '!A29)","v":"5. Inwestycja w OZE"}]
[null,{"$f":"IF(Cost_Type=2,'Załącznik 1 - Kryteria '!A12,'Załącznik 1 - Kryteria '!A30)","v":"6. Posiadanie statusu:\nmikro-, małego albo średniego przedsiębiorcy"}]
[null,{"$f":"IF(Cost_Type=2,'Załącznik 1 - Kryteria '!A13,'Załącznik 1 - Kryteria '!A31)","v":"7. Utworzenie wyspecjalizowanych miejsc pracy"}]
[null,{"$f":"IF(Cost_Type=2,'Załącznik 1 - Kryteria '!A14,'Załącznik 1 - Kryteria '!A32)","v":"8. Prowadzenie działalności gospodarczej o niskim negatywnym wpływie na środowisko"}]
[null,{"$f":"IF(Cost_Type=2,'Załącznik 1 - Kryteria '!A15,'Załącznik 1 - Kryteria '!A33)","v":"9. Rozwój zrównoważony terytorialnie"}]
[null,{"$f":"IF(Cost_Type=2,'Załącznik 1 - Kryteria '!A16,'Załącznik 1 - Kryteria '!A34)","v":"10. Wspieranie zdobywania wykształcenia i kwalifikacji zawodowych oraz współpraca ze szkolnictwem branżowym"}]
[null,{"$f":"IF(Cost_Type=2,\"\",'Załącznik 1 - Kryteria '!A35)","v":"11. Podejmowanie działań w zakresie opieki nad pracownikiem"}]
[null,"Ilość zadeklarowanych kryteriów jakościowych:",null,null,null,null,null,null,{"$f":"Quality_Points","v":0}]
[]
[20,"Początek produkcji/świadczenia usługi (data)"]
[21,"Krótki opis projektu (nie więcej niż 1800 znaków)"]
[]
[]
[22,"Czy przedsiębiorca ubiega się, albo zamierza ubiegać się o inną formę wsparcia na ten sam projekt ( zwolnienie z podatku dochodowego w ramach PSI, zwolnienie z RET, Fundusze UE, inne)"]
[]
["Forma wsparcia",null,null,null,"Informacje szczegółowe (np. nr decyzji o wsparciu, rodzaj programu pomocowego)"]
["Zwolnienie z podatku dochodowego w ramach Polskiej Strefy Inwestycji"]
["Zwolnienie z podatku od nieruchomości"]
["Fundusze Unii Europejskiej"]
["Inne"]
[]
[23,"Czy możliwe jest łączenie instrumentów wsparcia (Jeśli \"tak\", na jakiej podstawie)?"]
[24,"Czy projekt, na który ma być udzielona pomoc, obejmuje dzialalność w poniższych sektorach:"]
[]
[null,{"$f":"IF(Control_Sectors<>10,TEXT_SECTOR_CONTROL,\"\")","v":"Proszę zaznaczyć deklaracje w sprawie każdego z poniższych sektorów:"}]
[null,"Sektor",null,null,null,null,null,null,"Tak","Nie"]
[null,"w sektorze rybołówstwa i akwakultury"]
[null,"w zakresie produkcji podstawowej produktów rolnych wymienionych w załączniku I do Traktatu o funkcjonowaniu Unii Europejskiej"]
[null,"w zakresie przetwarzania i wprowadzania do obrotu produktów rolnych wymienionych w załączniku I do Traktatu o funkcjonowaniu Unii Europejskiej"]
[null,"w sektorze hutnictwa żelaza i stali"]
[null,"w sektorze transportu bądź związanej z nim infrastruktury"]
[null,"w sektorze wytwarzania energii, jej dystrybucji i infrastruktury energetycznej"]
[null,"w sektorze węglowym"]
[null,"w sektorze finansowym"]
[null,{"$f":"IF(Sector_Eligibility>0,Text_Sector_Error,\"\")","v":""}]
[25,"Stan wniosku o udzielenie pomocy publicznej do ministra właściwego do spraw gospodarki",null,null,null,null,"Czy wniosek został złożony?"]
[null,null,null,null,null,null,"Data złożenia wniosku:"]
[null,null,null,null,null,null,"Kwota dotacji celowej zadeklarowana we wniosku:"]
[]
["II.\tInformacje ogólne o przedsiębiorcy na poziomie grupy na świecie – wypełnić tylko w przypadku przedsiębiorców działających również poza Polską"]
[1,"Lokalizacje i siedziba przedsiębiorcy"]
[]
[null,null,"Państwo, miasto",null,"Sektor działalności"]
[]
[]
[]
[]
[]
[null,null,"Siedziba:"]
[null,null,"Państwo pochodzenia kapitału grupy:"]
[]
[2,"Struktura właścicielska (5 największych udziałowców)"]
[null,"Należy wskazać strukturę właścicielską podmiotu polskiego zaczynając od spółki matki na poziomie grupy"]
[]
[null,null,"Udziałowiec",null,"Informacje o liczbie udziałów i procentowym udziale"]
[]
[]
[]
[]
[]
[]
[3,"Sektory działalności (można zaznaczyć więcej niż jeden sektor):"]
[]
[null,"AGD",null,"Farmaceutyczny",null,null,"Meblarski",null,null,"Spożywczy"]
[null,"Biotechnologiczny",null,"Gospodarka odpadami",null,null,"Medyczny",null,null,"Szklarski"]
[null,"BSS",null,"Komponenty dla OZE",null,null,"Metalowy",null,null,"Tekstylny"]
[null,"Chemiczny",null,"Kosmetyczny",null,null,"Motoryzacyjny",null,null,"Turystyczno-rozrywkowy"]
[null,"Drzewny",null,"Logistyczny",null,null,"Nieruchomości",null,null,"Tworzyw sztucznych"]
[null,"Elektromobilność",null,"Lotniczy",null,null,"Okołostoczniowy",null,null,"Tytoniowy"]
[null,"Elektroniczny",null,"Maszynowy",null,null,"Środków transportu",null,null,"Wydobywczy"]
[null,"Energetyczny",null,"Materiały budowlane",null,null,"R&D"]
[null,"Inny (wskazać):"]
[]
[4,"Główni klienci"]
[5,"Główni konkurenci"]
[6,"Inne, np. ogólne wydatki na B i R w okresie ostatnich 3 lat, posiadane certyfikaty jakości"]
[]
[null,null,"Rok",null,{"$f":"B_Start_3","v":"2021-05-07"},null,{"$f":"B_Start_2","v":"2022-05-07"},null,{"$f":"B_Start_1","v":"2023-05-07"}]
[null,null,"Wydatki",null,0,null,0,null,0]
[]
[null,"Posiadane certyfikaty oraz dodatkowe informacje"]
[]
["III.\tDotychczasowa działalność przedsiębiorcy na poziomie grupy w Polsce – jeśli grupa prowadziła do tej pory działalność na terenie Polski"]
[]
[null,"Kwestionariusz dotyczący dotychczasowej działalności podmiotu"]
[null,"Czy pomiędzy podmiotem a innymi przedsiębiorcami istnieją powiązania polegające na tym, że:",null,null,null,null,null,null,"Tak","Nie"]
[null,"a) jeden przedsiębiorca posiada w drugim większość praw głosu?"]
[null,"b) jeden przedsiębiorca ma prawo powołać lub odwołać większość członków organu zarządzającego lub nadzorującego innego przedsiębiorcy?"]
[null,"c) jeden przedsiębiorca ma prawo wywierać dominujący wpływ na innego przedsiębiorcę zgodnie z umową zawartą z tym przedsiębiorcą lub jego dokumentami założycielskimi?\t "]
[null,"d) jeden przedsiębiorca, który jest akcjonariuszem lub wspólnikiem innego przedsiębiorcy lub jego członkiem, zgodnie z porozumieniem z innymi akcjonariuszami, wspólnikami lub członkami tego przedsiębiorcy, samodzielnie kontroluje większość praw głosu u tego przedsiębiorcy?"]
[null,"e) przedsiębiorca pozostaje w jakimkolwiek ze stosunków opisanych w lit. a) - d)  poprzez jednego innego przedsiębiorcę lub kilku innych przedsiębiorców?"]
[null,"f) przedsiębiorca pozostaje w jakimkolwiek ze stosunków opisanych w lit. a) - d) za pośrednictwem osoby fizycznej lub grupy osób fizycznych działających wspólnie oraz prowadzi swoją działalność lub część działalności na tym samym rynku właściwym lub rynkach pokrewnych? "]
[null,"W przypadku zaznaczenia przynajmniej jednej odpowiedzi twierdzącej w lit. a) - f), należy podać identyfikator podatkowy NIP wszystkich powiązanych z podmiotem przedsiębiorców: "]
[]
[]
[null,{"$f":"IF(NIP_Status>0,TEXT_CompanyinPL,\"\")","v":""}]
[]
[1,"Lista spółek obecnych w Polsce (których identyfikatory podatkowe NIP wskazano w tabeli powyżej)"]
[]
["L.p.","Nazwa Spółki","NIP/KRS","Siedziba",null,null,"Lokalizacje",null,null,"Przeważający przedmiot działalności wraz z kodami PKD"]
[1]
[2]
[3]
[4]
[5]
[6]
[7]
[8]
[9]
[10]
[11]
[12]
[13]
[14]
[15]
[16]
[17]
[18]
[19]
[20]
[21]
[22]
[null,{"$f":"IF(B219<>0,Text_10CompaniesinPL,\"\")","v":""}]
[]
[2,"Główni klienci "]
[3,"Główni konkurenci "]
[4,"Łączne wpływy z podatków w Polsce (za 3 ostatnie lata) w PLN wszystkich spółek których identyfikatory podatkowe NIP wskazano w tabeli powyżej"]
[]
[null,null,"Podatek",null,{"$f":"B_Start_3","v":"2021-05-07"},null,{"$f":"B_Start_2","v":"2022-05-07"},null,{"$f":"B_Start_1","v":"2023-05-07"}]
[null,null,"PIT (zaliczki)"]
[null,null,"CIT"]
[null,null,"VAT"]
[null,null,"Podatek od nieruchomości"]
[null,null,"Inne"]
[]
[5,"Łączne wydatki na badania i rozwój w okresie ostatnich 3 lat wszystkich spółek których identyfikatory podatkowe NIP wskazano w tabeli powyżej"]
[]
[null,null,{"$f":"B_Start_3","v":"2021-05-07"},null,"2021-10-01",null,null,"2022-10-01"]
[]
[]
[]
[]
["IV. Szczegółowe informacje związane z nowym projektem"]
[1,"Szczegółowe dane dotyczące beneficjenta pomocy publicznej"]
[]
[null,"Deklaracja",null,null,null,null,null,null,"Tak","Nie"]
[null,"1) Czy wnioskowana pomoc zostanie przeznaczona na przedsięwzięcie, na które podmiot otrzymał inną pomoc?"]
[null,"2) Czy wnioskowana pomoc zostanie przeznaczona na pokrycie dających się zidentyfikować kosztów?"]
[null,"3) W przypadku zaznaczenia odpowiedzi twierdzącej w pkt 2), czy podmiot otrzymał inną pomoc na pokrycie tych samych kosztów, o których mowa w pkt 2)?"]
[null,"4) W przypadku ubiegania się o pomoc na ratowanie, restrukturyzację lub tymczasową pomoc na restrukturyzację, czy w okresie 10 lat poprzedzających dzień złożenia wniosku o udzielenie pomocy została udzielona tego rodzaju pomoc lub zakończony został okres restrukturyzacji wspierany pomocą lub wstrzymana została realizacja planu restrukturyzacji wspieranego pomocą?"]
[]
[null,"Inne uzyskane formy pomocy publicznej na te same koszty kwalifikowane"]
[]
[2,"W przypadku aplikowania o dotację celową przez tego samego przedsiębiorcę na poziomie grupy na świecie w związku z realizacją kolejnego projektu inwestycyjnego w tej samej lokalizacji, proszę wykazać różnice między projektem uprzednim i bieżącym  (prośba o podanie kodów NACE dla projektu uprzedniego i bieżącego)"]
[]
[3,"Informacja o inwestycjach wspartych pomocą publiczną związanych z taką samą lub podobną działalnością, rozpoczętych przez tego samego beneficjenta (na poziomie grupy) w okresie ostatnich 3 zakończonych lat kalendarzowych wraz z okresem od początku roku kalendarzowego, w którym składany jest formularz aplikacyjny, od dnia jego złożenia, w tej samej lokalizacji (na poziomie NUTS 3)"]
[null,"Początek okresu 3 lat:",null,null,{"$f":"B_Start_3","v":"2021-05-07"}]
[null,"Czterocyfrowy kod numeryczny statystycznej klasyfikacji działalności gospodarczej (NACE Rev. 2) dotyczący nowego projektu"]
["Nazwa Firmy",null,"Lokalizacja Firmy",null,"Data Początku Projektu Inwestycyjnego",null,"Główne Kody działalności PKD",null,"Czterocyfrowy kod numeryczny statystycznej klasyfikacji działalności gospodarczej (NACE Rev. 2) "]
[]
[]
[]
[]
[]
[]
[]
["podstawa prawna",null,"dzień udzielenia pomocy, nr środka pomocowego ",null,"nazwa podmiotu udzielającego pomocy",null,"wartość nominalna pomocy",null,"forma pomocy","przeznaczenie pomocy "]
[]
[]
[]
[]
[]
[]
[4,"Szczegółowy opis projektu (wytyczne: etapy projektu, harmonogram, typ kosztów kwalifikowanych, opis produktów lub usług) "]
[null,"Rodzaj działalności prowadzonej w ramach projektu (np. rodzaj produkcji, rodzaj świadczonych usług)"]
[null,"Kody PKWiU prowadzonej działalności w ramach projektu"]
[5,"Średnie miesięczne wynagrodzenie brutto w PLN "]
[6,"Składka na ubezpieczenie wypadkowe (między 0,67%-3,60%)"]
[]
[7,"Typ innowacyjności"]
[null,"a) nowy lub udoskonalony produkt, który w istotnym stopniu różni się od produktów wytwarzanych dotychczas na terenie Polski i który zostanie udostępniony przez przedsiębiorcę potencjalnym użytkownikom w wyniku realizacji inwestycji (innowacja produktowa),"]
[null,"b) nowy lub udoskonalony proces, który w istotnym stopniu różni się od procesów stosowanych dotychczas w produkcji na terenie Polski i który zostanie zastosowany przez przedsiębiorcę w wyniku realizacji inwestycji (innowacja procesowa)"]
[8,"Opis Innowacyjności (jeśli dotyczy)\nDodatkowe dokumenty należy załączyć w osobnym pliku."]
[9,"Informacje o działce i infrastrukturze technicznej dla nowego projektu"]
[]
[null,null,"Powierzchnia działki w m2 "]
[null,null,"Powierzchnia budynków w m2 "]
[null,null,"Wartość obiektów (dróg, parkingów, infrastruktury naziemnej) w PLN"]
[]
[10,"Projekcje finansowe i dane nowego projektu (w PLN)"]
[]
[null,null,{"$f":"Project_Start_Date","v":"00:00:00"},{"$f":"A_Start_1","v":""},{"$f":"A_Start_2","v":""},{"$f":"A_Start_3","v":""},{"$f":"A_Start_4","v":""},{"$f":"A_Start_5","v":""},{"$f":"A_Start_6","v":""},{"$f":"A_Start_7","v":""},"Łącznie"]
[null,"Roczna wielkość sprzedaży w projekcie",null,null,null,null,null,null,null,null,{"$f":"SUM(C303:J303)","v":0}]
[null,"Roczne koszty",null,null,null,null,null,null,null,null,{"$f":"SUM(C304:J304)","v":0}]
[null,"Jedstostkowa cena sprzedaży produktu końcowego",null,null,null,null,null,null,null,null,{"$f":"SUM(C305:J305)","v":0}]
[11,"Czy projekt zgodnie z unijnymi przepisami pomocy publicznej będzie w co najmniej 25% sfinansowany ze środków własnych lub z finansowania zewnętrznego niezawierającego publicznego wsparcia finansowego? "]
[]
[]
["Informacje wymagane od dużych i rozwijających się przedsiębiorstw"]
[]
[12,"Podsumowanie analizy efektu zachęty\n(pełny tekst należy załączyć w osobnym załączniku)  "]
[]
["Informacje wymagane wyłącznie od dużych przedsiębiorców"]
[]
[13,"Forma planowanej współpracy z podmiotami tworzącymi system szkolnictwa wyższego i nauki lub szkołami ponadpodstawowymi (można wybrać więcej niż jedną odpowiedź)"]
["zlecanie wykonania badań naukowych lub prac rozwojowych"]
["sponsorowanie badań naukowych"]
["zlecanie realizacji programów kształcenia"]
["udział w programie ministra właściwego do spraw szkolnictwa wyższego i nauki „Doktorat Wdrożeniowy” oraz innych programach lub przedsięwzięciach ministra właściwego do spraw szkolnictwa wyższego i nauki związanych z realizacją szkół doktorskich"]
["finansowanie udziału studentów i uczniów w procesie kształcenia na profilu praktycznym, w tym m.in. w formie kształcenia dualnego, poprzez stypendia, organizowanie staży lub zatrudnienie"]
["udział w konsorcjach badawczych współfinansowanych przez Narodowe Centrum Badań i Rozwoju"]
["zakup patentów i licencji od podmiotów tworzących system szkolnictwa wyższego i nauki lub ich spółek celowych"]
["wyposażanie podmiotów tworzących system szkolnictwa wyższego i nauki, w rozumieniu art. 7 ust. 1 pkt 1–7 ustawy z dnia 20 lipca 2018 r. – Prawo o szkolnictwie wyższym i nauce, w sprzęt laboratoryjny niezbędny do prowadzenia badań, zadań dydaktycznych"]
["wyposażanie szkół ponadpodstawowych w sprzęt niezbędny do prowadzenia zadań dydaktycznych lub praktycznych"]
["współorganizowanie w ramach uczelni i współfinansowaniu studenckich centrów szkoleniowych oferujących specjalistyczne kursy, których celem jest doskonalenie kompetencji, wymaganych w działalności gospodarczej prowadzonej przez przedsiębiorcę"]
[]
["Oświadczenia dot. projektu"]
[1,"Powołując się na art. 14 ust. 16 Rozporządzenia Komisji (UE) nr 651/2014 z dnia 17 czerwca 2014 r. uznające niektóre rodzaje pomocy za zgodne z rynkiem wewnętrznym w zastosowaniu art. 107 i 108 Traktatu, w związku ze zmianami wprowadzonymi Rozporządzeniem Komisji  (UE) 2017/1084 z dnia 14 czerwca 2017 r. oświadczam, iż Beneficjent  pomocy publicznej udzielanej w oparciu o Program wspierania inwestycji o istotnym znaczeniu dla gospodarki polskiej na lata 2011-2023:\n\n•\tnie dokonał przeniesienia do zakładu, w którym ma zostać dokonana inwestycja początkowa, której dotyczy wniosek o pomoc, w ciągu dwóch lat poprzedzających złożenie wniosku o pomoc, oraz zobowiązuje się, że nie dokona takiego przeniesienia przez okres dwóch lat od zakończenia inwestycji początkowej, której dotyczy wniosek o pomoc.\n\n\n„Przeniesienie”, zgodnie z art. 2 pkt 61 a) Rozporządzenia nr 651/2014 oznacza:\n„przeniesienie tej samej lub podobnej działalności lub jej części z zakładu na terenie jednej umawiającej się strony Porozumienia EOG (zakład pierwotny) do zakładu, w którym dokonuje się inwestycji objętej pomocą i który znajduje się na terenie innej umawiającej się strony Porozumienia EOG (zakład objęty pomocą). Przeniesienie występuje wówczas, gdy produkt lub usługa w zakładzie pierwotnym i zakładzie objętym pomocą służy przynajmniej częściowo do tych samych celów oraz zaspokaja wymagania lub potrzeby tej samej kategorii klientów oraz w jednym z pierwotnych zakładów beneficjenta w EOG nastąpiła likwidacja miejsc pracy związanych z taką samą lub podobną działalnością.”"]
[2,"Wyrażam zgodę na ujawnienie na stronach Ministerstwa Rozwoju oraz Polskiej Agencji Inwestycji i Handlu następujących informacji, zgodnie z art. 41 ustawy z dnia 30 kwietnia 2004 r. o postępowaniu w sprawach dotyczących pomocy publicznej:\n\n1. Nazwa firmy,\n2. Lokalizacja planowanej inwestycji,\n3. Planowane zatrudnienie nowej inwestycji,\n4. Planowana wielkość nakładów inwestycyjnych,\n5. Wysokość uzyskanej pomocy publicznej."]
[]
["Dane do osoby upoważnionej do kontaktu w zakresie aplikacji o dotację celową "]
[]
[null,null,"Imię i nazwisko"]
[null,null,"Stanowisko"]
[null,null,"E-mail"]
[null,null,"Telefon"]
[null,null,"Preferowany język komunikacji"]
[]
["Podpis osoby uprawnionej, zgodnie z załączonym do formularza dokumentem potwierdzającym umocowanie:"]
[]
[null,null,null,null,null,null,"Data"]
[null,null,null,null,null,null,"Podpis"]

{"sheet":"Załącznik 1 - Kryteria ","index":1,"n_rows":35,"n_cols":3,"rows_kept":35,"cut":false,"hidden":false,"merged":[[0,0,0,2],[1,1,1,2]]}
["Kryteria jakościowe oceny inwestycji "]
[]
[null,"Kryteria jakościowe oceny inwestycji w wypadku ubiegania się o wsparcie z tytułu kosztów tworzenia nowych miejsc pracy"]
[]
[]
["Nazwa kryterium jakościowego","Sposób spełnienia kryterium jakościowego","Sposób weryfikacji spełnienia kryterium jakościowego"]
["1. Rodzaj wykonywanych procesów","Prowadzenie działalności obejmującej zaawansowane lub wysokozaawansowane procesy wskazane w Załączniku nr 2, gdzie co najmniej połowa nowo utworzonych miejsc pracy związana jest z realizowaniem zaawansowanych lub wysokozaawansowanych procesów wskazanych w zał. 2. ","Oświadczenie przedsiębiorcy złożone w formularzu aplikacyjnym i weryfikacja, czy:\n- przedsiębiorca w całym okresie utrzymania inwestycji prowadził działalność obejmującą wskazane w Umowie zaawansowane lub wysokozaawansowane procesy, oraz\n- określona w Umowie liczba pracowników ma w zakresie obowiązków realizowanie zaawansowanych lub wysokozaawansowanych procesów. "]
["2. Prowadzenie działalności B+R","Prowadzenie działalności badawczo-rozwojowej, gdzie: \n1) 2% kosztów działalności ponoszonych przez przedsiębiorcę w zakładzie w danym roku podatkowym stanowią koszty: \na) działalności badawczo-rozwojowej odpowiednio w rozumieniu art. 5a pkt 38 ustawy z dnia 26 lipca 1991 r. o podatku dochodowym od osób fizycznych (Dz. U. z 2022 r. poz. 2647, z późn. zm.)  lub art. 4a pkt 26 ustawy z dnia 15 lutego 1992 r. o podatku dochodowym od osób prawnych (Dz. U. z 2022 r. poz.2587, z późn. zm.)  lub \nb) zakupu usług badawczo-rozwojowych klasyfikowanych do usług w zakresie badań naukowych i prac rozwojowych w rozumieniu przepisów w sprawie polskiej klasyfikacji wyrobów i usług, lub \n2) 2% ekwiwalentu czasu pracy wszystkich pracowników zatrudnionych w zakładzie związane jest z prowadzeniem prac rozwojowych\nw rozumieniu art. 5a pkt 40 ustawy z dnia 26 lipca 1991 r. o podatku dochodowym od osób fizycznych lub w rozumieniu art. 4a pkt 28 ustawy z dnia 15 lutego 1992 r. o podatku dochodowym od osób prawnych. ","W zakresie pkt 1: Oświadczenie przedsiębiorcy złożone w formularzu aplikacyjnym i weryfikacja, czy przedsiębiorca ponosił, w okresie utrzymania inwestycji, koszty działalności badawczo-rozwojowej lub zakupu usług badawczo-rozwojowych w wysokości co najmniej 2% kosztów działalności ponoszonych w zakładzie przez przedsiębiorcę.\n\nW zakresie pkt 2: Oświadczenie przedsiębiorcy złożone w formularzu aplikacyjnym i weryfikacja, czy przedsiębiorca przeznaczał na prace rozwojowe, w okresie utrzymania inwestycji, co najmniej 2% ekwiwalentu czasu pracy wszystkich pracowników zatrudnianych w zakładzie."]
["3. Wykorzystanie potencjału zasobów ludzkich","Zatrudnienie w związku z realizacją inwestycji co najmniej 4% pracowników z orzeczeniem o niepełnosprawności, orzeczeniem o stopniu niepełnosprawności lub orzeczeniem traktowanym na równi w odniesieniu do liczby nowo utworzonych miejsc pracy, lecz nie mniej niż jednego pracownika. ","Oświadczenie przedsiębiorcy złożone w formularzu aplikacyjnym i weryfikacja, czy w całym okresie utrzymania inwestycji była zatrudniona wskazana w Umowie liczba pracowników z orzeczeniem o niepełnosprawności, orzeczeniem o stopniu niepełnosprawności lub o"]
["4. Robotyzacja i automatyzacja procesów ","Wdrożenie zrobotyzowanej automatyzacji procesów (Robotic Process Automation – RPA) lub rozwiązań z zakresu sztucznej inteligencji (Artificial Intelligence - AI). ","Oświadczenie przedsiębiorcy złożone w formularzu aplikacyjnym i weryfikacja, czy przedsiębiorca w okresie realizacji lub utrzymania inwestycji dokonał w związku z inwestycją wdrożenia (w szczególności w wyniku zakupu, nabycia licencji lub opracowania) zrobotyzowanej automatyzacji procesów (Robotic Process Automation – RPA) lub rozwiązań z zakresu sztucznej inteligencji – programu komputerowego, symulującego pracę człowieka, z obsługą lub bez obsługi, w celu wykonywania predefiniowanych, ustrukturyzowanych i powtarzalnych zestawów zadań lub procesów biznesowych, które to RPA i AI nie były do tej pory stosowane w zakładzie."]
["5. Posiadanie statusu:\nmikro-, małego albo średniego przedsiębiorcy","Posiadanie statusu mikroprzedsiębiorcy, małego przedsiębiorcy albo średniego przedsiębiorcy na dzień złożenia wniosku o udzielenie pomocy publicznej.","Kryterium weryfikowane na dzień złożenia wniosku o udzielenie pomocy publicznej. "]
["6. Utworzenie wysokopłatnych i stabilnych miejsc pracy","Utworzenie wysokopłatnych miejsc pracy i oferowanie stabilnego zatrudnienia, obejmujące utworzenie miejsc pracy związanych z nową inwestycją, w których średnie wynagrodzenie brutto stanowi co najmniej 110% przeciętnego wynagrodzenia w gospodarce narodowej według aktualnego komunikatu Prezesa GUS - w wypadku lokalizacji inwestycji na obszarze kraju, na którym maksymalna intensywność pomocy regionalnej wynosi 50% lub na obszarze zagrożonym wykluczeniem, lub co najmniej 130% przeciętnego wynagrodzenia – w wypadku lokalizacji inwestycji na pozostałym obszarze kraju. ","Oświadczenie przedsiębiorcy złożone w formularzu aplikacyjnym i weryfikacja, czy w okresie utrzymania inwestycji roczne średnie wynagrodzenie brutto każdego pracownika zatrudnionego w ramach inwestycji, z wyłączeniem członków zarządu – w przypadku spółek kapitałowych – lub wspólników – w przypadku spółek osobowych, stanowiło co najmniej 110% przeciętnego wynagrodzenia w gospodarce narodowej według aktualnego komunikatu Prezesa GUS w okresie każdego rocznego okresu utrzymania inwestycji - w wypadku lokalizacji inwestycji na obszarze kraju, na którym maksymalna intensywność pomocy regionalnej wynosi 50% lub na obszarze zagrożonym wykluczeniem, lub co najmniej 130% przeciętnego wynagrodzenia – w wypadku lokalizacji inwestycji na pozostałym obszarze kraju."]
["7. Inwestycja w budynku o niskim negatywnym wpływie na środowisko","Zlokalizowanie inwestycji w budynku o niskim negatywnym wpływie na środowisko, który spełnienia co najmniej 5 z 8 warunków: \n1)     wykorzystanie systemu zarządzania energią w budynku (monitorowanie i optymalizacja zużycia energii);\n2)     wykorzystanie odnawialnych źródeł energii; \n3)     wykorzystanie instalacji magazynowania energii; \n4)     wykorzystanie inteligentnego i efektywnego energetycznie oświetlenia; \n5)     ograniczenie zużycia wody w budynku np. poprzez wykorzystanie deszczówki lub wody szarej; \n6)     segregacja oraz kompostowanie odpadów; \n7)     zastosowanie zielonych ścian oraz dachów; \n8)     stosowanie wyrobów budowlanych lub kruszyw pochodzących z recyklingu\n\n\n","Oświadczenie przedsiębiorcy złożone w formularzu aplikacyjnym i weryfikacja, czy w okresie utrzymania inwestycji działalność będąca przedmiotem inwestycji była prowadzona przez przedsiębiorcę w budynku o niskim negatywnym wpływie na środowisko. Spełnienie co najmniej 5 z 8 warunków powinno być potwierdzone adekwatnymi certyfikatami lub innymi dokumentami równoważnymi lub dokumentacją projektową i techniczno-wykonawczą instalacji."]
["8. Wspieranie zrównoważonego terytorialnie rozwoju kraju","Zlokalizowanie inwestycji:\n1)     na obszarze kraju, na którym maksymalna intensywność pomocy regionalnej wynosi 50%, lub\n2)     na obszarze zagrożonym wykluczeniem.","Kryterium weryfikowane na dzień złożenia wniosku o udzielenie pomocy publicznej."]
["9.   Wspieranie zdobywania wykształcenia i kwalifikacji zawodowych oraz współpraca ze szkolnictwem branżowym","Wspieranie zdobywania wykształcenia i kwalifikacji zawodowych oraz współpraca ze szkolnictwem branżowym, obejmujące: \n1) oferowanie pracownikom szkoleń mających na celu uzyskanie, uzupełnienie lub doskonalenie umiejętności i kwalifikacji zawodowych, lub ogólnych, potrzebnych do wykonywania pracy, lub \n2) dofinansowanie kosztów kształcenia, lub\n3) współpracę ze szkolnictwem branżowym, technikami, szkołami policealnymi, centrami kształcenia zawodowego, placówkami kształcenia ustawicznego, lub uczelniami, polegającą na organizowaniu praktyk,  staży, szkoleń lub \n4) oferowanie pozaszkolnych zajęć edukacyjnych mających na celu uzyskanie, uzupełnienie lub doskonalenie umiejętności i kwalifikacji zawodowych lub ogólnych, potrzebnych do wykonywania pracy, w tym umiejętności poszukiwania zatrudnienia, finansowanych przez przedsiębiorcę, lub \n5) przekazanie na potrzeby szkoły, lub centrum kształcenia zawodowego, lub placówki kształcenia ustawicznego, lub uczelni maszyn oraz narzędzi, lub \n6) stworzenie klasy patronackiej lub laboratorium, lub \n7) kształcenie dualne, lub \n8) prowadzenie przez zatrudnionego pracownika doktoratu wdrożeniowego.\n","Oświadczenie przedsiębiorcy złożone w formularzu aplikacyjnym i weryfikacja, czy przedsiębiorca, w związku z realizacją inwestycji, spełnił co najmniej 4 z 8 warunków przez:\n\nW zakresie pkt 1 i 2: ponoszenie w całym okresie utrzymania inwestycji kosztów szkoleń świadczonych przez podmioty zewnętrzne lub kształcenia w jednostkach oświatowych lub uczelniach w wysokości co najmniej 1000 zł brutto średniorocznie na każde miejsce pracy, dla co najmniej 50% pracowników zatrudnionych w zakładzie. W przypadku szkoleń wewnętrznych zatrudnianie, w okresie utrzymania inwestycji, pracownika, w którego zakresie obowiązków znajduje się wyłącznie szkolenie pracowników w zakładzie.\n\nW zakresie pkt 3: zawarcie i wykonanie umowy z organem prowadzącym szkołę, lub placówkę kształcenia ustawicznego, lub centrum kształcenia zawodowego, lub uczelnią, w sprawie prowadzenia w okresie utrzymania inwestycji praktyk, staży lub szkoleń u tego przedsiębiorcy oraz przyjęcie w każdym roku utrzymania inwestycji co najmniej jednej osoby na praktykę staż lub szkolenie w zakładzie, w którym zrealizowana została inwestycja. \n\nW zakresie pkt 4: zawarcie i wykonanie umowy z organem prowadzącym szkołę lub centrum kształcenia zawodowego lub placówkę kształcenia ustawicznego, lub uczelnią, w sprawie zapewniania, w okresie utrzymania inwestycji, uczniom lub studentom, lub nauczycielom kształcenia zawodowego, finansowanych przez przedsiębiorcę, pozaszkolnych zajęć edukacyjnych, mających na celu uzyskanie, uzupełnienie lub doskonalenie umiejętności i kwalifikacji zawodowych lub ogólnych, potrzebnych do wykonywania pracy oraz zorganizowanie co najmniej jednych takich zajęć w każdym roku utrzymania inwestycji. \n\nW zakresie pkt 5: zawarcie i wykonanie umowy z organem prowadzącym szkołę lub centrum kształcenia zawodowego, lub placówkę kształcenia ustawicznego, lub uczelnią, której przedmiotem jest przekazanie, w okresie utrzymania inwestycji, na potrzeby tej szkoły, lub centrum kształcenia zawodowego, lub placówki kształcenia ustawicznego, lub uczelni, maszyn lub narzędzi, poświadczone protokołem przekazania.\n\nW zakresie pkt 6: zawarcie i wykonanie umowy z organem prowadzącym szkołę lub centrum kształcenia zawodowego lub placówkę kształcenia ustawicznego, lub uczelnią, której przedmiotem jest stworzenie w całym okresie utrzymania inwestycji klasy patronackiej lub laboratorium. \n\nW zakresie pkt 7: zawarcie i wykonanie umowy z organem prowadzącym szkołę lub centrum kształcenia zawodowego lub uczelnią, której przedmiotem jest przyjmowanie uczniów na praktyczną naukę zawodu lub studentów na studia dualne prowadzone z udziałem przedsiębiorcy, w okresie utrzymania inwestycji oraz przyjęcie w każdym roku utrzymania inwestycji co najmniej jednej osoby na praktykę lub staż w zakładzie, w którym realizowana jest Inwestycja. \n\nW zakresie pkt 8: przedstawienie, w okresie utrzymania inwestycji, przez co najmniej jednego pracownika przedsiębiorcy, indywidualnego planu badawczego podmiotowi prowadzącemu szkołę doktorską."]
["10. Podejmowanie działań w zakresie opieki nad pracownikiem","Podejmowanie działań w zakresie opieki nad pracownikiem, w szczególności przez:\n1) oferowanie pracownikom udziału w dodatkowych programach opieki zdrowotnej wykraczających poza świadczenia wymagane przepisami prawa, lub \n2) oferowanie pracownikom dodatkowych świadczeń pracowniczych z zakresu różnych form wypoczynku, działalności kulturalno-oświatowej, sportowo-rekreacyjnej, ubezpieczeń, lub \n3) tworzenie lub zlecenie utworzenia i prowadzenia podmiotowi zewnętrznemu przyzakładowego żłobka lub przedszkola, lub\n4) pokrywanie 50% kosztów związanych z pobytem w żłobku, klubie dziecięcym lub placówce wychowania przedszkolnego, oddziale przedszkolnym w szkole podstawowej, zespole wychowania przedszkolnego, punkcie przedszkolnym dzieci do lat 6, przy założeniu, że ze świadczenia w okresie utrzymania korzysta 20% pracowników zakładu.\n","Oświadczenie przedsiębiorcy złożone w formularzu aplikacyjnym i weryfikacja, czy przedsiębiorca w okresie utrzymania inwestycji ponosił koszty świadczeń dotyczących działań w zakresie opieki nad pracownikiem w wysokości co najmniej 1000 zł brutto rocznie na każde miejsce pracy w zakładzie. "]
[]
[]
[]
[]
[]
[null,"Kryteria jakościowe oceny inwestycji w wypadku ubiegania się o wsparcie z tytułu kosztów inwestycji"]
[]
["Nazwa kryterium jakościowego","Sposób spełnienia kryterium jakościowego","Sposób weryfikacji spełnienia kryterium jakościowego"]
["1. Inwestycja w sektorze strategicznym","Inwestycja w projekty wspierające branże zgodne z aktualną polityką rozwojową kraju, w których Rzeczpospolita Polska może uzyskać przewagę konkurencyjną, obejmujące inwestycję w ramach sektorów strategicznych zgodnych ze Strategią na rzecz Odpowiedzialnego Rozwoju: \n1) sektor żywności wysokiej jakości (PKWiU: 10.3, 10.7, 10.8, 11.07, 17.21, 20.15.3, 20.15.4, 20.15.5, 20.15.6, 20.15.7, 20.15.8, 20.2); \n2) sektor środków transportu (PKWiU: 13.96, 20.16.5, 20.17, 22.11, 22.19.4, 24.42, 25.5, 25.61, 29.1, 29.2, 29.3, 30.2, 33.17); \n3) sektor profesjonalnych urządzeń elektrycznych i elektronicznych (PKWiU: 20.11, 20.13.23, 20.13.5, 20.13.64, 23.43, 24.41, 24.45, 25.3, 26.1, 26.2, 26.3, 26.51, 26.70.23, 26.70.24, 27.11, 27.12, 27.20.2, 27.31, 27.32, 27.4, 27.9); \n4) sektor lotniczo-kosmiczny (PKWiU: 30.3, 33.16); \n5) sektor produktów higienicznych, leków i wyrobów medycznych (PKWiU: 17.22, 20.42, 20.53, 21.1, 21.2, 26.6, 30.92, 32.5); \n6) sektor maszynowy (PKWiU: 25.73.5, 28.11, 28.12, 28.13, 28.21, 28.22.18, 28.25, 28.29.43, 28.3, 28.4, 28.9, 33.12.2, 33.2); \n7) sektor odzysku materiałowego surowców i nowoczesnych tworzyw (PKWiU: 20.16.4, 38.3); \n8) sektor ekobudownictwa (PKWiU: 31.0, 27.5, 16.21, 16.22, 16.23.11, 17.24, 20.3, 20.52, 22.23.14, 23.11, 23.12, 23.31, 23.42); \n9) sektor usług specjalistycznych (PKWiU: 62.03, 63.11.11, 70.22.1, 71.1, 72,74.1);\n10) sektor specjalistycznych usług teleinformatycznych (PKWiU: 58.21, 62.01 z wyłączeniem 62.01.2 PKWiU 62.02.2)\nlub z inteligentnymi specjalizacjami województwa, w którym jest planowana realizacja inwestycji.","Oświadczenie przedsiębiorcy złożone w formularzu aplikacyjnym \ni weryfikacja, czy przedsiębiorca w okresie utrzymania inwestycji \nw zakładzie świadczył usługi lub wytwarzał wyroby wskazane w Umowie. \nW przypadku świadczenia usług lub wytwarzania wyrobów w ramach klas zawartych w grupach określonych w kryterium jakościowym nr 1. należy uznać wskazane kryterium za spełnione."]
["2. Wykorzystanie potencjału zasobów ludzkich","Zatrudnienie w związku z realizacją inwestycji co najmniej 4% pracowników z orzeczeniem o niepełnosprawności, orzeczeniem o stopniu niepełnosprawności lub orzeczeniem traktowanym na równi w odniesieniu do liczby nowo utworzonych miejsc pracy, lecz nie mniej niż jednego pracownika. ","Oświadczenie przedsiębiorcy złożone w formularzu aplikacyjnym i weryfikacja, czy w całym okresie utrzymania inwestycji była zatrudniona wskazana w Umowie liczba pracowników z orzeczeniem o niepełnosprawności, orzeczeniem o stopniu niepełnosprawności lub o"]
["3. Robotyzacja i automatyzacja procesów ","Robotyzacja i automatyzacja procesów prowadzonych w ramach inwestycji. Zakup w ramach inwestycji co najmniej jednego manipulacyjnego robota przemysłowego (definicja zgodna z normą PN-EN ISO 8373:2001), który jest automatycznie sterowaną, programowalną, wielozadaniową maszyną manipulacyjną o wielu stopniach swobody, posiadającą właściwości manipulacyjne lub lokomocyjne, stacjonarną lub mobilną, dla ważnych zastosowań przemysłowych, lub co najmniej jednego innego urządzenia (zgodnie z pozycją 493 KŚT) stanowiącego zestaw przeprogramowywanych manipulatorów i urządzeń sterujących, służącego do wykonywania funkcji ruchowych, dysponującego możliwością swobodnego programowania zmian pozycji i kolejności operacji roboczych.","Oświadczenie przedsiębiorcy złożone w formularzu aplikacyjnym \ni weryfikacja, czy w okresie utrzymania inwestycji przedsiębiorca utrzymał odpowiednią liczbę robotów przemysłowych lub innych urządzeń zakupionych w ramach  inwestycji, co do których zgodność z wymaganą normą będzie potwierdzona stosownym certyfikatem wydanym przez producenta danego robota lub urządzenia.\n\nKoszty związane z zakupem robota lub urządzenia muszą być włączone do ewidencji środków trwałych i pozostać w niej przez okres utrzymania inwestycji."]
["4. Prowadzenie działalności B+R","Prowadzenie działalności badawczo-rozwojowej, gdzie: \n1) 2% kosztów działalności ponoszonych przez przedsiębiorcę \nw zakładzie w danym roku podatkowym stanowią koszty: \na) działalności badawczo-rozwojowej odpowiednio w rozumieniu art. 5a pkt 38 ustawy o podatku dochodowym od osób fizycznych lub art. 4a pkt 26 ustawy o podatku dochodowym od osób prawnych lub \nb) zakupu usług badawczo-rozwojowych klasyfikowanych do usług \nw zakresie badań naukowych i prac rozwojowych w rozumieniu przepisów w sprawie polskiej klasyfikacji wyrobów i usług, lub \n2) 2% ekwiwalentu czasu pracy wszystkich pracowników zatrudnionych w zakładzie związane jest z prowadzeniem prac rozwojowych \nw rozumieniu art. 5a pkt 40 ustawy o podatku dochodowym od osób fizycznych lub w rozumieniu art. 4a pkt 28 ustawy o podatku dochodowym od osób prawnych. ","W zakresie pkt 1: Oświadczenie przedsiębiorcy złożone w formularzu aplikacyjnym i weryfikacja, czy przedsiębiorca ponosił, w okresie utrzymania inwestycji, koszty działalności badawczo-rozwojowej lub zakupu usług badawczo-rozwojowych w wysokości co najmniej 2% kosztów działalności ponoszonych w zakładzie przez przedsiębiorcę.\n\nW zakresie pkt 2: Oświadczenie przedsiębiorcy złożone w formularzu aplikacyjnym i weryfikacja, czy przedsiębiorca przeznaczał na prace rozwojowe, w okresie utrzymania inwestycji, co najmniej 2% ekwiwalentu czasu pracy wszystkich pracowników zatrudnianych w zakładzie."]
["5. Inwestycja w OZE","Inwestycja w odnawialne źródła energii o mocy zapewniającej co najmniej 15% średniorocznego zużycia energii elektrycznej w zakładzie.","Oświadczenie przedsiębiorcy złożone w formularzu aplikacyjnym \ni weryfikacja, czy w okresie utrzymania inwestycji, co najmniej 15% średniorocznego zużycia energii elektrycznej przedsiębiorcy pochodziło z odnawialnych źródeł energii oraz co najmniej taka ilość energii elektrycznej została wyprodukowana w instalacji OZE powstałej po rozpoczęciu inwestycji."]
["6. Posiadanie statusu:\nmikro-, małego albo średniego przedsiębiorcy","Posiadanie statusu mikroprzedsiębiorcy, małego przedsiębiorcy albo średniego przedsiębiorcy na dzień złożenia wniosku o udzielenie pomocy publicznej.","Kryterium weryfikowane na dzień złożenia wniosku o udzielenie pomocy publicznej. "]
["7. Utworzenie wyspecjalizowanych miejsc pracy","Utworzenie w ramach inwestycji wyspecjalizowanych miejsc pracy \ni oferowanie stabilnego zatrudnienia, przez:\n- 80% nowych miejsc pracy wymaga posiadania wykształcenia wyższego, średniego, średniego branżowego lub zasadniczego zawodowego poświadczonego dyplomem, świadectwem lub innym dokumentem uprawniającym do wykonywania zawodu.","Oświadczenie przedsiębiorcy złożone w formularzu aplikacyjnym i weryfikacja, czy w okresie utrzymania inwestycji co najmniej 80% zatrudnionych w ramach inwestycji pracowników posiadało wykształcenie wyższe, średnie branżowe lub zasadnicze zawodowe, poświadczone dyplomem lub świadectwem, lub innym dokumentem uprawniającym do wykonywania zawodu. "]
["8. Prowadzenie działalności gospodarczej o niskim negatywnym wpływie na środowisko","Prowadzenie działalności gospodarczej o niskim negatywnym wpływie na środowisko potwierdzone posiadaniem Certyfikatu EMAS, ETV lub ISO 14001 albo zastępującymi wskazane certyfikaty, dokumentu poświadczającego posiadanie statusu laureata GreenEvo lub Świadectwa Czystszej Produkcji, lub wpisu do Polskiego Rejestru Czystszej Produkcji i Odpowiedzialnej Przedsiębiorczości.","Oświadczenie przedsiębiorcy złożone w formularzu aplikacyjnym i weryfikacja, czy przedsiębiorca przez cały okres utrzymania inwestycji posiada Certyfikat EMAS, ETV lub ISO 14001 albo zastępujący wskazane certyfikaty dokument poświadczający posiadanie statusu laureata GreenEvo lub Świadectwa Czystszej Produkcji, lub wpis do Polskiego Rejestru Czystszej Produkcji i Odpowiedzialnej Przedsiębiorczości, dotyczący zakładu, w którym została zrealizowana inwestycja."]
["9. Rozwój zrównoważony terytorialnie","Zlokalizowanie inwestycji na obszarze zagrożonym wykluczeniem.","Kryterium weryfikowane na dzień złożenia wniosku o udzielenie pomocy publicznej."]
["10. Wspieranie zdobywania wykształcenia i kwalifikacji zawodowych oraz współpraca ze szkolnictwem branżowym","Wspieranie zdobywania wykształcenia i kwalifikacji zawodowych oraz współpraca ze szkolnictwem branżowym, obejmujące: \n1) oferowanie pracownikom szkoleń mających na celu uzyskanie, uzupełnienie lub doskonalenie umiejętności i kwalifikacji zawodowych, lub ogólnych, potrzebnych do wykonywania pracy, lub \n2) dofinansowanie kosztów kształcenia, lub\n3) współpracę ze szkolnictwem branżowym, technikami, szkołami policealnymi, centrami kształcenia zawodowego, placówkami kształcenia ustawicznego, lub uczelniami, polegającą na organizowaniu praktyk,  staży, szkoleń lub \n4) oferowanie pozaszkolnych zajęć edukacyjnych mających na celu uzyskanie, uzupełnienie lub doskonalenie umiejętności i kwalifikacji zawodowych lub ogólnych, potrzebnych do wykonywania pracy, w tym umiejętności poszukiwania zatrudnienia, finansowanych przez przedsiębiorcę, lub \n5) przekazanie na potrzeby szkoły, lub centrum kształcenia zawodowego, lub placówki kształcenia ustawicznego, lub uczelni maszyn oraz narzędzi, lub \n6) stworzenie klasy patronackiej lub laboratorium, lub \n7) kształcenie dualne, lub \n8) prowadzenie przez zatrudnionego pracownika doktoratu wdrożeniowego.\n","Oświadczenie przedsiębiorcy złożone w formularzu aplikacyjnym i weryfikacja, czy przedsiębiorca, w związku z realizacją inwestycji, spełnił co najmniej 4 z 8 warunków przez:\n\nW zakresie pkt 1 i 2: ponoszenie w całym okresie utrzymania inwestycji kosztów szkoleń świadczonych przez podmioty zewnętrzne lub kształcenia w jednostkach oświatowych lub uczelniach w wysokości co najmniej 1000 zł brutto średniorocznie na każde miejsce pracy, dla co najmniej 50% pracowników zatrudnionych w zakładzie. W przypadku szkoleń wewnętrznych zatrudnianie, w okresie utrzymania inwestycji, pracownika, w którego zakresie obowiązków znajduje się wyłącznie szkolenie pracowników w zakładzie.\n\nW zakresie pkt 3: zawarcie i wykonanie umowy z organem prowadzącym szkołę, lub placówkę kształcenia ustawicznego, lub centrum kształcenia zawodowego, lub uczelnią, w sprawie prowadzenia w okresie utrzymania inwestycji praktyk, staży lub szkoleń u tego przedsiębiorcy oraz przyjęcie w każdym roku utrzymania inwestycji co najmniej jednej osoby na praktykę staż lub szkolenie w zakładzie, w którym zrealizowana została inwestycja. \n\nW zakresie pkt 4: zawarcie i wykonanie umowy z organem prowadzącym szkołę lub centrum kształcenia zawodowego lub placówkę kształcenia ustawicznego, lub uczelnią, w sprawie zapewniania, w okresie utrzymania inwestycji, uczniom lub studentom, lub nauczycielom kształcenia zawodowego, finansowanych przez przedsiębiorcę, pozaszkolnych zajęć edukacyjnych, mających na celu uzyskanie, uzupełnienie lub doskonalenie umiejętności i kwalifikacji zawodowych lub ogólnych, potrzebnych do wykonywania pracy oraz zorganizowanie co najmniej jednych takich zajęć w każdym roku utrzymania inwestycji. \n\nW zakresie pkt 5: zawarcie i wykonanie umowy z organem prowadzącym szkołę lub centrum kształcenia zawodowego, lub placówkę kształcenia ustawicznego, lub uczelnią, której przedmiotem jest przekazanie, w okresie utrzymania inwestycji, na potrzeby tej szkoły, lub centrum kształcenia zawodowego, lub placówki kształcenia ustawicznego, lub uczelni, maszyn lub narzędzi, poświadczone protokołem przekazania.\n\nW zakresie pkt 6: zawarcie i wykonanie umowy z organem prowadzącym szkołę lub centrum kształcenia zawodowego lub placówkę kształcenia ustawicznego, lub uczelnią, której przedmiotem jest stworzenie w całym okresie utrzymania inwestycji klasy patronackiej lub laboratorium. \n\nW zakresie pkt 7: zawarcie i wykonanie umowy z organem prowadzącym szkołę lub centrum kształcenia zawodowego lub uczelnią, której przedmiotem jest przyjmowanie uczniów na praktyczną naukę zawodu lub studentów na studia dualne prowadzone z udziałem przedsiębiorcy, w okresie utrzymania inwestycji oraz przyjęcie w każdym roku utrzymania inwestycji co najmniej jednej osoby na praktykę lub staż w zakładzie, w którym realizowana jest Inwestycja. \n\nW zakresie pkt 8: przedstawienie, w okresie utrzymania inwestycji, przez co najmniej jednego pracownika przedsiębiorcy, indywidualnego planu badawczego podmiotowi prowadzącemu szkołę doktorską."]
["11. Podejmowanie działań w zakresie opieki nad pracownikiem","Podejmowanie działań w zakresie opieki nad pracownikiem, w szczególności przez:\n1) oferowanie pracownikom udziału w dodatkowych programach opieki zdrowotnej wykraczających poza świadczenia wymagane przepisami prawa, lub \n2) oferowanie pracownikom dodatkowych świadczeń pracowniczych z zakresu różnych form wypoczynku, działalności kulturalno-oświatowej, sportowo-rekreacyjnej, ubezpieczeń, lub \n3) tworzenie lub zlecenie utworzenia i prowadzenia podmiotowi zewnętrznemu przyzakładowego żłobka lub przedszkola, lub\n4) pokrywanie 50% kosztów związanych z pobytem w żłobku, klubie dziecięcym lub placówce wychowania przedszkolnego, oddziale przedszkolnym w szkole podstawowej, zespole wychowania przedszkolnego, punkcie przedszkolnym dzieci do lat 6, przy założeniu, że ze świadczenia w okresie utrzymania korzysta 20% pracowników zakładu.\n","Oświadczenie przedsiębiorcy złożone w formularzu aplikacyjnym i weryfikacja, czy przedsiębiorca w okresie utrzymania inwestycji ponosił koszty świadczeń dotyczących działań w zakresie opieki nad pracownikiem w wysokości co najmniej 1000 zł brutto rocznie na każde miejsce pracy w zakładzie. "]

{"sheet":"Załącznik 2 - Procesy","index":2,"n_rows":26,"n_cols":4,"rows_kept":26,"cut":false,"hidden":false,"merged":[[15,1,19,1],[0,2,2,3],[5,1,8,1],[9,1,12,1],[13,1,14,1]]}
[null,null,"Kategorie procesów wspieranych w ramach Centrów Usług Biznesowych, Centrów Usług Badawczo-Rozwojowych"]
[]
[]
[]
[null,"Obszar","Proces","Ilość pracowników zaangażowanych w procesie"]
[null,"Finanse i Księgowość","• Zarządzanie Zobowiązaniami:\n• Zobowiązania\n• Płatności\n• Rozliczenia pracownicze"]
[null,null,"• Zarządzanie Należnościami:\n• Należności\n• Windykacja\n• Wystawianie faktur sprzedażowych"]
[null,null,"• Obszar Księgi Głównej\n• Księga Główna\n• Środki trwałe\n• Rozliczenia wewnątrzgrupowe\n• Deklaracje podatkowe\n• Przygotowanie Bilansu, Rachunku Wyników oraz pozostałych raportów / sprawozdań finansowych"]
[null,null,"• Kontroling\n• Zarządzanie płynnością / Skarbiec\n• Analityka\n• Rachunkowość zarządcza"]
[null,"Usługi IT","• Zarządzanie Danymi Podstawowymi \n• Wsparcie Użytkownika: \n• Rozwiązywanie prostych zapytań oraz zmian dotyczących aplikacji / stacji roboczych"]
[null,null,"• Zarządzanie Aplikacjami: \n• Specjalistyczne wsparcie aplikacji;\n• Zdalna naprawa i zmiana konfiguracji w celu rozwiązywania problemu klienta \n• Utrzymywanie aplikacji \n• Lokalizacja aplikacji, testowanie aplikacji"]
[null,null,"• Zarządzanie Infrastrukturą IT: \n• Zarządzanie infrastrukturą \n• Zarządzanie projektami infrastrukturalnymi \n• Integracja aplikacji i HW (Hardware)"]
[null,null,"• Wdrażanie Rozwiązań IT / IT Konsulting: \n• Wdrożenia systemów i aplikacji w oparciu o potrzeby klienta \n• Wdrożenia rozwiązań z zakresu AI lub RPA \n• Rozwój oprogramowania"]
[null,"Usługi HR","Usługi „twardego” HR:\n• Zarządzanie i kontrola dokumentacji kadrowej\n• Kalkulacja płac\n• Zarządzanie siatką płac oraz systemem motywacyjnym"]
[null,null,"Usługi „miękkiego” HR:\n• Zarządzanie talentami\n• Szkolenia\n• Zarządzanie procesem rekrutacji\n• Mobility / Mobilność"]
[null,"Usługi Bankowe, Ubezpieczeniowe, Finansowe","• Obsługa aktywów – wsparcie administracyjne \n• Wycena aktywów netto"]
[null,null,"Specyficzne Procesy Bankowe / Bankowości inwestycyjnej: \n• Zarządzanie ryzykiem \n• Obsługa aktywów – middle office \n• Zarządzanie majątkiem \n• Zarządzanie aktywami \n• Netting"]
[null,null,"• Specyficzne Procesy Ubezpieczeniowe: \n• Wyceny ryzyka \n• Czynności aktuarialne \n• Wyceny i analizy rynkowe"]
[null,null,"Specyficzne Procesy Rynku Kapitałowego: \n• Hedging \n• Rynki Globalne / operacje walutowe \n• Usługi inwestycji alternatywnych \n• Instrumenty pochodne"]
[null,null,"• Tworzenie produktów \n• Zarządzanie portfelem aktywów"]
[null,"Usługi Badawczo-Rozwojowe","Świadczenie usług badawczo-rozwojowych, o których mowa w poz. 72 PKWIU lub prowadzenie badań naukowych lub prac rozwojowych w rozumieniu ustawy z dnia 20 lipca 2018 r. – Prawo o szkolnictwie wyższym i nauce."]
[null,"Zarządzanie Łańcuchem Dostaw","• Plan to Deliver"]
[null,"Dział zakupów","• Planowanie\n• Zakupy\n• Zarządzanie kontraktami\n• Zarządzanie portfelem dostawców"]
[null,"Usługi Wyspecjalizowane","• Wsparcie usług prawnych \n• Usługi audytu / Wsparcie usług audytu \n• Wsparcie w zakresie leczenia / procesów medycznych \n• Usługi marketingowe"]
[null,"Zarządzanie Projektami i Transformacją Biznesową","• Zarządzanie projektami finansowymi, HR-owymi / kadrowymi oraz innymi procesami biznesowymi\n• Kierowanie projektami biznesowymi z pełną odpowiedzialnością finansową i jakościową\n• Kierowanie Programami Transformacji Biznesowej"]
[null,"Zarządzanie Wiedzą","Centra obsługujące kompleksowe i całościowe procesy w układzie KPO (np. zarządzanie wiedzą - knowledge management - podejmowanie decyzji wysokiego ryzyka, wysoce wyspecjalizowane procesy informatyczne i finansowe, charakteryzujące się wysokim „know-how” po stronie usługodawcy), zarządzanie portfelem projektów (PPM, PMO, zarządzanie ryzykiem, zarządzanie zmianą)"]

{"sheet":"Back","index":3,"n_rows":2527,"n_cols":39,"rows_kept":2527,"cut":false,"hidden":true,"merged":[]}
[]
[null,"Cost_Type",null,null,null,null,"MediumCity_Type",null,null,null,"MediumCity_Reason",null,null,"MediumCity_Additional Inforatiom",null,null,null,"Named Range","Key project dates",null,null,365]
[null,{"$f":"IF(Selected_Investment_Type=3,\"\",\"Koszty nowej inwestycji\")","v":"Koszty nowej inwestycji"},1,null,null,null,"TAK",false,null,null,"Inwestycja zlokalizowana w jednym z 139 miast tracąćych",null,null,{"$f":"IF(Formularz!$C$58=Back!K3,\"Miasto\",IF(Formularz!$C$58=Back!K4,\"Lokalizacja znajduje się w obszarze graniczącym z:\",\"\"))","v":""},null,null,null,"B_Start_3",-3,{"$f":"$T$6+(S3*$V$2)","v":"2021-05-07"}]
[null,{"$f":"IF(Selected_Investment_Type>2,\"Dwuletnie Koszty Pracy\",\"\")","v":""},2,null,null,null,"NIE",false,{"$f":"IF(H4,1,0)","v":0},null,"Inwestycja znajduje się w obszarze graniczącym z miastem tracącym",null,null,null,null,null,null,"B_Start_2",-2,"2022-05-07"]
[null,"Selected Cost_Type",1,null,null,null,null,null,null,null,null,null,null,null,null,null,null,"B_Start_1",-1,{"$f":"$T$6+(S5*$V$2)","v":"2023-05-07"}]
[null,null,null,null,null,null,null,null,null,null,null,null,null,null,null,null,null,"Project_Start_Date","Start Date",{"$f":"IF(Project_Start_Date=0,TODAY(),Project_Start_Date)","v":"2024-05-06"}]
[null,"Kryteria jakościowe",null,null,null,null,"Kwestionariusz o powiązanach z innymi podmiotami",null,null,null,null,null,null,null,null,null,null,"A_Start_1",1,{"$f":"IF(Project_Start_Date+(S7*$V$2)<=Project_End_Date,Project_Start_Date+(S7*$V$2),\"\")","v":""}]
[null,1,false,null,null,null,null,"Tak","Nie",null,null,null,null,null,null,null,null,"A_Start_2",2,""]
[null,2,false,null,null,null,"a",false,false,null,null,null,null,null,null,null,{"$f":"YEAR(TODAY())","v":2024},"A_Start_3",3,""]
[null,3,false,null,null,null,"b",false,null,null,null,null,null,null,null,null,{"$f":"IF(Project_Start_Date=0,YEAR(TODAY()),Project_Start_Date)","v":2024},"A_Start_4",4,""]
[null,4,false,null,null,null,"c",false,false,null,null,null,null,null,null,null,null,"A_Start_5",5,""]
[null,5,false,null,null,null,"d",false,false,null,null,null,null,null,null,null,null,"A_Start_6",6,""]
[null,6,false,null,null,null,"e",false,null,null,null,null,null,null,null,null,null,"A_Start_7",7,""]
[null,7,false,null,null,null,"f",false]
[null,8,false,null,null,null,null,{"$f":"COUNTIF(H9:H14,TRUE)","v":0},{"$f":"COUNTIF(I9:I14,TRUE)","v":0}]
[null,9,false]
[null,10,false]
[null,11,false]
[null,null,{"$f":"IF(Cost_Type=1,COUNTIF(C8:C18,TRUE),COUNTIF(C8:C17,TRUE))","v":0}]
[null,null,null,null,null,null,"Kwestionariusz o prowadzeniu działalności w niedozwolonych sektorach",null,null,null,null,null,null,null,null,null,null,"InnovativenessType_List"]
[null,null,null,null,null,null,null,"Tak","Nie",null,null,null,null,null,null,null,null,"nowy lub udoskonalony produkt, który w istotnym stopniu różni się od produktów wytwarzanych dotychczas na terenie Polski i który zostanie udostępniony przez przedsiębiorcę potencjalnym użytkownikom w wyniku realizacji inwestycji (innowacja produktowa),"]
[null,"Status szkoleń",null,null,null,null,"a)",false,false,null,null,null,null,null,null,null,null,"nowy lub udoskonalony proces, który w istotnym stopniu różni się od procesów stosowanych dotychczas w produkcji na terenie Polski i który zostanie zastosowany przez przedsiębiorcę w wyniku realizacji inwestycji (innowacja procesowa)"]
[null,"Tak",false,{"$f":"COUNTIF(Status_Training,TRUE)","v":0},null,null,"b)",false,false]
[null,"Nie",false,null,null,null,"c)",false,false,null,null,null,null,null,null,null,null,null,null,null,null,null,null,null,false,{"$f":"COUNTIF(Y24,\"TRUE\")","v":0}]
[null,null,null,null,null,null,"d)",false,false,null,null,null,null,null,null,null,null,null,null,null,null,null,null,null,false,0]
[null,null,null,null,null,null,"e)",false,false,null,null,null,null,null,null,null,null,null,null,null,null,null,null,"OtherPublicAid",false,{"$f":"COUNTIF(Y26,\"TRUE\")","v":0}]
[null,"Reinwestycja",null,null,null,null,"f)",false,false,null,null,null,null,null,null,null,null,null,null,null,null,null,null,null,null,{"$f":"SUM(Z24:Z26)","v":0}]
[null,"Tak",false,{"$f":"COUNTIF(C28,TRUE)","v":0},null,null,"g)",false,false]
[null,"Nie",false,null,null,null,"h)",false,false,null,null,null,null,null,null,null,1,"Strategiczna","Koszty nowej inwestycji",null,null,{"$f":"_xlfn._xlws.FILTER(S29:S33,Q29:Q33=Selected_Investment_Type)","v":"Koszty nowej inwestycji"}]
[null,null,null,null,null,null,"i)",false,false,null,null,null,null,null,null,null,2,"Innowacyjna","Koszty nowej inwestycji"]
[null,null,null,null,null,null,"j)",false,false,null,null,null,null,null,null,null,3,"Centrum Usług Biznesowych","Dwuletnie koszty pracy"]
[null,null,null,null,null,null,null,{"$f":"COUNTIF(H22:H31,TRUE)","v":0},{"$f":"COUNTIF(I22:I31,TRUE)","v":0},"Sum",{"$f":"H32+I32","v":0},null,null,null,null,null,4,"Centrum Usług Badawczo-rozwojowych","Koszty nowej inwestycji"]
[null,"Company_Size_List","Selected_Company_Size",5,null,null,"OtherIncentives_List",null,null,"Status:",1,null,null,null,null,null,4,"Centrum Usług Badawczo-rozwojowych","Dwuletnie koszty pracy"]
[null,"mikroprzedsiębiorca",null,null,null,null,"Nie",null,null,null,null,null,null,null,null,null,null,null,null,null,null,null,null,{"$f":"_xlfn.ANCHORARRAY(Expanded_InvestmentType_list)","v":"utworzenie nowego zakładu"}]
[null,"mały przedsiębiorca",null,null,null,null,"Tak, wartość wsparcia w ramach Programu nie przekracza 3 mln zł",null,null,null,null,null,null,null,null,null,null,null,null,null,null,null,null,"zwiększenie zdolności produkcyjnej istniejącego zakładu"]
[null,"średni przedsiębiorca",null,null,null,null,"Tak, inwestycja Strategiczna o kosztach inwestycji wynoszących co najmniej 300 mln zł",null,null,null,null,null,null,null,null,null,null,null,null,null,null,null,null,"dywersyfikacja produkcji poprzez wprowadzenie produktów lub usług dotąd niewytwarzanych lub nieświadczonych przez ten zakład"]
[null,"przedsiębiorca rozwijający się",null,null,null,null,"Tak, inwestycja Innowacyjna o kosztach inwestycji wynoszących co najmniej 100 mln zł",null,null,null,null,null,null,null,null,null,null,null,null,null,null,null,null,"zasadnicza zmiana całościowego procesu produkcji produktu lub produktów, których dotyczy inwestycja w ten zakład"]
[null,"duży przedsiębiorca",null,null,null,null,"Tak, inwestycja w Centrum Usług Biznesowych, w ramach której\n przedsiębiorca zobowiązał się do utworzenia co najmniej 500 nowych miejsc pracy",null,null,null,null,null,null,null,null,null,null,null,null,null,null,null,null,"nabycie aktywów należących do zakładu, który został zamknięty lub zostałby zamknięty, gdyby zakup nie nastąpił. Samo nabycie akcji lub udziałów przedsiębiorstwa nie stanowi inwestycji początkowej. Inwestycja odtworzeniowa nie stanowi zatem inwestycji początkowej"]
[null,null,null,null,null,null,"Tak, inwestycja w Centrum Usług Badawczo-Rozwojowych"]
[]
[]
[]
[null,"Investment_Type","Selected_Investment_Type",1,null,null,"Basic_Investment_Type",null,null,null,null,null,null,null,null,null,null,"Expanded_Investment Type",null,null,null,null,null,"Expanded_InvestmentType_list"]
[null,"Strategiczna","Warning",{"$f":"IF(Selected_Investment_Type=3,B179,IF(Selected_Investment_Type=4,B179,\"\"))","v":""},null,null,"Inwestycja początkowa ",null,null,null,null,null,null,null,null,null,"Inwestycja początkowa ","utworzenie nowego zakładu",null,null,null,null,null,{"$f":"_xlfn._xlws.FILTER(R44:R51,Q44:Q51=K46)","v":"utworzenie nowego zakładu"},null,null,null,null,{"$f":"X44","v":"utworzenie nowego zakładu"}]
[null,"Innowacyjna",null,null,null,null,"Inwestycja początkowa, która zapoczątkowuje nową działalność gospodarczą ",null,null,null,null,null,null,null,null,null,"Inwestycja początkowa ","zwiększenie zdolności produkcyjnej istniejącego zakładu",null,null,null,null,null,"zwiększenie zdolności produkcyjnej istniejącego zakładu",null,null,null,null,{"$f":"X45","v":"zwiększenie zdolności produkcyjnej istniejącego zakładu"}]
[null,"Centrum Usług Biznesowych",null,null,null,null,"Selected_Basic_Investment_Type",null,null,null,{"$f":"Formularz!B66","v":"Inwestycja początkowa "},null,null,null,null,null,"Inwestycja początkowa ","dywersyfikacja produkcji poprzez wprowadzenie produktów lub usług dotąd niewytwarzanych lub nieświadczonych przez ten zakład",null,null,null,null,null,"dywersyfikacja produkcji poprzez wprowadzenie produktów lub usług dotąd niewytwarzanych lub nieświadczonych przez ten zakład",null,null,null,null,{"$f":"IF(X46=0,\"\",X46)","v":"dywersyfikacja produkcji poprzez wprowadzenie produktów lub usług dotąd niewytwarzanych lub nieświadczonych przez ten zakład"}]
[null,"Centrum Usług Badawczo-rozwojowych",null,null,null,null,null,null,null,null,null,null,null,null,null,null,"Inwestycja początkowa ","zasadnicza zmiana całościowego procesu produkcji produktu lub produktów, których dotyczy inwestycja w ten zakład",null,null,null,null,null,"zasadnicza zmiana całościowego procesu produkcji produktu lub produktów, których dotyczy inwestycja w ten zakład",null,null,null,null,{"$f":"IF(X47=0,\"\",X47)","v":"zasadnicza zmiana całościowego procesu produkcji produktu lub produktów, których dotyczy inwestycja w ten zakład"}]
[null,null,null,null,null,null,null,null,null,null,null,null,null,null,null,null,"Inwestycja początkowa ","nabycie aktywów należących do zakładu, który został zamknięty lub zostałby zamknięty, gdyby zakup nie nastąpił. Samo nabycie akcji lub udziałów przedsiębiorstwa nie stanowi inwestycji początkowej. Inwestycja odtworzeniowa nie stanowi zatem inwestycji początkowej",null,null,null,null,null,"nabycie aktywów należących do zakładu, który został zamknięty lub zostałby zamknięty, gdyby zakup nie nastąpił. Samo nabycie akcji lub udziałów przedsiębiorstwa nie stanowi inwestycji początkowej. Inwestycja odtworzeniowa nie stanowi zatem inwestycji początkowej",null,null,null,null,{"$f":"IF(X48=0,\"\",X48)","v":"nabycie aktywów należących do zakładu, który został zamknięty lub zostałby zamknięty, gdyby zakup nie nastąpił. Samo nabycie akcji lub udziałów przedsiębiorstwa nie stanowi inwestycji początkowej. Inwestycja odtworzeniowa nie stanowi zatem inwestycji początkowej"}]
[null,null,null,null,null,null,null,null,null,null,null,null,null,null,null,null,"Inwestycja początkowa, która zapoczątkowuje nową działalność gospodarczą ","utworzenie nowego zakładu"]
[null,null,null,null,null,null,null,null,null,null,null,null,null,null,null,null,"Inwestycja początkowa, która zapoczątkowuje nową działalność gospodarczą ","dywersyfikacja działalności zakładu, pod warunkiem że nowa działalność nie jest taka sama jak działalność poprzednio prowadzona w danym zakładzie ani podobna do takiej działalności"]
[null,null,null,null,null,null,null,null,null,null,null,null,null,null,null,null,"Inwestycja początkowa, która zapoczątkowuje nową działalność gospodarczą ","nabycie aktywów należących do zakładu, który został zamknięty lub zostałby zamknięty, gdyby zakup nie nastąpił, pod warunkiem że nowa działalność, która ma być prowadzona z wykorzystaniem nabytych aktywów, nie jest taka sama jak działalność prowadzona w zakładzie przed nabyciem ani podobna do takiej działalności. Samo nabycie akcji lub udziałów przedsiębiorstwa nie stanowi inwestycji początkowej, która zapoczątkowuje nową działalność gospodarczą"]
[]
[]
[null,null,null,"Lista województw i regionów NUTS 3",null,null,null,null,null,null,null,"Selected_Nuts3",{"$f":"Formularz!F54","v":0}]
[null,null,null,"Województwo","NUTS 3",null,null,null,"Voivodeships_list",null,null,"VoivodeshipNuts3_List",null,null,null,null,"Lista Nuts 3 i powiatów",null,null,"Nuts3","Nuts3Poviat_list",null,null,null,null,"Lista Powiatów i Gmin",null,null,null,"PoviatGmina_List"]
[null,null,null,"Małopolskie","Miasto Kraków",null,null,null,"Małopolskie",null,null,{"$f":"_xlfn._xlws.FILTER(Nuts3_List,$D$56:$D$128=Selected_Voivodeship)","v":{"$error":"#VALUE!"}},null,null,null,null,"Krakowski","bocheński",null,{"$f":"Selected_Nuts3","v":0},{"$f":"_xlfn._xlws.FILTER(poviat_list,Q56:Q435=Selected_Nuts3,\"\")","v":""},null,null,null,null,"bocheński","Bochnia",null,null,{"$f":"_xlfn._xlws.FILTER(Commune_List,Z56:Z2527=Selected_Poviat,\"\")","v":""}]
[null,null,null,"Małopolskie","Krakowski",null,null,null,"Śląskie",null,null,null,null,null,null,null,"Krakowski","krakowski",null,null,null,null,null,null,null,"bocheński","Drwinia"]
[null,null,null,"Małopolskie","Tarnowski",null,null,null,"Wielkopolskie",null,null,null,null,null,null,null,"Krakowski","miechowski",null,null,null,null,null,null,null,"bocheński","Lipnica Murowana"]
[null,null,null,"Małopolskie","Nowosądecki",null,null,null,"Zachodniopomorskie",null,null,null,null,null,null,null,"Krakowski","myślenicki",null,null,null,null,null,null,null,"bocheński","Łapanów"]
[null,null,null,"Małopolskie","Nowotarski",null,null,null,"Lubuskie",null,null,null,null,null,null,null,"Krakowski","proszowicki",null,null,null,null,null,null,null,"bocheński","Nowy Wiśnicz"]
[null,null,null,"Małopolskie","Oświęcimski",null,null,null,"Dolnośląskie",null,null,null,null,null,null,null,"Krakowski","wielicki",null,null,null,null,null,null,null,"bocheński","Rzezawa"]
[null,null,null,"Śląskie","Częstochowski",null,null,null,"Opolskie",null,null,null,null,null,null,null,"Miasto Kraków","Kraków",null,null,null,null,null,null,null,"bocheński","Trzciana"]
[null,null,null,"Śląskie","Bielski",null,null,null,"Kujawsko-pomorskie",null,null,null,null,null,null,null,"Nowosądecki","gorlicki",null,null,null,null,null,null,null,"bocheński","Żegocina"]
[null,null,null,"Śląskie","Rybnicki",null,null,null,"Warmińsko-mazurskie",null,null,null,null,null,null,null,"Nowosądecki","limanowski",null,null,null,null,null,null,null,"krakowski","Czernichów"]
[null,null,null,"Śląskie","Bytomski",null,null,null,"Pomorskie",null,null,null,null,null,null,null,"Nowosądecki","nowosądecki",null,null,null,null,null,null,null,"krakowski","Igołomia-Wawrzeńczyce"]
[null,null,null,"Śląskie","Gliwicki",null,null,null,"Łódzkie",null,null,null,null,null,null,null,"Nowosądecki","Nowy Sącz",null,null,null,null,null,null,null,"krakowski","Iwanowice"]
[null,null,null,"Śląskie","Katowicki",null,null,null,"Świętokrzyskie",null,null,null,null,null,null,null,"Oświęcimski","chrzanowski",null,null,null,null,null,null,null,"krakowski","Jerzmanowice-Przeginia"]
[null,null,null,"Śląskie","Sosnowiecki",null,null,null,"Lubelskie",null,null,null,null,null,null,null,"Oświęcimski","olkuski",null,null,null,null,null,null,null,"krakowski","Kocmyrzów-Luborzyca"]
[null,null,null,"Śląskie","Tyski",null,null,null,"Podkarpackie",null,null,null,null,null,null,null,"Oświęcimski","oświęcimski",null,null,null,null,null,null,null,"krakowski","Krzeszowice"]
[null,null,null,"Wielkopolskie","Pilski",null,null,null,"Podlaskie",null,null,null,null,null,null,null,"Oświęcimski","wadowicki",null,null,null,null,null,null,null,"krakowski","Liszki"]
[null,null,null,"Wielkopolskie","Koniński",null,null,null,"Mazowieckie",null,null,null,null,null,null,null,"Tarnowski","brzeski",null,null,null,null,null,null,null,"krakowski","Michałowice"]
[null,null,null,"Wielkopolskie","Miasto Poznań",null,null,null,null,null,null,null,null,null,null,null,"Tarnowski","dąbrowski",null,null,null,null,null,null,null,"krakowski","Mogilany"]
[null,null,null,"Wielkopolskie","Kaliski",null,null,null,null,null,null,null,null,null,null,null,"Tarnowski","tarnowski",null,null,null,null,null,null,null,"krakowski","Skała"]
[null,null,null,"Wielkopolskie","Leszczyński",null,null,null,null,null,null,null,null,null,null,null,"Tarnowski","Tarnów",null,null,null,null,null,null,null,"krakowski","Skawina"]
[null,null,null,"Wielkopolskie","Poznański",null,null,null,null,null,null,null,null,null,null,null,"Nowotarski","nowotarski",null,null,null,null,null,null,null,"krakowski","Słomniki"]
[null,null,null,"Zachodniopomorskie","Miasto Szczecin",null,null,null,null,null,null,null,null,null,null,null,"Nowotarski","suski",null,null,null,null,null,null,null,"krakowski","Sułoszowa"]
[null,null,null,"Zachodniopomorskie","Koszaliński",null,null,null,null,null,null,null,null,null,null,null,"Nowotarski","tatrzański",null,null,null,null,null,null,null,"krakowski","Świątniki Górne"]
[null,null,null,"Zachodniopomorskie","Szczecinecko-pyrzycki",null,null,null,null,null,null,null,null,null,null,null,"Bielski","bielski",null,null,null,null,null,null,null,"krakowski","Wielka Wieś"]
[null,null,null,"Zachodniopomorskie","Szczeciński",null,null,null,null,null,null,null,null,null,null,null,"Bielski","cieszyński",null,null,null,null,null,null,null,"krakowski","Zabierzów"]
[null,null,null,"Lubuskie","Gorzowski",null,null,null,null,null,null,null,null,null,null,null,"Bielski","żywiecki",null,null,null,null,null,null,null,"krakowski","Zielonki"]
[null,null,null,"Lubuskie","Zielonogórski",null,null,null,null,null,null,null,null,null,null,null,"Bielski","Bielsko-Biała",null,null,null,null,null,null,null,"miechowski","Charsznica"]
[null,null,null,"Dolnośląskie","Miasto Wrocław",null,null,null,null,null,null,null,null,null,null,null,"Bytomski","lubliniecki",null,null,null,null,null,null,null,"miechowski","Gołcza"]
[null,null,null,"Dolnośląskie","Jeleniogórski",null,null,null,null,null,null,null,null,null,null,null,"Bytomski","tarnogórski",null,"Selected_Poviat",{"$f":"Formularz!I54","v":0},null,null,null,null,"miechowski","Kozłów"]
[null,null,null,"Dolnośląskie","Legnicko-głogowski",null,null,null,null,null,null,null,null,null,null,null,"Bytomski","Bytom",null,null,null,null,null,null,null,"miechowski","Książ Wielki"]
[null,null,null,"Dolnośląskie","Wałbrzyski",null,null,null,null,null,null,null,null,null,null,null,"Bytomski","Piekary Śląskie",null,null,null,null,null,null,null,"miechowski","Miechów"]
[null,null,null,"Dolnośląskie","Wrocławski",null,null,null,null,null,null,null,null,null,null,null,"Częstochowski","częstochowski",null,null,null,null,null,null,null,"miechowski","Racławice"]
[null,null,null,"Opolskie","Nyski",null,null,null,null,null,null,null,null,null,null,null,"Częstochowski","kłobucki",null,null,null,null,null,null,null,"miechowski","Słaboszów"]
[null,null,null,"Opolskie","Opolski",null,null,null,null,null,null,null,null,null,null,null,"Częstochowski","myszkowski",null,null,null,null,null,null,null,"myślenicki","Dobczyce"]
[null,null,null,"Kujawsko-pomorskie","Bydgosko-toruński",null,null,null,null,null,null,null,null,null,null,null,"Częstochowski","Częstochowa",null,null,null,null,null,null,null,"myślenicki","Lubień"]
[null,null,null,"Kujawsko-pomorskie","Grudziądzki",null,null,null,null,null,null,null,null,null,null,null,"Gliwicki","gliwicki",null,null,null,null,null,null,null,"myślenicki","Myślenice"]
[null,null,null,"Kujawsko-pomorskie","Inowrocławski",null,null,null,null,null,null,null,null,null,null,null,"Gliwicki","Gliwice",null,null,null,null,null,null,null,"myślenicki","Pcim"]
[null,null,null,"Kujawsko-pomorskie","Świecki",null,null,null,null,null,null,null,null,null,null,null,"Gliwicki","Zabrze",null,null,null,null,null,null,null,"myślenicki","Raciechowice"]
[null,null,null,"Kujawsko-pomorskie","Włocławski",null,null,null,null,null,null,null,null,null,null,null,"Katowicki","Chorzów",null,null,null,null,null,null,null,"myślenicki","Siepraw"]
[null,null,null,"Warmińsko-mazurskie","Elbląski",null,null,null,null,null,null,null,null,null,null,null,"Katowicki","Katowice",null,null,null,null,null,null,null,"myślenicki","Sułkowice"]
[null,null,null,"Warmińsko-mazurskie","Olsztyński",null,null,null,null,null,null,null,null,null,null,null,"Katowicki","Mysłowice",null,null,null,null,null,null,null,"myślenicki","Tokarnia"]
[null,null,null,"Warmińsko-mazurskie","Ełcki",null,null,null,null,null,null,null,null,null,null,null,"Katowicki","Ruda Śląska",null,null,null,null,null,null,null,"myślenicki","Wiśniowa"]
[null,null,null,"Pomorskie","Trójmiejski",null,null,null,null,null,null,null,null,null,null,null,"Katowicki","Siemianowice Śląskie",null,null,null,null,null,null,null,"proszowicki","Koniusza"]
[null,null,null,"Pomorskie","Gdański",null,null,null,null,null,null,null,null,null,null,null,"Katowicki","Świętochłowice",null,null,null,null,null,null,null,"proszowicki","Koszyce"]
[null,null,null,"Pomorskie","Słupski",null,null,null,null,null,null,null,null,null,null,null,"Rybnicki","raciborski",null,null,null,null,null,null,null,"proszowicki","Nowe Brzesko"]
[null,null,null,"Pomorskie","Chojnicki",null,null,null,null,null,null,null,null,null,null,null,"Rybnicki","rybnicki",null,null,null,null,null,null,null,"proszowicki","Pałecznica"]
[null,null,null,"Pomorskie","Starogardzki",null,null,null,null,null,null,null,null,null,null,null,"Rybnicki","wodzisławski",null,null,null,null,null,null,null,"proszowicki","Proszowice",null,null,null,null,"AGD",null,"Farmaceutyczna",null,null,"Meblarska",null,"Spożywcza"]
[null,null,null,"Łódzkie","Miasto Łódź",null,null,null,null,null,null,null,null,null,null,null,"Rybnicki","Jastrzębie-Zdrój",null,null,null,null,null,null,null,"proszowicki","Radziemice",null,null,null,null,"Biotechnologiczna",null,"Gospodarka odpadami",null,null,"Medyczna",null,"Szklarska"]
[null,null,null,"Łódzkie","Łódzki",null,null,null,null,null,null,null,null,null,null,null,"Rybnicki","Rybnik",null,null,null,null,null,null,null,"wielicki","Biskupice",null,null,null,null,"BSS",null,"Komponenty dla OZE",null,null,"Metalowa",null,"Tekstylna"]
[null,null,null,"Łódzkie","Piotrkowski",null,null,null,null,null,null,null,null,null,null,null,"Rybnicki","Żory",null,null,null,null,null,null,null,"wielicki","Gdów",null,null,null,null,"Chemiczna",null,"Kosmetyczna",null,null,"Motoryzacyjna",null,"Turystyczno-rozrywkowa"]
[null,null,null,"Łódzkie","Sieradzki",null,null,null,null,null,null,null,null,null,null,null,"Sosnowiecki","będziński",null,null,null,null,null,null,null,"wielicki","Kłaj",null,null,null,null,"Drzewna",null,"Logistyczna",null,null,"Nieruchomości",null,"Tworzyw sztucznych"]
[null,null,null,"Łódzkie","Skierniewicki",null,null,null,null,null,null,null,null,null,null,null,"Sosnowiecki","zawierciański",null,null,null,null,null,null,null,"wielicki","Niepołomice",null,null,null,null,"Elektromobilność",null,"Lotnicza",null,null,"Okołostoczniowy",null,"Tytoniowa"]
[null,null,null,"Świętokrzyskie","Kielecki",null,null,null,null,null,null,null,null,null,null,null,"Sosnowiecki","Dąbrowa Górnicza",null,null,null,null,null,null,null,"wielicki","Wieliczka",null,null,null,null,"Elektroniczna",null,"Maszynowa",null,null,"Środków transportu",null,"Wydobywcza"]
[null,null,null,"Świętokrzyskie","Sandomiersko-jędrzejowski",null,null,null,null,null,null,null,null,null,null,null,"Sosnowiecki","Jaworzno",null,null,null,null,null,null,null,"Kraków","Kraków",null,null,null,null,"Energetyczna",null,"Materiały budowlane",null,null,"R&D",null,"Inna (wskazać):"]
[null,null,null,"Lubelskie","Bialski",null,null,null,null,null,null,null,null,null,null,null,"Sosnowiecki","Sosnowiec",null,null,null,null,null,null,null,"Kraków","Kraków-Krowodrza"]
[null,null,null,"Lubelskie","Chełmsko-zamojski",null,null,null,null,null,null,null,null,null,null,null,"Tyski","mikołowski",null,null,null,null,null,null,null,"Kraków","Kraków-Nowa Huta"]
[null,null,null,"Lubelskie","Lubelski",null,null,null,null,null,null,null,null,null,null,null,"Tyski","pszczyński",null,null,null,null,null,null,null,"Kraków","Kraków-Podgórze"]
[null,null,null,"Lubelskie","Puławski",null,null,null,null,null,null,null,null,null,null,null,"Tyski","bieruńsko-lędziński",null,null,null,null,null,null,null,"Kraków","Kraków-Śródmieście"]
[null,null,null,"Podkarpackie","Krośnieński",null,null,null,null,null,null,null,null,null,null,null,"Tyski","Tychy",null,null,null,null,null,null,null,"gorlicki","Gorlice"]
[null,null,null,"Podkarpackie","Przemyski",null,null,null,null,null,null,null,null,null,null,null,"Gorzowski","gorzowski",null,null,null,null,null,null,null,"gorlicki","Biecz"]
[null,null,null,"Podkarpackie","Rzeszowski",null,null,null,null,null,null,null,null,null,null,null,"Gorzowski","międzyrzecki",null,null,null,null,null,null,null,"gorlicki","Bobowa"]
[null,null,null,"Podkarpackie","Tarnobrzeski",null,null,null,null,null,null,null,null,null,null,null,"Gorzowski","słubicki",null,null,null,null,null,null,null,"gorlicki","Gorlice"]
[null,null,null,"Podlaskie","Białostocki",null,null,null,null,null,null,null,null,null,null,null,"Gorzowski","strzelecko-drezdenecki",null,null,null,null,null,null,null,"gorlicki","Lipinki"]
[null,null,null,"Podlaskie","Łomżyński",null,null,null,null,null,null,null,null,null,null,null,"Gorzowski","sulęciński",null,null,null,null,null,null,null,"gorlicki","Łużna"]
[null,null,null,"Podlaskie","Suwalski",null,null,null,null,null,null,null,null,null,null,null,"Gorzowski","Gorzów Wielkopolski",null,null,null,null,null,null,null,"gorlicki","Moszczenica"]
[null,null,null,"Mazowieckie","Miasto Warszawa",null,null,null,null,null,null,null,null,null,null,null,"Zielonogórski","krośnieński",null,null,null,null,null,null,null,"gorlicki","Ropa"]
[null,null,null,"Mazowieckie","Warszawski wschodni",null,null,null,null,null,null,null,null,null,null,null,"Zielonogórski","nowosolski",null,null,null,null,null,null,null,"gorlicki","Sękowa"]
[null,null,null,"Mazowieckie","Warszawski zachodni",null,null,null,null,null,null,null,null,null,null,null,"Zielonogórski","świebodziński",null,null,null,null,null,null,null,"gorlicki","Uście Gorlickie"]
[null,null,null,"Mazowieckie","Radomski",null,null,null,null,null,null,null,null,null,null,null,"Zielonogórski","zielonogórski",null,null,null,null,null,null,null,"limanowski","Limanowa"]
[null,null,null,"Mazowieckie","Ciechanowski",null,null,null,null,null,null,null,null,null,null,null,"Zielonogórski","żagański",null,null,null,null,null,null,null,"limanowski","Mszana Dolna"]
[null,null,null,"Mazowieckie","Płocki",null,null,null,null,null,null,null,null,null,null,null,"Zielonogórski","żarski",null,null,null,null,null,null,null,"limanowski","Dobra"]
[null,null,null,"Mazowieckie","Ostrołęcki",null,null,null,null,null,null,null,null,null,null,null,"Zielonogórski","wschowski",null,null,null,null,null,null,null,"limanowski","Jodłownik"]
[null,null,null,"Mazowieckie","Siedlecki",null,null,null,null,null,null,null,null,null,null,null,"Zielonogórski","Zielona Góra",null,null,null,null,null,null,null,"limanowski","Kamienica"]
[null,null,null,"Mazowieckie","Żyrardowski",null,null,null,null,null,null,null,null,null,null,null,"Kaliski","jarociński",null,null,null,null,null,null,null,"limanowski","Laskowa"]
[null,null,null,"Selected_Voivodeship",{"$f":"Formularz!C54","v":0},null,null,null,null,null,null,null,null,null,null,null,"Kaliski","kaliski",null,null,null,null,null,null,null,"limanowski","Łukowica"]
[null,null,null,null,null,null,null,null,null,null,null,null,null,null,null,null,"Kaliski","kępiński",null,null,null,null,null,null,null,"limanowski","Mszana Dolna"]
[null,null,null,null,null,null,null,null,null,null,null,null,null,null,null,null,"Kaliski","krotoszyński",null,null,null,null,null,null,null,"limanowski","Niedźwiedź"]
[null,null,null,null,null,null,null,null,null,null,null,null,null,null,null,null,"Kaliski","ostrowski",null,null,null,null,null,null,null,"limanowski","Słopnice"]
[null,null,null,null,null,null,null,null,null,null,null,null,null,null,null,null,"Kaliski","ostrzeszowski",null,null,null,null,null,null,null,"limanowski","Tymbark"]
[null,null,null,null,null,null,null,null,null,null,null,null,null,null,null,null,"Kaliski","pleszewski",null,null,null,null,null,null,null,"nowosądecki","Grybów"]
[null,null,null,null,null,null,null,null,null,null,null,null,null,null,null,null,"Kaliski","Kalisz",null,null,null,null,null,null,null,"nowosądecki","Chełmiec"]
[null,null,null,null,null,null,null,null,null,null,null,null,null,null,null,null,"Koniński","gnieźnieński",null,null,null,null,null,null,null,"nowosądecki","Gródek nad Dunajcem"]
[null,null,null,null,null,null,null,null,null,null,null,null,null,null,null,null,"Koniński","kolski",null,null,null,null,null,null,null,"nowosądecki","Grybów"]
[null,null,null,null,null,null,null,null,null,null,null,null,null,null,null,null,"Koniński","koniński",null,null,null,null,null,null,null,"nowosądecki","Kamionka Wielka"]
[null,null,null,null,null,null,null,null,null,null,null,null,null,null,null,null,"Koniński","słupecki",null,null,null,null,null,null,null,"nowosądecki","Korzenna"]
[null,null,null,null,null,null,null,null,null,null,null,null,null,null,null,null,"Koniński","turecki",null,null,null,null,null,null,null,"nowosądecki","Krynica-Zdrój"]
[null,null,null,null,null,null,null,null,null,null,null,null,null,null,null,null,"Koniński","wrzesiński",null,null,null,null,null,null,null,"nowosądecki","Łabowa"]
[null,null,null,null,null,null,null,null,null,null,null,null,null,null,null,null,"Koniński","Konin",null,null,null,null,null,null,null,"nowosądecki","Łącko"]
[null,null,null,null,null,null,null,null,null,null,null,null,null,null,null,null,"Leszczyński","gostyński",null,null,null,null,null,null,null,"nowosądecki","Łososina Dolna"]
[null,null,null,null,null,null,null,null,null,null,null,null,null,null,null,null,"Leszczyński","grodziski",null,null,null,null,null,null,null,"nowosądecki","Muszyna"]
[null,null,null,null,null,null,null,null,null,null,null,null,null,null,null,null,"Leszczyński","kościański",null,null,null,null,null,null,null,"nowosądecki","Nawojowa"]
[null,null,null,null,null,null,null,null,null,null,null,null,null,null,null,null,"Leszczyński","leszczyński",null,null,null,null,null,null,null,"nowosądecki","Piwniczna-Zdrój"]
[null,null,null,null,null,null,null,null,null,null,null,null,null,null,null,null,"Leszczyński","międzychodzki",null,null,null,null,null,null,null,"nowosądecki","Podegrodzie"]
[null,null,null,null,null,null,null,null,null,null,null,null,null,null,null,null,"Leszczyński","nowotomyski",null,null,null,null,null,null,null,"nowosądecki","Rytro"]
[null,null,null,null,null,null,null,null,null,null,null,null,null,null,null,null,"Leszczyński","rawicki",null,null,null,null,null,null,null,"nowosądecki","Stary Sącz"]
[null,null,null,null,null,null,null,null,null,null,null,null,null,null,null,null,"Leszczyński","wolsztyński",null,null,null,null,null,null,null,"Nowy Sącz","Nowy Sącz"]
[null,null,null,null,null,null,null,null,null,null,null,null,null,null,null,null,"Leszczyński","Leszno",null,null,null,null,null,null,null,"chrzanowski","Alwernia"]
[null,null,null,null,null,null,null,null,null,null,null,null,null,null,null,null,"Pilski","chodzieski",null,null,null,null,null,null,null,"chrzanowski","Babice"]
[null,null,null,null,null,null,null,null,null,null,null,null,null,null,null,null,"Pilski","czarnkowsko-trzcianecki",null,null,null,null,null,null,null,"chrzanowski","Chrzanów"]
[null,null,null,null,null,null,null,null,null,null,null,null,null,null,null,null,"Pilski","pilski",null,null,null,null,null,null,null,"chrzanowski","Libiąż"]
[null,null,null,null,null,null,null,null,null,null,null,null,null,null,null,null,"Pilski","wągrowiecki",null,null,null,null,null,null,null,"chrzanowski","Trzebinia"]
[null,null,null,null,null,null,null,null,null,null,null,null,null,null,null,null,"Pilski","złotowski",null,null,null,null,null,null,null,"olkuski","Bukowno"]
[null,null,null,null,null,null,null,null,null,null,null,null,null,null,null,null,"Poznański","obornicki",null,null,null,null,null,null,null,"olkuski","Bolesław"]
[null,null,null,null,null,null,null,null,null,null,null,null,null,null,null,null,"Poznański","poznański",null,null,null,null,null,null,null,"olkuski","Klucze"]
[null,null,null,null,null,null,null,null,null,null,null,null,null,null,null,null,"Poznański","szamotulski",null,null,null,null,null,null,null,"olkuski","Olkusz"]
[null,null,null,null,null,null,null,null,null,null,null,null,null,null,null,null,"Poznański","średzki",null,null,null,null,null,null,null,"olkuski","Trzyciąż"]
[null,null,null,null,null,null,null,null,null,null,null,null,null,null,null,null,"Poznański","śremski",null,null,null,null,null,null,null,"olkuski","Wolbrom"]
[null,null,null,null,null,null,null,null,null,null,null,null,null,null,null,null,"Miasto Poznań","Poznań",null,null,null,null,null,null,null,"oświęcimski","Oświęcim"]
[null,null,null,null,null,null,null,null,null,null,null,null,null,null,null,null,"Koszaliński","białogardzki",null,null,null,null,null,null,null,"oświęcimski","Brzeszcze"]
[null,null,null,null,null,null,null,null,null,null,null,null,null,null,null,null,"Koszaliński","kołobrzeski",null,null,null,null,null,null,null,"oświęcimski","Chełmek"]
[null,null,null,null,null,null,null,null,null,null,null,null,null,null,null,null,"Koszaliński","koszaliński",null,null,null,null,null,null,null,"oświęcimski","Kęty"]
[null,null,null,null,null,null,null,null,null,null,null,null,null,null,null,null,"Koszaliński","sławieński",null,null,null,null,null,null,null,"oświęcimski","Osiek"]
[null,null,null,null,null,null,null,null,null,null,null,null,null,null,null,null,"Koszaliński","Koszalin",null,null,null,null,null,null,null,"oświęcimski","Oświęcim"]
[null,null,null,null,null,null,null,null,null,null,null,null,null,null,null,null,"Szczecinecko-pyrzycki","choszczeński",null,null,null,null,null,null,null,"oświęcimski","Polanka Wielka"]
[null,null,null,null,null,null,null,null,null,null,null,null,null,null,null,null,"Szczecinecko-pyrzycki","drawski",null,null,null,null,null,null,null,"oświęcimski","Przeciszów"]
[null,null,null,null,null,null,null,null,null,null,null,null,null,null,null,null,"Szczecinecko-pyrzycki","myśliborski",null,null,null,null,null,null,null,"oświęcimski","Zator"]
[null,null,null,null,null,null,null,null,null,null,null,null,null,null,null,null,"Szczecinecko-pyrzycki","pyrzycki",null,null,null,null,null,null,null,"wadowicki","Andrychów"]
[null,null,null,null,null,null,null,null,null,null,null,null,null,null,null,null,"Szczecinecko-pyrzycki","szczecinecki",null,null,null,null,null,null,null,"wadowicki","Brzeźnica"]
[null,null,null,null,null,null,null,null,null,null,null,null,null,null,null,null,"Szczecinecko-pyrzycki","świdwiński",null,null,null,null,null,null,null,"wadowicki","Kalwaria Zebrzydowska"]
[null,"Text prompts",null,null,null,null,null,null,null,null,null,null,null,null,null,null,"Szczecinecko-pyrzycki","wałecki",null,null,null,null,null,null,null,"wadowicki","Lanckorona"]
[null,"W części formularza przeznaczonej obecności firmy w Polsce należy podać identyfikator podatkowy NIP wszystkich powiązanych z podmiotem przedsiębiorców",null,null,null,null,null,null,null,null,null,null,null,null,null,null,"Szczecinecko-pyrzycki","łobeski",null,null,null,null,null,null,null,"wadowicki","Mucharz"]
[null,"W przypadku większej niż 10 spółek obecnych w Polsce należy odkryć ukrytą część pliku i uzupełnić dodatkowe dane",null,null,null,null,null,null,null,null,null,null,null,null,null,null,"Miasto Szczecin","Szczecin",null,null,null,null,null,null,null,"wadowicki","Spytkowice"]
[null,"Proszę zaznaczyć deklaracje w sprawie każdego z poniższych sektorów:",null,null,null,null,null,null,null,null,null,null,null,null,null,null,"Szczeciński","goleniowski",null,null,null,null,null,null,null,"wadowicki","Stryszów"]
[null,"W przypadku jednego ze wskazanych sektorów obowiązują ograniczenia dotyczące dostępności pomocy publicznej. Niezbędne dodatkowe konsultacje z zespołem PAIH",null,null,null,null,null,null,null,null,null,null,null,null,null,null,"Szczeciński","gryficki",null,null,null,null,null,null,null,"wadowicki","Tomice"]
[null,"W związku z wybranym typem inwestycji należy w załączniku 2 wskazać procesy, które będą realizowane w przedsiębiorstwie",null,null,null,null,null,null,null,null,null,null,null,null,null,null,"Szczeciński","gryfiński",null,null,null,null,null,null,null,"wadowicki","Wadowice"]
[null,null,null,null,null,null,null,null,null,null,null,null,null,null,null,null,"Szczeciński","kamieński",null,null,null,null,null,null,null,"wadowicki","Wieprz"]
[null,null,null,null,null,null,null,null,null,null,null,null,null,null,null,null,"Szczeciński","policki",null,null,null,null,null,null,null,"brzeski","Borzęcin"]
[null,null,null,null,null,null,null,null,null,null,null,null,null,null,null,null,"Szczeciński","stargardzki",null,null,null,null,null,null,null,"brzeski","Brzesko"]
[null,null,null,null,null,null,null,null,null,null,null,null,null,null,null,null,"Szczeciński","Świnoujście",null,null,null,null,null,null,null,"brzeski","Czchów"]
[null,null,null,null,null,null,null,null,null,null,null,null,null,null,null,null,"Jeleniogórski","bolesławiecki",null,null,null,null,null,null,null,"brzeski","Dębno"]
[null,null,null,null,null,null,null,null,null,null,null,null,null,null,null,null,"Jeleniogórski","jaworski",null,null,null,null,null,null,null,"brzeski","Gnojnik"]
[null,null,null,null,null,null,null,null,null,null,null,null,null,null,null,null,"Jeleniogórski","karkonoski",null,null,null,null,null,null,null,"brzeski","Iwkowa"]
[null,null,null,null,null,null,null,null,null,null,null,null,null,null,null,null,"Jeleniogórski","kamiennogórski",null,null,null,null,null,null,null,"brzeski","Szczurowa"]
[null,null,null,null,null,null,null,null,null,null,null,null,null,null,null,null,"Jeleniogórski","lubański",null,null,null,null,null,null,null,"dąbrowski","Bolesław"]
[null,null,null,null,null,null,null,null,null,null,null,null,null,null,null,null,"Jeleniogórski","lwówecki",null,null,null,null,null,null,null,"dąbrowski","Dąbrowa Tarnowska"]
[null,null,null,null,null,null,null,null,null,null,null,null,null,null,null,null,"Jeleniogórski","zgorzelecki",null,null,null,null,null,null,null,"dąbrowski","Gręboszów"]
[null,null,null,null,null,null,null,null,null,null,null,null,null,null,null,null,"Jeleniogórski","złotoryjski",null,null,null,null,null,null,null,"dąbrowski","Mędrzechów"]
[null,null,null,null,null,null,null,null,null,null,null,null,null,null,null,null,"Jeleniogórski","Jelenia Góra",null,null,null,null,null,null,null,"dąbrowski","Olesno"]
[null,null,null,null,null,null,null,null,null,null,null,null,null,null,null,null,"Legnicko-głogowski","głogowski",null,null,null,null,null,null,null,"dąbrowski","Radgoszcz"]
[null,null,null,null,null,null,null,null,null,null,null,null,null,null,null,null,"Legnicko-głogowski","górowski",null,null,null,null,null,null,null,"dąbrowski","Szczucin"]
[null,null,null,null,null,null,null,null,null,null,null,null,null,null,null,null,"Legnicko-głogowski","legnicki",null,null,null,null,null,null,null,"tarnowski","Ciężkowice"]
[null,null,null,null,null,null,null,null,null,null,null,null,null,null,null,null,"Legnicko-głogowski","lubiński",null,null,null,null,null,null,null,"tarnowski","Gromnik"]
[null,null,null,null,null,null,null,null,null,null,null,null,null,null,null,null,"Legnicko-głogowski","polkowicki",null,null,null,null,null,null,null,"tarnowski","Lisia Góra"]
[null,null,null,null,null,null,null,null,null,null,null,null,null,null,null,null,"Legnicko-głogowski","Legnica",null,null,null,null,null,null,null,"tarnowski","Pleśna"]
[null,null,null,null,null,null,null,null,null,null,null,null,null,null,null,null,"Wałbrzyski","dzierżoniowski",null,null,null,null,null,null,null,"tarnowski","Radłów"]
[null,null,null,null,null,null,null,null,null,null,null,null,null,null,null,null,"Wałbrzyski","kłodzki",null,null,null,null,null,null,null,"tarnowski","Ryglice"]
[null,null,null,null,null,null,null,null,null,null,null,null,null,null,null,null,"Wałbrzyski","świdnicki",null,null,null,null,null,null,null,"tarnowski","Rzepiennik Strzyżewski"]
[null,null,null,null,null,null,null,null,null,null,null,null,null,null,null,null,"Wałbrzyski","wałbrzyski",null,null,null,null,null,null,null,"tarnowski","Skrzyszów"]
[null,null,null,null,null,null,null,null,null,null,null,null,null,null,null,null,"Wałbrzyski","ząbkowicki",null,null,null,null,null,null,null,"tarnowski","Tarnów"]
[null,null,null,null,null,null,null,null,null,null,null,null,null,null,null,null,"Wałbrzyski","Wałbrzych",null,null,null,null,null,null,null,"tarnowski","Tuchów"]
[null,null,null,null,null,null,null,null,null,null,null,null,null,null,null,null,"Wrocławski","milicki",null,null,null,null,null,null,null,"tarnowski","Wierzchosławice"]
[null,null,null,null,null,null,null,null,null,null,null,null,null,null,null,null,"Wrocławski","oleśnicki",null,null,null,null,null,null,null,"tarnowski","Wietrzychowice"]
[null,null,null,null,null,null,null,null,null,null,null,null,null,null,null,null,"Wrocławski","oławski",null,null,null,null,null,null,null,"tarnowski","Wojnicz"]
[null,null,null,null,null,null,null,null,null,null,null,null,null,null,null,null,"Wrocławski","strzeliński",null,null,null,null,null,null,null,"tarnowski","Zakliczyn"]
[null,null,null,null,null,null,null,null,null,null,null,null,null,null,null,null,"Wrocławski","średzki",null,null,null,null,null,null,null,"tarnowski","Żabno"]
[null,null,null,null,null,null,null,null,null,null,null,null,null,null,null,null,"Wrocławski","trzebnicki",null,null,null,null,null,null,null,"tarnowski","Szerzyny"]
[null,null,null,null,null,null,null,null,null,null,null,null,null,null,null,null,"Wrocławski","wołowski",null,null,null,null,null,null,null,"Tarnów","Tarnów"]
[null,null,null,null,null,null,null,null,null,null,null,null,null,null,null,null,"Wrocławski","wrocławski",null,null,null,null,null,null,null,"nowotarski","Nowy Targ"]
[null,null,null,null,null,null,null,null,null,null,null,null,null,null,null,null,"Miasto Wrocław","Wrocław",null,null,null,null,null,null,null,"nowotarski","Szczawnica"]
[null,null,null,null,null,null,null,null,null,null,null,null,null,null,null,null,"Nyski","brzeski",null,null,null,null,null,null,null,"nowotarski","Czarny Dunajec"]
[null,null,null,null,null,null,null,null,null,null,null,null,null,null,null,null,"Nyski","głubczycki",null,null,null,null,null,null,null,"nowotarski","Czorsztyn"]
[null,null,null,null,null,null,null,null,null,null,null,null,null,null,null,null,"Nyski","namysłowski",null,null,null,null,null,null,null,"nowotarski","Jabłonka"]
[null,null,null,null,null,null,null,null,null,null,null,null,null,null,null,null,"Nyski","nyski",null,null,null,null,null,null,null,"nowotarski","Krościenko nad Dunajcem"]
[null,null,null,null,null,null,null,null,null,null,null,null,null,null,null,null,"Nyski","prudnicki",null,null,null,null,null,null,null,"nowotarski","Lipnica Wielka"]
[null,null,null,null,null,null,null,null,null,null,null,null,null,null,null,null,"Opolski","kędzierzyńsko-kozielski",null,null,null,null,null,null,null,"nowotarski","Łapsze Niżne"]
[null,null,null,null,null,null,null,null,null,null,null,null,null,null,null,null,"Opolski","kluczborski",null,null,null,null,null,null,null,"nowotarski","Nowy Targ"]
[null,null,null,null,null,null,null,null,null,null,null,null,null,null,null,null,"Opolski","krapkowicki",null,null,null,null,null,null,null,"nowotarski","Ochotnica Dolna"]
[null,null,null,null,null,null,null,null,null,null,null,null,null,null,null,null,"Opolski","oleski",null,null,null,null,null,null,null,"nowotarski","Raba Wyżna"]
[null,null,null,null,null,null,null,null,null,null,null,null,null,null,null,null,"Opolski","opolski",null,null,null,null,null,null,null,"nowotarski","Rabka-Zdrój"]
[null,null,null,null,null,null,null,null,null,null,null,null,null,null,null,null,"Opolski","strzelecki",null,null,null,null,null,null,null,"nowotarski","Spytkowice"]
[null,null,null,null,null,null,null,null,null,null,null,null,null,null,null,null,"Opolski","Opole",null,null,null,null,null,null,null,"nowotarski","Szaflary"]
[null,null,null,null,null,null,null,null,null,null,null,null,null,null,null,null,"Bydgosko-toruński","bydgoski",null,null,null,null,null,null,null,"suski","Jordanów"]
[null,null,null,null,null,null,null,null,null,null,null,null,null,null,null,null,"Bydgosko-toruński","toruński",null,null,null,null,null,null,null,"suski","Sucha Beskidzka"]
[null,null,null,null,null,null,null,null,null,null,null,null,null,null,null,null,"Bydgosko-toruński","Bydgoszcz",null,null,null,null,null,null,null,"suski","Budzów"]
[null,null,null,null,null,null,null,null,null,null,null,null,null,null,null,null,"Bydgosko-toruński","Toruń",null,null,null,null,null,null,null,"suski","Bystra-Sidzina"]
[null,null,null,null,null,null,null,null,null,null,null,null,null,null,null,null,"Grudziądzki","brodnicki",null,null,null,null,null,null,null,"suski","Jordanów"]
[null,null,null,null,null,null,null,null,null,null,null,null,null,null,null,null,"Grudziądzki","chełmiński",null,null,null,null,null,null,null,"suski","Maków Podhalański"]
[null,null,null,null,null,null,null,null,null,null,null,null,null,null,null,null,"Grudziądzki","golubsko-dobrzyński",null,null,null,null,null,null,null,"suski","Stryszawa"]
[null,null,null,null,null,null,null,null,null,null,null,null,null,null,null,null,"Grudziądzki","grudziądzki",null,null,null,null,null,null,null,"suski","Zawoja"]
[null,null,null,null,null,null,null,null,null,null,null,null,null,null,null,null,"Grudziądzki","rypiński",null,null,null,null,null,null,null,"suski","Zembrzyce"]
[null,null,null,null,null,null,null,null,null,null,null,null,null,null,null,null,"Grudziądzki","wąbrzeski",null,null,null,null,null,null,null,"tatrzański","Zakopane"]
[null,null,null,null,null,null,null,null,null,null,null,null,null,null,null,null,"Grudziądzki","Grudziądz",null,null,null,null,null,null,null,"tatrzański","Biały Dunajec"]
[null,null,null,null,null,null,null,null,null,null,null,null,null,null,null,null,"Włocławski","aleksandrowski",null,null,null,null,null,null,null,"tatrzański","Bukowina Tatrzańska"]
[null,null,null,null,null,null,null,null,null,null,null,null,null,null,null,null,"Włocławski","lipnowski",null,null,null,null,null,null,null,"tatrzański","Kościelisko"]
[null,null,null,null,null,null,null,null,null,null,null,null,null,null,null,null,"Włocławski","radziejowski",null,null,null,null,null,null,null,"tatrzański","Poronin"]
[null,null,null,null,null,null,null,null,null,null,null,null,null,null,null,null,"Włocławski","włocławski",null,null,null,null,null,null,null,"bielski","Szczyrk"]
[null,null,null,null,null,null,null,null,null,null,null,null,null,null,null,null,"Włocławski","Włocławek",null,null,null,null,null,null,null,"bielski","Bestwina"]
[null,null,null,null,null,null,null,null,null,null,null,null,null,null,null,null,"Inowrocławski","inowrocławski",null,null,null,null,null,null,null,"bielski","Buczkowice"]
[null,null,null,null,null,null,null,null,null,null,null,null,null,null,null,null,"Inowrocławski","mogileński",null,null,null,null,null,null,null,"bielski","Czechowice-Dziedzice"]
[null,null,null,null,null,null,null,null,null,null,null,null,null,null,null,null,"Inowrocławski","nakielski",null,null,null,null,null,null,null,"bielski","Jasienica"]
[null,null,null,null,null,null,null,null,null,null,null,null,null,null,null,null,"Inowrocławski","żniński",null,null,null,null,null,null,null,"bielski","Jaworze"]
[null,null,null,null,null,null,null,null,null,null,null,null,null,null,null,null,"Świecki","sępoleński",null,null,null,null,null,null,null,"bielski","Kozy"]
[null,null,null,null,null,null,null,null,null,null,null,null,null,null,null,null,"Świecki","świecki",null,null,null,null,null,null,null,"bielski","Porąbka"]
[null,null,null,null,null,null,null,null,null,null,null,null,null,null,null,null,"Świecki","tucholski",null,null,null,null,null,null,null,"bielski","Wilamowice"]
[null,null,null,null,null,null,null,null,null,null,null,null,null,null,null,null,"Gdański","gdański",null,null,null,null,null,null,null,"bielski","Wilkowice"]
[null,null,null,null,null,null,null,null,null,null,null,null,null,null,null,null,"Gdański","kartuski",null,null,null,null,null,null,null,"cieszyński","Cieszyn"]
[null,null,null,null,null,null,null,null,null,null,null,null,null,null,null,null,"Gdański","nowodworski",null,null,null,null,null,null,null,"cieszyński","Ustroń"]
[null,null,null,null,null,null,null,null,null,null,null,null,null,null,null,null,"Gdański","pucki",null,null,null,null,null,null,null,"cieszyński","Wisła"]
[null,null,null,null,null,null,null,null,null,null,null,null,null,null,null,null,"Gdański","wejherowski",null,null,null,null,null,null,null,"cieszyński","Brenna"]
[null,null,null,null,null,null,null,null,null,null,null,null,null,null,null,null,"Słupski","bytowski",null,null,null,null,null,null,null,"cieszyński","Chybie"]
[null,null,null,null,null,null,null,null,null,null,null,null,null,null,null,null,"Słupski","lęborski",null,null,null,null,null,null,null,"cieszyński","Dębowiec"]
[null,null,null,null,null,null,null,null,null,null,null,null,null,null,null,null,"Słupski","słupski",null,null,null,null,null,null,null,"cieszyński","Goleszów"]
[null,null,null,null,null,null,null,null,null,null,null,null,null,null,null,null,"Słupski","Słupsk",null,null,null,null,null,null,null,"cieszyński","Hażlach"]
[null,null,null,null,null,null,null,null,null,null,null,null,null,null,null,null,"Starogardzki","kwidzyński",null,null,null,null,null,null,null,"cieszyński","Istebna"]
[null,null,null,null,null,null,null,null,null,null,null,null,null,null,null,null,"Starogardzki","malborski",null,null,null,null,null,null,null,"cieszyński","Skoczów"]
[null,null,null,null,null,null,null,null,null,null,null,null,null,null,null,null,"Starogardzki","starogardzki",null,null,null,null,null,null,null,"cieszyński","Strumień"]
[null,null,null,null,null,null,null,null,null,null,null,null,null,null,null,null,"Starogardzki","tczewski",null,null,null,null,null,null,null,"cieszyński","Zebrzydowice"]
[null,null,null,null,null,null,null,null,null,null,null,null,null,null,null,null,"Starogardzki","sztumski",null,null,null,null,null,null,null,"żywiecki","Żywiec"]
[null,null,null,null,null,null,null,null,null,null,null,null,null,null,null,null,"Trójmiejski","Gdańsk",null,null,null,null,null,null,null,"żywiecki","Czernichów"]
[null,null,null,null,null,null,null,null,null,null,null,null,null,null,null,null,"Trójmiejski","Gdynia",null,null,null,null,null,null,null,"żywiecki","Gilowice"]
[null,null,null,null,null,null,null,null,null,null,null,null,null,null,null,null,"Trójmiejski","Sopot",null,null,null,null,null,null,null,"żywiecki","Jeleśnia"]
[null,null,null,null,null,null,null,null,null,null,null,null,null,null,null,null,"Chojnicki","chojnicki",null,null,null,null,null,null,null,"żywiecki","Koszarawa"]
[null,null,null,null,null,null,null,null,null,null,null,null,null,null,null,null,"Chojnicki","człuchowski",null,null,null,null,null,null,null,"żywiecki","Lipowa"]
[null,null,null,null,null,null,null,null,null,null,null,null,null,null,null,null,"Chojnicki","kościerski",null,null,null,null,null,null,null,"żywiecki","Łękawica"]
[null,null,null,null,null,null,null,null,null,null,null,null,null,null,null,null,"Elbląski","braniewski",null,null,null,null,null,null,null,"żywiecki","Łodygowice"]
[null,null,null,null,null,null,null,null,null,null,null,null,null,null,null,null,"Elbląski","działdowski",null,null,null,null,null,null,null,"żywiecki","Milówka"]
[null,null,null,null,null,null,null,null,null,null,null,null,null,null,null,null,"Elbląski","elbląski",null,null,null,null,null,null,null,"żywiecki","Radziechowy-Wieprz"]
[null,null,null,null,null,null,null,null,null,null,null,null,null,null,null,null,"Elbląski","iławski",null,null,null,null,null,null,null,"żywiecki","Rajcza"]
[null,null,null,null,null,null,null,null,null,null,null,null,null,null,null,null,"Elbląski","nowomiejski",null,null,null,null,null,null,null,"żywiecki","Ślemień"]
[null,null,null,null,null,null,null,null,null,null,null,null,null,null,null,null,"Elbląski","ostródzki",null,null,null,null,null,null,null,"żywiecki","Świnna"]
[null,null,null,null,null,null,null,null,null,null,null,null,null,null,null,null,"Elbląski","Elbląg",null,null,null,null,null,null,null,"żywiecki","Ujsoły"]
[null,null,null,null,null,null,null,null,null,null,null,null,null,null,null,null,"Ełcki","ełcki",null,null,null,null,null,null,null,"żywiecki","Węgierska Górka"]
[null,null,null,null,null,null,null,null,null,null,null,null,null,null,null,null,"Ełcki","giżycki",null,null,null,null,null,null,null,"Bielsko-Biała","Bielsko-Biała"]
[null,null,null,null,null,null,null,null,null,null,null,null,null,null,null,null,"Ełcki","olecki",null,null,null,null,null,null,null,"lubliniecki","Lubliniec"]
[null,null,null,null,null,null,null,null,null,null,null,null,null,null,null,null,"Ełcki","piski",null,null,null,null,null,null,null,"lubliniecki","Boronów"]
[null,null,null,null,null,null,null,null,null,null,null,null,null,null,null,null,"Ełcki","gołdapski",null,null,null,null,null,null,null,"lubliniecki","Ciasna"]
[null,null,null,null,null,null,null,null,null,null,null,null,null,null,null,null,"Ełcki","węgorzewski",null,null,null,null,null,null,null,"lubliniecki","Herby"]
[null,null,null,null,null,null,null,null,null,null,null,null,null,null,null,null,"Olsztyński","bartoszycki",null,null,null,null,null,null,null,"lubliniecki","Kochanowice"]
[null,null,null,null,null,null,null,null,null,null,null,null,null,null,null,null,"Olsztyński","kętrzyński",null,null,null,null,null,null,null,"lubliniecki","Koszęcin"]
[null,null,null,null,null,null,null,null,null,null,null,null,null,null,null,null,"Olsztyński","lidzbarski",null,null,null,null,null,null,null,"lubliniecki","Pawonków"]
[null,null,null,null,null,null,null,null,null,null,null,null,null,null,null,null,"Olsztyński","mrągowski",null,null,null,null,null,null,null,"lubliniecki","Woźniki"]
[null,null,null,null,null,null,null,null,null,null,null,null,null,null,null,null,"Olsztyński","nidzicki",null,null,null,null,null,null,null,"tarnogórski","Kalety"]
[null,null,null,null,null,null,null,null,null,null,null,null,null,null,null,null,"Olsztyński","olsztyński",null,null,null,null,null,null,null,"tarnogórski","Miasteczko Śląskie"]
[null,null,null,null,null,null,null,null,null,null,null,null,null,null,null,null,"Olsztyński","szczycieński",null,null,null,null,null,null,null,"tarnogórski","Radzionków"]
[null,null,null,null,null,null,null,null,null,null,null,null,null,null,null,null,"Olsztyński","Olsztyn",null,null,null,null,null,null,null,"tarnogórski","Tarnowskie Góry"]
[null,null,null,null,null,null,null,null,null,null,null,null,null,null,null,null,"Łódzki","łódzki wschodni",null,null,null,null,null,null,null,"tarnogórski","Krupski Młyn"]
[null,null,null,null,null,null,null,null,null,null,null,null,null,null,null,null,"Łódzki","pabianicki",null,null,null,null,null,null,null,"tarnogórski","Ożarowice"]
[null,null,null,null,null,null,null,null,null,null,null,null,null,null,null,null,"Łódzki","zgierski",null,null,null,null,null,null,null,"tarnogórski","Świerklaniec"]
[null,null,null,null,null,null,null,null,null,null,null,null,null,null,null,null,"Łódzki","brzeziński",null,null,null,null,null,null,null,"tarnogórski","Tworóg"]
[null,null,null,null,null,null,null,null,null,null,null,null,null,null,null,null,"M. Łódź","Łódź",null,null,null,null,null,null,null,"tarnogórski","Zbrosławice"]
[null,null,null,null,null,null,null,null,null,null,null,null,null,null,null,null,"Piotrkowski","bełchatowski",null,null,null,null,null,null,null,"Bytom","Bytom"]
[null,null,null,null,null,null,null,null,null,null,null,null,null,null,null,null,"Piotrkowski","opoczyński",null,null,null,null,null,null,null,"Piekary Śląskie","Piekary Śląskie"]
[null,null,null,null,null,null,null,null,null,null,null,null,null,null,null,null,"Piotrkowski","piotrkowski",null,null,null,null,null,null,null,"częstochowski","Blachownia"]
[null,null,null,null,null,null,null,null,null,null,null,null,null,null,null,null,"Piotrkowski","radomszczański",null,null,null,null,null,null,null,"częstochowski","Dąbrowa Zielona"]
[null,null,null,null,null,null,null,null,null,null,null,null,null,null,null,null,"Piotrkowski","tomaszowski",null,null,null,null,null,null,null,"częstochowski","Janów"]
[null,null,null,null,null,null,null,null,null,null,null,null,null,null,null,null,"Piotrkowski","Piotrków Trybunalski",null,null,null,null,null,null,null,"częstochowski","Kamienica Polska"]
[null,null,null,null,null,null,null,null,null,null,null,null,null,null,null,null,"Sieradzki","łaski",null,null,null,null,null,null,null,"częstochowski","Kłomnice"]
[null,null,null,null,null,null,null,null,null,null,null,null,null,null,null,null,"Sieradzki","pajęczański",null,null,null,null,null,null,null,"częstochowski","Koniecpol"]
[null,null,null,null,null,null,null,null,null,null,null,null,null,null,null,null,"Sieradzki","poddębicki",null,null,null,null,null,null,null,"częstochowski","Konopiska"]
[null,null,null,null,null,null,null,null,null,null,null,null,null,null,null,null,"Sieradzki","sieradzki",null,null,null,null,null,null,null,"częstochowski","Kruszyna"]
[null,null,null,null,null,null,null,null,null,null,null,null,null,null,null,null,"Sieradzki","wieluński",null,null,null,null,null,null,null,"częstochowski","Lelów"]
[null,null,null,null,null,null,null,null,null,null,null,null,null,null,null,null,"Sieradzki","wieruszowski",null,null,null,null,null,null,null,"częstochowski","Mstów"]
[null,null,null,null,null,null,null,null,null,null,null,null,null,null,null,null,"Sieradzki","zduńskowolski",null,null,null,null,null,null,null,"częstochowski","Mykanów"]
[null,null,null,null,null,null,null,null,null,null,null,null,null,null,null,null,"Skierniewicki","kutnowski",null,null,null,null,null,null,null,"częstochowski","Olsztyn"]
[null,null,null,null,null,null,null,null,null,null,null,null,null,null,null,null,"Skierniewicki","łęczycki",null,null,null,null,null,null,null,"częstochowski","Poczesna"]
[null,null,null,null,null,null,null,null,null,null,null,null,null,null,null,null,"Skierniewicki","łowicki",null,null,null,null,null,null,null,"częstochowski","Przyrów"]
[null,null,null,null,null,null,null,null,null,null,null,null,null,null,null,null,"Skierniewicki","rawski",null,null,null,null,null,null,null,"częstochowski","Rędziny"]
[null,null,null,null,null,null,null,null,null,null,null,null,null,null,null,null,"Skierniewicki","skierniewicki",null,null,null,null,null,null,null,"częstochowski","Starcza"]
[null,null,null,null,null,null,null,null,null,null,null,null,null,null,null,null,"Skierniewicki","Skierniewice",null,null,null,null,null,null,null,"kłobucki","Kłobuck"]
[null,null,null,null,null,null,null,null,null,null,null,null,null,null,null,null,"Kielecki","kielecki",null,null,null,null,null,null,null,"kłobucki","Krzepice"]
[null,null,null,null,null,null,null,null,null,null,null,null,null,null,null,null,"Kielecki","konecki",null,null,null,null,null,null,null,"kłobucki","Lipie"]
[null,null,null,null,null,null,null,null,null,null,null,null,null,null,null,null,"Kielecki","ostrowiecki",null,null,null,null,null,null,null,"kłobucki","Miedźno"]
[null,null,null,null,null,null,null,null,null,null,null,null,null,null,null,null,"Kielecki","skarżyski",null,null,null,null,null,null,null,"kłobucki","Opatów"]
[null,null,null,null,null,null,null,null,null,null,null,null,null,null,null,null,"Kielecki","starachowicki",null,null,null,null,null,null,null,"kłobucki","Panki"]
[null,null,null,null,null,null,null,null,null,null,null,null,null,null,null,null,"Kielecki","Kielce",null,null,null,null,null,null,null,"kłobucki","Popów"]
[null,null,null,null,null,null,null,null,null,null,null,null,null,null,null,null,"Sandomiersko-jędrzejowski","buski",null,null,null,null,null,null,null,"kłobucki","Przystajń"]
[null,null,null,null,null,null,null,null,null,null,null,null,null,null,null,null,"Sandomiersko-jędrzejowski","jędrzejowski",null,null,null,null,null,null,null,"kłobucki","Wręczyca Wielka"]
[null,null,null,null,null,null,null,null,null,null,null,null,null,null,null,null,"Sandomiersko-jędrzejowski","kazimierski",null,null,null,null,null,null,null,"myszkowski","Myszków"]
[null,null,null,null,null,null,null,null,null,null,null,null,null,null,null,null,"Sandomiersko-jędrzejowski","opatowski",null,null,null,null,null,null,null,"myszkowski","Koziegłowy"]
[null,null,null,null,null,null,null,null,null,null,null,null,null,null,null,null,"Sandomiersko-jędrzejowski","pińczowski",null,null,null,null,null,null,null,"myszkowski","Niegowa"]
[null,null,null,null,null,null,null,null,null,null,null,null,null,null,null,null,"Sandomiersko-jędrzejowski","sandomierski",null,null,null,null,null,null,null,"myszkowski","Poraj"]
[null,null,null,null,null,null,null,null,null,null,null,null,null,null,null,null,"Sandomiersko-jędrzejowski","staszowski",null,null,null,null,null,null,null,"myszkowski","Żarki"]
[null,null,null,null,null,null,null,null,null,null,null,null,null,null,null,null,"Sandomiersko-jędrzejowski","włoszczowski",null,null,null,null,null,null,null,"Częstochowa","Częstochowa"]
[null,null,null,null,null,null,null,null,null,null,null,null,null,null,null,null,"Bialski","bialski",null,null,null,null,null,null,null,"gliwicki","Knurów"]
[null,null,null,null,null,null,null,null,null,null,null,null,null,null,null,null,"Bialski","parczewski",null,null,null,null,null,null,null,"gliwicki","Pyskowice"]
[null,null,null,null,null,null,null,null,null,null,null,null,null,null,null,null,"Bialski","radzyński",null,null,null,null,null,null,null,"gliwicki","Gierałtowice"]
[null,null,null,null,null,null,null,null,null,null,null,null,null,null,null,null,"Bialski","włodawski",null,null,null,null,null,null,null,"gliwicki","Pilchowice"]
[null,null,null,null,null,null,null,null,null,null,null,null,null,null,null,null,"Bialski","Biała Podlaska",null,null,null,null,null,null,null,"gliwicki","Rudziniec"]
[null,null,null,null,null,null,null,null,null,null,null,null,null,null,null,null,"Chełmsko-zamojski","biłgorajski",null,null,null,null,null,null,null,"gliwicki","Sośnicowice"]
[null,null,null,null,null,null,null,null,null,null,null,null,null,null,null,null,"Chełmsko-zamojski","chełmski",null,null,null,null,null,null,null,"gliwicki","Toszek"]
[null,null,null,null,null,null,null,null,null,null,null,null,null,null,null,null,"Chełmsko-zamojski","hrubieszowski",null,null,null,null,null,null,null,"gliwicki","Wielowieś"]
[null,null,null,null,null,null,null,null,null,null,null,null,null,null,null,null,"Chełmsko-zamojski","krasnostawski",null,null,null,null,null,null,null,"Gliwice","Gliwice"]
[null,null,null,null,null,null,null,null,null,null,null,null,null,null,null,null,"Chełmsko-zamojski","tomaszowski",null,null,null,null,null,null,null,"Zabrze","Zabrze"]
[null,null,null,null,null,null,null,null,null,null,null,null,null,null,null,null,"Chełmsko-zamojski","zamojski",null,null,null,null,null,null,null,"Chorzów","Chorzów"]
[null,null,null,null,null,null,null,null,null,null,null,null,null,null,null,null,"Chełmsko-zamojski","Chełm",null,null,null,null,null,null,null,"Katowice","Katowice"]
[null,null,null,null,null,null,null,null,null,null,null,null,null,null,null,null,"Chełmsko-zamojski","Zamość",null,null,null,null,null,null,null,"Mysłowice","Mysłowice"]
[null,null,null,null,null,null,null,null,null,null,null,null,null,null,null,null,"Lubelski","lubartowski",null,null,null,null,null,null,null,"Ruda Śląska","Ruda Śląska"]
[null,null,null,null,null,null,null,null,null,null,null,null,null,null,null,null,"Lubelski","lubelski",null,null,null,null,null,null,null,"Siemianowice Śląskie","Siemianowice Śląskie"]
[null,null,null,null,null,null,null,null,null,null,null,null,null,null,null,null,"Lubelski","łęczyński",null,null,null,null,null,null,null,"Świętochłowice","Świętochłowice"]
[null,null,null,null,null,null,null,null,null,null,null,null,null,null,null,null,"Lubelski","świdnicki",null,null,null,null,null,null,null,"raciborski","Racibórz"]
[null,null,null,null,null,null,null,null,null,null,null,null,null,null,null,null,"Lubelski","Lublin",null,null,null,null,null,null,null,"raciborski","Kornowac"]
[null,null,null,null,null,null,null,null,null,null,null,null,null,null,null,null,"Puławski","janowski",null,null,null,null,null,null,null,"raciborski","Krzanowice"]
[null,null,null,null,null,null,null,null,null,null,null,null,null,null,null,null,"Puławski","kraśnicki",null,null,null,null,null,null,null,"raciborski","Krzyżanowice"]
[null,null,null,null,null,null,null,null,null,null,null,null,null,null,null,null,"Puławski","łukowski",null,null,null,null,null,null,null,"raciborski","Kuźnia Raciborska"]
[null,null,null,null,null,null,null,null,null,null,null,null,null,null,null,null,"Puławski","opolski",null,null,null,null,null,null,null,"raciborski","Nędza"]
[null,null,null,null,null,null,null,null,null,null,null,null,null,null,null,null,"Puławski","puławski",null,null,null,null,null,null,null,"raciborski","Pietrowice Wielkie"]
[null,null,null,null,null,null,null,null,null,null,null,null,null,null,null,null,"Puławski","rycki",null,null,null,null,null,null,null,"raciborski","Rudnik"]
[null,null,null,null,null,null,null,null,null,null,null,null,null,null,null,null,"Krośnieński","bieszczadzki",null,null,null,null,null,null,null,"rybnicki","Czerwionka-Leszczyny"]
[null,null,null,null,null,null,null,null,null,null,null,null,null,null,null,null,"Krośnieński","brzozowski",null,null,null,null,null,null,null,"rybnicki","Gaszowice"]
[null,null,null,null,null,null,null,null,null,null,null,null,null,null,null,null,"Krośnieński","jasielski",null,null,null,null,null,null,null,"rybnicki","Jejkowice"]
[null,null,null,null,null,null,null,null,null,null,null,null,null,null,null,null,"Krośnieński","krośnieński",null,null,null,null,null,null,null,"rybnicki","Lyski"]
[null,null,null,null,null,null,null,null,null,null,null,null,null,null,null,null,"Krośnieński","sanocki",null,null,null,null,null,null,null,"rybnicki","Świerklany"]
[null,null,null,null,null,null,null,null,null,null,null,null,null,null,null,null,"Krośnieński","leski",null,null,null,null,null,null,null,"wodzisławski","Pszów"]
[null,null,null,null,null,null,null,null,null,null,null,null,null,null,null,null,"Krośnieński","Krosno",null,null,null,null,null,null,null,"wodzisławski","Radlin"]
[null,null,null,null,null,null,null,null,null,null,null,null,null,null,null,null,"Przemyski","jarosławski",null,null,null,null,null,null,null,"wodzisławski","Rydułtowy"]
[null,null,null,null,null,null,null,null,null,null,null,null,null,null,null,null,"Przemyski","lubaczowski",null,null,null,null,null,null,null,"wodzisławski","Wodzisław Śląski"]
[null,null,null,null,null,null,null,null,null,null,null,null,null,null,null,null,"Przemyski","przemyski",null,null,null,null,null,null,null,"wodzisławski","Godów"]
[null,null,null,null,null,null,null,null,null,null,null,null,null,null,null,null,"Przemyski","przeworski",null,null,null,null,null,null,null,"wodzisławski","Gorzyce"]
[null,null,null,null,null,null,null,null,null,null,null,null,null,null,null,null,"Przemyski","Przemyśl",null,null,null,null,null,null,null,"wodzisławski","Lubomia"]
[null,null,null,null,null,null,null,null,null,null,null,null,null,null,null,null,"Rzeszowski","kolbuszowski",null,null,null,null,null,null,null,"wodzisławski","Marklowice"]
[null,null,null,null,null,null,null,null,null,null,null,null,null,null,null,null,"Rzeszowski","łańcucki",null,null,null,null,null,null,null,"wodzisławski","Mszana"]
[null,null,null,null,null,null,null,null,null,null,null,null,null,null,null,null,"Rzeszowski","ropczycko-sędziszowski",null,null,null,null,null,null,null,"Jastrzębie-Zdrój","Jastrzębie-Zdrój"]
[null,null,null,null,null,null,null,null,null,null,null,null,null,null,null,null,"Rzeszowski","rzeszowski",null,null,null,null,null,null,null,"Rybnik","Rybnik"]
[null,null,null,null,null,null,null,null,null,null,null,null,null,null,null,null,"Rzeszowski","strzyżowski",null,null,null,null,null,null,null,"Żory","Żory"]
[null,null,null,null,null,null,null,null,null,null,null,null,null,null,null,null,"Rzeszowski","Rzeszów",null,null,null,null,null,null,null,"będziński","Będzin"]
[null,null,null,null,null,null,null,null,null,null,null,null,null,null,null,null,"Tarnobrzeski","dębicki",null,null,null,null,null,null,null,"będziński","Czeladź"]
[null,null,null,null,null,null,null,null,null,null,null,null,null,null,null,null,"Tarnobrzeski","leżajski",null,null,null,null,null,null,null,"będziński","Wojkowice"]
[null,null,null,null,null,null,null,null,null,null,null,null,null,null,null,null,"Tarnobrzeski","mielecki",null,null,null,null,null,null,null,"będziński","Bobrowniki"]
[null,null,null,null,null,null,null,null,null,null,null,null,null,null,null,null,"Tarnobrzeski","niżański",null,null,null,null,null,null,null,"będziński","Mierzęcice"]
[null,null,null,null,null,null,null,null,null,null,null,null,null,null,null,null,"Tarnobrzeski","stalowowolski",null,null,null,null,null,null,null,"będziński","Psary"]
[null,null,null,null,null,null,null,null,null,null,null,null,null,null,null,null,"Tarnobrzeski","tarnobrzeski",null,null,null,null,null,null,null,"będziński","Siewierz"]
[null,null,null,null,null,null,null,null,null,null,null,null,null,null,null,null,"Tarnobrzeski","Tarnobrzeg",null,null,null,null,null,null,null,"będziński","Sławków"]
[null,null,null,null,null,null,null,null,null,null,null,null,null,null,null,null,"Białostocki","białostocki",null,null,null,null,null,null,null,"zawierciański","Poręba"]
[null,null,null,null,null,null,null,null,null,null,null,null,null,null,null,null,"Białostocki","sokólski",null,null,null,null,null,null,null,"zawierciański","Zawiercie"]
[null,null,null,null,null,null,null,null,null,null,null,null,null,null,null,null,"Białostocki","Białystok",null,null,null,null,null,null,null,"zawierciański","Irządze"]
[null,null,null,null,null,null,null,null,null,null,null,null,null,null,null,null,"Łomżyński","bielski",null,null,null,null,null,null,null,"zawierciański","Kroczyce"]
[null,null,null,null,null,null,null,null,null,null,null,null,null,null,null,null,"Łomżyński","hajnowski",null,null,null,null,null,null,null,"zawierciański","Łazy"]
[null,null,null,null,null,null,null,null,null,null,null,null,null,null,null,null,"Łomżyński","kolneński",null,null,null,null,null,null,null,"zawierciański","Ogrodzieniec"]
[null,null,null,null,null,null,null,null,null,null,null,null,null,null,null,null,"Łomżyński","łomżyński",null,null,null,null,null,null,null,"zawierciański","Pilica"]
[null,null,null,null,null,null,null,null,null,null,null,null,null,null,null,null,"Łomżyński","siemiatycki",null,null,null,null,null,null,null,"zawierciański","Szczekociny"]
[null,null,null,null,null,null,null,null,null,null,null,null,null,null,null,null,"Łomżyński","wysokomazowiecki",null,null,null,null,null,null,null,"zawierciański","Włodowice"]
[null,null,null,null,null,null,null,null,null,null,null,null,null,null,null,null,"Łomżyński","zambrowski",null,null,null,null,null,null,null,"zawierciański","Żarnowiec"]
[null,null,null,null,null,null,null,null,null,null,null,null,null,null,null,null,"Łomżyński","Łomża",null,null,null,null,null,null,null,"Dąbrowa Górnicza","Dąbrowa Górnicza"]
[null,null,null,null,null,null,null,null,null,null,null,null,null,null,null,null,"Suwalski","augustowski",null,null,null,null,null,null,null,"Jaworzno","Jaworzno"]
[null,null,null,null,null,null,null,null,null,null,null,null,null,null,null,null,"Suwalski","grajewski",null,null,null,null,null,null,null,"Sosnowiec","Sosnowiec"]
[null,null,null,null,null,null,null,null,null,null,null,null,null,null,null,null,"Suwalski","moniecki",null,null,null,null,null,null,null,"mikołowski","Łaziska Górne"]
[null,null,null,null,null,null,null,null,null,null,null,null,null,null,null,null,"Suwalski","sejneński",null,null,null,null,null,null,null,"mikołowski","Mikołów"]
[null,null,null,null,null,null,null,null,null,null,null,null,null,null,null,null,"Suwalski","suwalski",null,null,null,null,null,null,null,"mikołowski","Orzesze"]
[null,null,null,null,null,null,null,null,null,null,null,null,null,null,null,null,"Suwalski","Suwałki",null,null,null,null,null,null,null,"mikołowski","Ornontowice"]
[null,null,null,null,null,null,null,null,null,null,null,null,null,null,null,null,"Miasto Warszawa","Warszawa",null,null,null,null,null,null,null,"mikołowski","Wyry"]
[null,null,null,null,null,null,null,null,null,null,null,null,null,null,null,null,"Warszawski wschodni","legionowski",null,null,null,null,null,null,null,"pszczyński","Goczałkowice-Zdrój"]
[null,null,null,null,null,null,null,null,null,null,null,null,null,null,null,null,"Warszawski wschodni","miński",null,null,null,null,null,null,null,"pszczyński","Kobiór"]
[null,null,null,null,null,null,null,null,null,null,null,null,null,null,null,null,"Warszawski wschodni","otwocki",null,null,null,null,null,null,null,"pszczyński","Miedźna"]
[null,null,null,null,null,null,null,null,null,null,null,null,null,null,null,null,"Warszawski wschodni","wołomiński",null,null,null,null,null,null,null,"pszczyński","Pawłowice"]
[null,null,null,null,null,null,null,null,null,null,null,null,null,null,null,null,"Warszawski zachodni","grodziski",null,null,null,null,null,null,null,"pszczyński","Pszczyna"]
[null,null,null,null,null,null,null,null,null,null,null,null,null,null,null,null,"Warszawski zachodni","nowodworski",null,null,null,null,null,null,null,"pszczyński","Suszec"]
[null,null,null,null,null,null,null,null,null,null,null,null,null,null,null,null,"Warszawski zachodni","piaseczyński",null,null,null,null,null,null,null,"bieruńsko-lędziński","Bieruń"]
[null,null,null,null,null,null,null,null,null,null,null,null,null,null,null,null,"Warszawski zachodni","pruszkowski",null,null,null,null,null,null,null,"bieruńsko-lędziński","Imielin"]
[null,null,null,null,null,null,null,null,null,null,null,null,null,null,null,null,"Warszawski zachodni","warszawski zachodni",null,null,null,null,null,null,null,"bieruńsko-lędziński","Lędziny"]
[null,null,null,null,null,null,null,null,null,null,null,null,null,null,null,null,"Ciechanowski","ciechanowski",null,null,null,null,null,null,null,"bieruńsko-lędziński","Bojszowy"]
[null,null,null,null,null,null,null,null,null,null,null,null,null,null,null,null,"Ciechanowski","mławski",null,null,null,null,null,null,null,"bieruńsko-lędziński","Chełm Śląski"]
[null,null,null,null,null,null,null,null,null,null,null,null,null,null,null,null,"Ciechanowski","płoński",null,null,null,null,null,null,null,"Tychy","Tychy"]
[null,null,null,null,null,null,null,null,null,null,null,null,null,null,null,null,"Ciechanowski","pułtuski",null,null,null,null,null,null,null,"gorzowski","Kostrzyn nad Odrą"]
[null,null,null,null,null,null,null,null,null,null,null,null,null,null,null,null,"Ciechanowski","żuromiński",null,null,null,null,null,null,null,"gorzowski","Bogdaniec"]
[null,null,null,null,null,null,null,null,null,null,null,null,null,null,null,null,"Ostrołęcki","makowski",null,null,null,null,null,null,null,"gorzowski","Deszczno"]
[null,null,null,null,null,null,null,null,null,null,null,null,null,null,null,null,"Ostrołęcki","ostrołęcki",null,null,null,null,null,null,null,"gorzowski","Kłodawa"]
[null,null,null,null,null,null,null,null,null,null,null,null,null,null,null,null,"Ostrołęcki","ostrowski",null,null,null,null,null,null,null,"gorzowski","Lubiszyn"]
[null,null,null,null,null,null,null,null,null,null,null,null,null,null,null,null,"Ostrołęcki","przasnyski",null,null,null,null,null,null,null,"gorzowski","Santok"]
[null,null,null,null,null,null,null,null,null,null,null,null,null,null,null,null,"Ostrołęcki","wyszkowski",null,null,null,null,null,null,null,"gorzowski","Witnica"]
[null,null,null,null,null,null,null,null,null,null,null,null,null,null,null,null,"Ostrołęcki","Ostrołęka",null,null,null,null,null,null,null,"międzyrzecki","Bledzew"]
[null,null,null,null,null,null,null,null,null,null,null,null,null,null,null,null,"Radomski","białobrzeski",null,null,null,null,null,null,null,"międzyrzecki","Międzyrzecz"]
[null,null,null,null,null,null,null,null,null,null,null,null,null,null,null,null,"Radomski","kozienicki",null,null,null,null,null,null,null,"międzyrzecki","Przytoczna"]
[null,null,null,null,null,null,null,null,null,null,null,null,null,null,null,null,"Radomski","lipski",null,null,null,null,null,null,null,"międzyrzecki","Pszczew"]
[null,null,null,null,null,null,null,null,null,null,null,null,null,null,null,null,"Radomski","przysuski",null,null,null,null,null,null,null,"międzyrzecki","Skwierzyna"]
[null,null,null,null,null,null,null,null,null,null,null,null,null,null,null,null,"Radomski","radomski",null,null,null,null,null,null,null,"międzyrzecki","Trzciel"]
[null,null,null,null,null,null,null,null,null,null,null,null,null,null,null,null,"Radomski","szydłowiecki",null,null,null,null,null,null,null,"słubicki","Cybinka"]
[null,null,null,null,null,null,null,null,null,null,null,null,null,null,null,null,"Radomski","zwoleński",null,null,null,null,null,null,null,"słubicki","Górzyca"]
[null,null,null,null,null,null,null,null,null,null,null,null,null,null,null,null,"Radomski","Radom",null,null,null,null,null,null,null,"słubicki","Ośno Lubuskie"]
[null,null,null,null,null,null,null,null,null,null,null,null,null,null,null,null,"Płocki","gostyniński",null,null,null,null,null,null,null,"słubicki","Rzepin"]
[null,null,null,null,null,null,null,null,null,null,null,null,null,null,null,null,"Płocki","płocki",null,null,null,null,null,null,null,"słubicki","Słubice"]
[null,null,null,null,null,null,null,null,null,null,null,null,null,null,null,null,"Płocki","sierpecki",null,null,null,null,null,null,null,"strzelecko-drezdenecki","Dobiegniew"]
[null,null,null,null,null,null,null,null,null,null,null,null,null,null,null,null,"Płocki","Płock",null,null,null,null,null,null,null,"strzelecko-drezdenecki","Drezdenko"]
[null,null,null,null,null,null,null,null,null,null,null,null,null,null,null,null,"Siedlecki","garwoliński",null,null,null,null,null,null,null,"strzelecko-drezdenecki","Stare Kurowo"]
[null,null,null,null,null,null,null,null,null,null,null,null,null,null,null,null,"Siedlecki","łosicki",null,null,null,null,null,null,null,"strzelecko-drezdenecki","Strzelce Krajeńskie"]
[null,null,null,null,null,null,null,null,null,null,null,null,null,null,null,null,"Siedlecki","siedlecki",null,null,null,null,null,null,null,"strzelecko-drezdenecki","Zwierzyn"]
[null,null,null,null,null,null,null,null,null,null,null,null,null,null,null,null,"Siedlecki","sokołowski",null,null,null,null,null,null,null,"sulęciński","Krzeszyce"]
[null,null,null,null,null,null,null,null,null,null,null,null,null,null,null,null,"Siedlecki","węgrowski",null,null,null,null,null,null,null,"sulęciński","Lubniewice"]
[null,null,null,null,null,null,null,null,null,null,null,null,null,null,null,null,"Siedlecki","Siedlce",null,null,null,null,null,null,null,"sulęciński","Słońsk"]
[null,null,null,null,null,null,null,null,null,null,null,null,null,null,null,null,"Żyrardowski","grójecki",null,null,null,null,null,null,null,"sulęciński","Sulęcin"]
[null,null,null,null,null,null,null,null,null,null,null,null,null,null,null,null,"Żyrardowski","sochaczewski",null,null,null,null,null,null,null,"sulęciński","Torzym"]
[null,null,null,null,null,null,null,null,null,null,null,null,null,null,null,null,"Żyrardowski","żyrardowski",null,null,null,null,null,null,null,"Gorzów Wielkopolski","Gorzów Wielkopolski"]
[null,null,null,null,null,null,null,null,null,null,null,null,null,null,null,null,null,null,null,null,null,null,null,null,null,"krośnieński","Gubin"]
[null,null,null,null,null,null,null,null,null,null,null,null,null,null,null,null,null,null,null,null,null,null,null,null,null,"krośnieński","Bobrowice"]
[null,null,null,null,null,null,null,null,null,null,null,null,null,null,null,null,null,null,null,null,null,null,null,null,null,"krośnieński","Bytnica"]
[null,null,null,null,null,null,null,null,null,null,null,null,null,null,null,null,null,null,null,null,null,null,null,null,null,"krośnieński","Dąbie"]
[null,null,null,null,null,null,null,null,null,null,null,null,null,null,null,null,null,null,null,null,null,null,null,null,null,"krośnieński","Krosno Odrzańskie"]
[null,null,null,null,null,null,null,null,null,null,null,null,null,null,null,null,null,null,null,null,null,null,null,null,null,"krośnieński","Maszewo"]
[null,null,null,null,null,null,null,null,null,null,null,null,null,null,null,null,null,null,null,null,null,null,null,null,null,"nowosolski","Nowa Sól"]
[null,null,null,null,null,null,null,null,null,null,null,null,null,null,null,null,null,null,null,null,null,null,null,null,null,"nowosolski","Bytom Odrzański"]
[null,null,null,null,null,null,null,null,null,null,null,null,null,null,null,null,null,null,null,null,null,null,null,null,null,"nowosolski","Kolsko"]
[null,null,null,null,null,null,null,null,null,null,null,null,null,null,null,null,null,null,null,null,null,null,null,null,null,"nowosolski","Kożuchów"]
[null,null,null,null,null,null,null,null,null,null,null,null,null,null,null,null,null,null,null,null,null,null,null,null,null,"nowosolski","Nowa Sól"]
[null,null,null,null,null,null,null,null,null,null,null,null,null,null,null,null,null,null,null,null,null,null,null,null,null,"nowosolski","Nowe Miasteczko"]
[null,null,null,null,null,null,null,null,null,null,null,null,null,null,null,null,null,null,null,null,null,null,null,null,null,"nowosolski","Otyń"]
[null,null,null,null,null,null,null,null,null,null,null,null,null,null,null,null,null,null,null,null,null,null,null,null,null,"nowosolski","Siedlisko"]
[null,null,null,null,null,null,null,null,null,null,null,null,null,null,null,null,null,null,null,null,null,null,null,null,null,"świebodziński","Lubrza"]
[null,null,null,null,null,null,null,null,null,null,null,null,null,null,null,null,null,null,null,null,null,null,null,null,null,"świebodziński","Łagów"]
[null,null,null,null,null,null,null,null,null,null,null,null,null,null,null,null,null,null,null,null,null,null,null,null,null,"świebodziński","Skąpe"]
[null,null,null,null,null,null,null,null,null,null,null,null,null,null,null,null,null,null,null,null,null,null,null,null,null,"świebodziński","Szczaniec"]
[null,null,null,null,null,null,null,null,null,null,null,null,null,null,null,null,null,null,null,null,null,null,null,null,null,"świebodziński","Świebodzin"]
[null,null,null,null,null,null,null,null,null,null,null,null,null,null,null,null,null,null,null,null,null,null,null,null,null,"świebodziński","Zbąszynek"]
[null,null,null,null,null,null,null,null,null,null,null,null,null,null,null,null,null,null,null,null,null,null,null,null,null,"zielonogórski","Babimost"]
[null,null,null,null,null,null,null,null,null,null,null,null,null,null,null,null,null,null,null,null,null,null,null,null,null,"zielonogórski","Bojadła"]
[null,null,null,null,null,null,null,null,null,null,null,null,null,null,null,null,null,null,null,null,null,null,null,null,null,"zielonogórski","Czerwieńsk"]
[null,null,null,null,null,null,null,null,null,null,null,null,null,null,null,null,null,null,null,null,null,null,null,null,null,"zielonogórski","Kargowa"]
[null,null,null,null,null,null,null,null,null,null,null,null,null,null,null,null,null,null,null,null,null,null,null,null,null,"zielonogórski","Nowogród Bobrzański"]
[null,null,null,null,null,null,null,null,null,null,null,null,null,null,null,null,null,null,null,null,null,null,null,null,null,"zielonogórski","Sulechów"]
[null,null,null,null,null,null,null,null,null,null,null,null,null,null,null,null,null,null,null,null,null,null,null,null,null,"zielonogórski","Świdnica"]
[null,null,null,null,null,null,null,null,null,null,null,null,null,null,null,null,null,null,null,null,null,null,null,null,null,"zielonogórski","Trzebiechów"]
[null,null,null,null,null,null,null,null,null,null,null,null,null,null,null,null,null,null,null,null,null,null,null,null,null,"zielonogórski","Zabór"]
[null,null,null,null,null,null,null,null,null,null,null,null,null,null,null,null,null,null,null,null,null,null,null,null,null,"żagański","Gozdnica"]
[null,null,null,null,null,null,null,null,null,null,null,null,null,null,null,null,null,null,null,null,null,null,null,null,null,"żagański","Żagań"]
[null,null,null,null,null,null,null,null,null,null,null,null,null,null,null,null,null,null,null,null,null,null,null,null,null,"żagański","Brzeźnica"]
[null,null,null,null,null,null,null,null,null,null,null,null,null,null,null,null,null,null,null,null,null,null,null,null,null,"żagański","Iłowa"]
[null,null,null,null,null,null,null,null,null,null,null,null,null,null,null,null,null,null,null,null,null,null,null,null,null,"żagański","Małomice"]
[null,null,null,null,null,null,null,null,null,null,null,null,null,null,null,null,null,null,null,null,null,null,null,null,null,"żagański","Niegosławice"]
[null,null,null,null,null,null,null,null,null,null,null,null,null,null,null,null,null,null,null,null,null,null,null,null,null,"żagański","Szprotawa"]
[null,null,null,null,null,null,null,null,null,null,null,null,null,null,null,null,null,null,null,null,null,null,null,null,null,"żagański","Wymiarki"]
[null,null,null,null,null,null,null,null,null,null,null,null,null,null,null,null,null,null,null,null,null,null,null,null,null,"żagański","Żagań"]
[null,null,null,null,null,null,null,null,null,null,null,null,null,null,null,null,null,null,null,null,null,null,null,null,null,"żarski","Łęknica"]
[null,null,null,null,null,null,null,null,null,null,null,null,null,null,null,null,null,null,null,null,null,null,null,null,null,"żarski","Żary"]
[null,null,null,null,null,null,null,null,null,null,null,null,null,null,null,null,null,null,null,null,null,null,null,null,null,"żarski","Brody"]
[null,null,null,null,null,null,null,null,null,null,null,null,null,null,null,null,null,null,null,null,null,null,null,null,null,"żarski","Jasień"]
[null,null,null,null,null,null,null,null,null,null,null,null,null,null,null,null,null,null,null,null,null,null,null,null,null,"żarski","Lipinki Łużyckie"]
[null,null,null,null,null,null,null,null,null,null,null,null,null,null,null,null,null,null,null,null,null,null,null,null,null,"żarski","Lubsko"]
[null,null,null,null,null,null,null,null,null,null,null,null,null,null,null,null,null,null,null,null,null,null,null,null,null,"żarski","Przewóz"]
[null,null,null,null,null,null,null,null,null,null,null,null,null,null,null,null,null,null,null,null,null,null,null,null,null,"żarski","Trzebiel"]
[null,null,null,null,null,null,null,null,null,null,null,null,null,null,null,null,null,null,null,null,null,null,null,null,null,"żarski","Tuplice"]
[null,null,null,null,null,null,null,null,null,null,null,null,null,null,null,null,null,null,null,null,null,null,null,null,null,"żarski","Żary"]
[null,null,null,null,null,null,null,null,null,null,null,null,null,null,null,null,null,null,null,null,null,null,null,null,null,"wschowski","Sława"]
[null,null,null,null,null,null,null,null,null,null,null,null,null,null,null,null,null,null,null,null,null,null,null,null,null,"wschowski","Szlichtyngowa"]
[null,null,null,null,null,null,null,null,null,null,null,null,null,null,null,null,null,null,null,null,null,null,null,null,null,"wschowski","Wschowa"]
[null,null,null,null,null,null,null,null,null,null,null,null,null,null,null,null,null,null,null,null,null,null,null,null,null,"Zielona Góra","Zielona Góra"]
[null,null,null,null,null,null,null,null,null,null,null,null,null,null,null,null,null,null,null,null,null,null,null,null,null,"jarociński","Jaraczewo"]
[null,null,null,null,null,null,null,null,null,null,null,null,null,null,null,null,null,null,null,null,null,null,null,null,null,"jarociński","Jarocin"]
[null,null,null,null,null,null,null,null,null,null,null,null,null,null,null,null,null,null,null,null,null,null,null,null,null,"jarociński","Kotlin"]
[null,null,null,null,null,null,null,null,null,null,null,null,null,null,null,null,null,null,null,null,null,null,null,null,null,"jarociński","Żerków"]
[null,null,null,null,null,null,null,null,null,null,null,null,null,null,null,null,null,null,null,null,null,null,null,null,null,"kaliski","Blizanów"]
[null,null,null,null,null,null,null,null,null,null,null,null,null,null,null,null,null,null,null,null,null,null,null,null,null,"kaliski","Brzeziny"]
[null,null,null,null,null,null,null,null,null,null,null,null,null,null,null,null,null,null,null,null,null,null,null,null,null,"kaliski","Ceków-Kolonia"]
[null,null,null,null,null,null,null,null,null,null,null,null,null,null,null,null,null,null,null,null,null,null,null,null,null,"kaliski","Godziesze Wielkie"]
[null,null,null,null,null,null,null,null,null,null,null,null,null,null,null,null,null,null,null,null,null,null,null,null,null,"kaliski","Koźminek"]
[null,null,null,null,null,null,null,null,null,null,null,null,null,null,null,null,null,null,null,null,null,null,null,null,null,"kaliski","Lisków"]
[null,null,null,null,null,null,null,null,null,null,null,null,null,null,null,null,null,null,null,null,null,null,null,null,null,"kaliski","Mycielin"]
[null,null,null,null,null,null,null,null,null,null,null,null,null,null,null,null,null,null,null,null,null,null,null,null,null,"kaliski","Opatówek"]
[null,null,null,null,null,null,null,null,null,null,null,null,null,null,null,null,null,null,null,null,null,null,null,null,null,"kaliski","Stawiszyn"]
[null,null,null,null,null,null,null,null,null,null,null,null,null,null,null,null,null,null,null,null,null,null,null,null,null,"kaliski","Szczytniki"]
[null,null,null,null,null,null,null,null,null,null,null,null,null,null,null,null,null,null,null,null,null,null,null,null,null,"kaliski","Żelazków"]
[null,null,null,null,null,null,null,null,null,null,null,null,null,null,null,null,null,null,null,null,null,null,null,null,null,"kępiński","Baranów"]
[null,null,null,null,null,null,null,null,null,null,null,null,null,null,null,null,null,null,null,null,null,null,null,null,null,"kępiński","Bralin"]
[null,null,null,null,null,null,null,null,null,null,null,null,null,null,null,null,null,null,null,null,null,null,null,null,null,"kępiński","Kępno"]
[null,null,null,null,null,null,null,null,null,null,null,null,null,null,null,null,null,null,null,null,null,null,null,null,null,"kępiński","Łęka Opatowska"]
[null,null,null,null,null,null,null,null,null,null,null,null,null,null,null,null,null,null,null,null,null,null,null,null,null,"kępiński","Perzów"]
[null,null,null,null,null,null,null,null,null,null,null,null,null,null,null,null,null,null,null,null,null,null,null,null,null,"kępiński","Rychtal"]
[null,null,null,null,null,null,null,null,null,null,null,null,null,null,null,null,null,null,null,null,null,null,null,null,null,"kępiński","Trzcinica"]
[null,null,null,null,null,null,null,null,null,null,null,null,null,null,null,null,null,null,null,null,null,null,null,null,null,"krotoszyński","Sulmierzyce"]
[null,null,null,null,null,null,null,null,null,null,null,null,null,null,null,null,null,null,null,null,null,null,null,null,null,"krotoszyński","Kobylin"]
[null,null,null,null,null,null,null,null,null,null,null,null,null,null,null,null,null,null,null,null,null,null,null,null,null,"krotoszyński","Koźmin Wielkopolski"]
[null,null,null,null,null,null,null,null,null,null,null,null,null,null,null,null,null,null,null,null,null,null,null,null,null,"krotoszyński","Krotoszyn"]
[null,null,null,null,null,null,null,null,null,null,null,null,null,null,null,null,null,null,null,null,null,null,null,null,null,"krotoszyński","Rozdrażew"]
[null,null,null,null,null,null,null,null,null,null,null,null,null,null,null,null,null,null,null,null,null,null,null,null,null,"krotoszyński","Zduny"]
[null,null,null,null,null,null,null,null,null,null,null,null,null,null,null,null,null,null,null,null,null,null,null,null,null,"ostrowski","Ostrów Wielkopolski"]
[null,null,null,null,null,null,null,null,null,null,null,null,null,null,null,null,null,null,null,null,null,null,null,null,null,"ostrowski","Nowe Skalmierzyce"]
[null,null,null,null,null,null,null,null,null,null,null,null,null,null,null,null,null,null,null,null,null,null,null,null,null,"ostrowski","Odolanów"]
[null,null,null,null,null,null,null,null,null,null,null,null,null,null,null,null,null,null,null,null,null,null,null,null,null,"ostrowski","Ostrów Wielkopolski"]
[null,null,null,null,null,null,null,null,null,null,null,null,null,null,null,null,null,null,null,null,null,null,null,null,null,"ostrowski","Przygodzice"]
[null,null,null,null,null,null,null,null,null,null,null,null,null,null,null,null,null,null,null,null,null,null,null,null,null,"ostrowski","Raszków"]
[null,null,null,null,null,null,null,null,null,null,null,null,null,null,null,null,null,null,null,null,null,null,null,null,null,"ostrowski","Sieroszewice"]
[null,null,null,null,null,null,null,null,null,null,null,null,null,null,null,null,null,null,null,null,null,null,null,null,null,"ostrowski","Sośnie"]
[null,null,null,null,null,null,null,null,null,null,null,null,null,null,null,null,null,null,null,null,null,null,null,null,null,"ostrzeszowski","Czajków"]
[null,null,null,null,null,null,null,null,null,null,null,null,null,null,null,null,null,null,null,null,null,null,null,null,null,"ostrzeszowski","Doruchów"]
[null,null,null,null,null,null,null,null,null,null,null,null,null,null,null,null,null,null,null,null,null,null,null,null,null,"ostrzeszowski","Grabów nad Prosną"]
[null,null,null,null,null,null,null,null,null,null,null,null,null,null,null,null,null,null,null,null,null,null,null,null,null,"ostrzeszowski","Kobyla Góra"]
[null,null,null,null,null,null,null,null,null,null,null,null,null,null,null,null,null,null,null,null,null,null,null,null,null,"ostrzeszowski","Kraszewice"]
[null,null,null,null,null,null,null,null,null,null,null,null,null,null,null,null,null,null,null,null,null,null,null,null,null,"ostrzeszowski","Mikstat"]
[null,null,null,null,null,null,null,null,null,null,null,null,null,null,null,null,null,null,null,null,null,null,null,null,null,"ostrzeszowski","Ostrzeszów"]
[null,null,null,null,null,null,null,null,null,null,null,null,null,null,null,null,null,null,null,null,null,null,null,null,null,"pleszewski","Chocz"]
[null,null,null,null,null,null,null,null,null,null,null,null,null,null,null,null,null,null,null,null,null,null,null,null,null,"pleszewski","Czermin"]
[null,null,null,null,null,null,null,null,null,null,null,null,null,null,null,null,null,null,null,null,null,null,null,null,null,"pleszewski","Dobrzyca"]
[null,null,null,null,null,null,null,null,null,null,null,null,null,null,null,null,null,null,null,null,null,null,null,null,null,"pleszewski","Gizałki"]
[null,null,null,null,null,null,null,null,null,null,null,null,null,null,null,null,null,null,null,null,null,null,null,null,null,"pleszewski","Gołuchów"]
[null,null,null,null,null,null,null,null,null,null,null,null,null,null,null,null,null,null,null,null,null,null,null,null,null,"pleszewski","Pleszew"]
[null,null,null,null,null,null,null,null,null,null,null,null,null,null,null,null,null,null,null,null,null,null,null,null,null,"Kalisz","Kalisz"]
[null,null,null,null,null,null,null,null,null,null,null,null,null,null,null,null,null,null,null,null,null,null,null,null,null,"gnieźnieński","Gniezno"]
[null,null,null,null,null,null,null,null,null,null,null,null,null,null,null,null,null,null,null,null,null,null,null,null,null,"gnieźnieński","Czerniejewo"]
[null,null,null,null,null,null,null,null,null,null,null,null,null,null,null,null,null,null,null,null,null,null,null,null,null,"gnieźnieński","Gniezno"]
[null,null,null,null,null,null,null,null,null,null,null,null,null,null,null,null,null,null,null,null,null,null,null,null,null,"gnieźnieński","Kiszkowo"]
[null,null,null,null,null,null,null,null,null,null,null,null,null,null,null,null,null,null,null,null,null,null,null,null,null,"gnieźnieński","Kłecko"]
[null,null,null,null,null,null,null,null,null,null,null,null,null,null,null,null,null,null,null,null,null,null,null,null,null,"gnieźnieński","Łubowo"]
[null,null,null,null,null,null,null,null,null,null,null,null,null,null,null,null,null,null,null,null,null,null,null,null,null,"gnieźnieński","Mieleszyn"]
[null,null,null,null,null,null,null,null,null,null,null,null,null,null,null,null,null,null,null,null,null,null,null,null,null,"gnieźnieński","Niechanowo"]
[null,null,null,null,null,null,null,null,null,null,null,null,null,null,null,null,null,null,null,null,null,null,null,null,null,"gnieźnieński","Trzemeszno"]
[null,null,null,null,null,null,null,null,null,null,null,null,null,null,null,null,null,null,null,null,null,null,null,null,null,"gnieźnieński","Witkowo"]
[null,null,null,null,null,null,null,null,null,null,null,null,null,null,null,null,null,null,null,null,null,null,null,null,null,"kolski","Koło"]
[null,null,null,null,null,null,null,null,null,null,null,null,null,null,null,null,null,null,null,null,null,null,null,null,null,"kolski","Babiak"]
[null,null,null,null,null,null,null,null,null,null,null,null,null,null,null,null,null,null,null,null,null,null,null,null,null,"kolski","Chodów"]
[null,null,null,null,null,null,null,null,null,null,null,null,null,null,null,null,null,null,null,null,null,null,null,null,null,"kolski","Dąbie"]
[null,null,null,null,null,null,null,null,null,null,null,null,null,null,null,null,null,null,null,null,null,null,null,null,null,"kolski","Grzegorzew"]
[null,null,null,null,null,null,null,null,null,null,null,null,null,null,null,null,null,null,null,null,null,null,null,null,null,"kolski","Kłodawa"]
[null,null,null,null,null,null,null,null,null,null,null,null,null,null,null,null,null,null,null,null,null,null,null,null,null,"kolski","Koło"]
[null,null,null,null,null,null,null,null,null,null,null,null,null,null,null,null,null,null,null,null,null,null,null,null,null,"kolski","Kościelec"]
[null,null,null,null,null,null,null,null,null,null,null,null,null,null,null,null,null,null,null,null,null,null,null,null,null,"kolski","Olszówka"]
[null,null,null,null,null,null,null,null,null,null,null,null,null,null,null,null,null,null,null,null,null,null,null,null,null,"kolski","Osiek Mały"]
[null,null,null,null,null,null,null,null,null,null,null,null,null,null,null,null,null,null,null,null,null,null,null,null,null,"kolski","Przedecz"]
[null,null,null,null,null,null,null,null,null,null,null,null,null,null,null,null,null,null,null,null,null,null,null,null,null,"koniński","Golina"]
[null,null,null,null,null,null,null,null,null,null,null,null,null,null,null,null,null,null,null,null,null,null,null,null,null,"koniński","Grodziec"]
[null,null,null,null,null,null,null,null,null,null,null,null,null,null,null,null,null,null,null,null,null,null,null,null,null,"koniński","Kazimierz Biskupi"]
[null,null,null,null,null,null,null,null,null,null,null,null,null,null,null,null,null,null,null,null,null,null,null,null,null,"koniński","Kleczew"]
[null,null,null,null,null,null,null,null,null,null,null,null,null,null,null,null,null,null,null,null,null,null,null,null,null,"koniński","Kramsk"]
[null,null,null,null,null,null,null,null,null,null,null,null,null,null,null,null,null,null,null,null,null,null,null,null,null,"koniński","Krzymów"]
[null,null,null,null,null,null,null,null,null,null,null,null,null,null,null,null,null,null,null,null,null,null,null,null,null,"koniński","Rychwał"]
[null,null,null,null,null,null,null,null,null,null,null,null,null,null,null,null,null,null,null,null,null,null,null,null,null,"koniński","Rzgów"]
[null,null,null,null,null,null,null,null,null,null,null,null,null,null,null,null,null,null,null,null,null,null,null,null,null,"koniński","Skulsk"]
[null,null,null,null,null,null,null,null,null,null,null,null,null,null,null,null,null,null,null,null,null,null,null,null,null,"koniński","Sompolno"]
[null,null,null,null,null,null,null,null,null,null,null,null,null,null,null,null,null,null,null,null,null,null,null,null,null,"koniński","Stare Miasto"]
[null,null,null,null,null,null,null,null,null,null,null,null,null,null,null,null,null,null,null,null,null,null,null,null,null,"koniński","Ślesin"]
[null,null,null,null,null,null,null,null,null,null,null,null,null,null,null,null,null,null,null,null,null,null,null,null,null,"koniński","Wierzbinek"]
[null,null,null,null,null,null,null,null,null,null,null,null,null,null,null,null,null,null,null,null,null,null,null,null,null,"koniński","Wilczyn"]
[null,null,null,null,null,null,null,null,null,null,null,null,null,null,null,null,null,null,null,null,null,null,null,null,null,"słupecki","Słupca"]
[null,null,null,null,null,null,null,null,null,null,null,null,null,null,null,null,null,null,null,null,null,null,null,null,null,"słupecki","Lądek"]
[null,null,null,null,null,null,null,null,null,null,null,null,null,null,null,null,null,null,null,null,null,null,null,null,null,"słupecki","Orchowo"]
[null,null,null,null,null,null,null,null,null,null,null,null,null,null,null,null,null,null,null,null,null,null,null,null,null,"słupecki","Ostrowite"]
[null,null,null,null,null,null,null,null,null,null,null,null,null,null,null,null,null,null,null,null,null,null,null,null,null,"słupecki","Powidz"]
[null,null,null,null,null,null,null,null,null,null,null,null,null,null,null,null,null,null,null,null,null,null,null,null,null,"słupecki","Słupca"]
[null,null,null,null,null,null,null,null,null,null,null,null,null,null,null,null,null,null,null,null,null,null,null,null,null,"słupecki","Strzałkowo"]
[null,null,null,null,null,null,null,null,null,null,null,null,null,null,null,null,null,null,null,null,null,null,null,null,null,"słupecki","Zagórów"]
[null,null,null,null,null,null,null,null,null,null,null,null,null,null,null,null,null,null,null,null,null,null,null,null,null,"turecki","Turek"]
[null,null,null,null,null,null,null,null,null,null,null,null,null,null,null,null,null,null,null,null,null,null,null,null,null,"turecki","Brudzew"]
[null,null,null,null,null,null,null,null,null,null,null,null,null,null,null,null,null,null,null,null,null,null,null,null,null,"turecki","Dobra"]
[null,null,null,null,null,null,null,null,null,null,null,null,null,null,null,null,null,null,null,null,null,null,null,null,null,"turecki","Kawęczyn"]
[null,null,null,null,null,null,null,null,null,null,null,null,null,null,null,null,null,null,null,null,null,null,null,null,null,"turecki","Malanów"]
[null,null,null,null,null,null,null,null,null,null,null,null,null,null,null,null,null,null,null,null,null,null,null,null,null,"turecki","Przykona"]
[null,null,null,null,null,null,null,null,null,null,null,null,null,null,null,null,null,null,null,null,null,null,null,null,null,"turecki","Tuliszków"]
[null,null,null,null,null,null,null,null,null,null,null,null,null,null,null,null,null,null,null,null,null,null,null,null,null,"turecki","Turek"]
[null,null,null,null,null,null,null,null,null,null,null,null,null,null,null,null,null,null,null,null,null,null,null,null,null,"turecki","Władysławów"]
[null,null,null,null,null,null,null,null,null,null,null,null,null,null,null,null,null,null,null,null,null,null,null,null,null,"wrzesiński","Kołaczkowo"]
[null,null,null,null,null,null,null,null,null,null,null,null,null,null,null,null,null,null,null,null,null,null,null,null,null,"wrzesiński","Miłosław"]
[null,null,null,null,null,null,null,null,null,null,null,null,null,null,null,null,null,null,null,null,null,null,null,null,null,"wrzesiński","Nekla"]
[null,null,null,null,null,null,null,null,null,null,null,null,null,null,null,null,null,null,null,null,null,null,null,null,null,"wrzesiński","Pyzdry"]
[null,null,null,null,null,null,null,null,null,null,null,null,null,null,null,null,null,null,null,null,null,null,null,null,null,"wrzesiński","Września"]
[null,null,null,null,null,null,null,null,null,null,null,null,null,null,null,null,null,null,null,null,null,null,null,null,null,"Konin","Konin"]
[null,null,null,null,null,null,null,null,null,null,null,null,null,null,null,null,null,null,null,null,null,null,null,null,null,"gostyński","Borek Wielkopolski"]
[null,null,null,null,null,null,null,null,null,null,null,null,null,null,null,null,null,null,null,null,null,null,null,null,null,"gostyński","Gostyń"]
[null,null,null,null,null,null,null,null,null,null,null,null,null,null,null,null,null,null,null,null,null,null,null,null,null,"gostyński","Krobia"]
[null,null,null,null,null,null,null,null,null,null,null,null,null,null,null,null,null,null,null,null,null,null,null,null,null,"gostyński","Pępowo"]
[null,null,null,null,null,null,null,null,null,null,null,null,null,null,null,null,null,null,null,null,null,null,null,null,null,"gostyński","Piaski"]
[null,null,null,null,null,null,null,null,null,null,null,null,null,null,null,null,null,null,null,null,null,null,null,null,null,"gostyński","Pogorzela"]
[null,null,null,null,null,null,null,null,null,null,null,null,null,null,null,null,null,null,null,null,null,null,null,null,null,"gostyński","Poniec"]
[null,null,null,null,null,null,null,null,null,null,null,null,null,null,null,null,null,null,null,null,null,null,null,null,null,"grodziski","Granowo"]
[null,null,null,null,null,null,null,null,null,null,null,null,null,null,null,null,null,null,null,null,null,null,null,null,null,"grodziski","Grodzisk Wielkopolski"]
[null,null,null,null,null,null,null,null,null,null,null,null,null,null,null,null,null,null,null,null,null,null,null,null,null,"grodziski","Kamieniec"]
[null,null,null,null,null,null,null,null,null,null,null,null,null,null,null,null,null,null,null,null,null,null,null,null,null,"grodziski","Rakoniewice"]
[null,null,null,null,null,null,null,null,null,null,null,null,null,null,null,null,null,null,null,null,null,null,null,null,null,"grodziski","Wielichowo"]
[null,null,null,null,null,null,null,null,null,null,null,null,null,null,null,null,null,null,null,null,null,null,null,null,null,"kościański","Kościan"]
[null,null,null,null,null,null,null,null,null,null,null,null,null,null,null,null,null,null,null,null,null,null,null,null,null,"kościański","Czempiń"]
[null,null,null,null,null,null,null,null,null,null,null,null,null,null,null,null,null,null,null,null,null,null,null,null,null,"kościański","Kościan"]
[null,null,null,null,null,null,null,null,null,null,null,null,null,null,null,null,null,null,null,null,null,null,null,null,null,"kościański","Krzywiń"]
[null,null,null,null,null,null,null,null,null,null,null,null,null,null,null,null,null,null,null,null,null,null,null,null,null,"kościański","Śmigiel"]
[null,null,null,null,null,null,null,null,null,null,null,null,null,null,null,null,null,null,null,null,null,null,null,null,null,"leszczyński","Krzemieniewo"]
[null,null,null,null,null,null,null,null,null,null,null,null,null,null,null,null,null,null,null,null,null,null,null,null,null,"leszczyński","Lipno"]
[null,null,null,null,null,null,null,null,null,null,null,null,null,null,null,null,null,null,null,null,null,null,null,null,null,"leszczyński","Osieczna"]
[null,null,null,null,null,null,null,null,null,null,null,null,null,null,null,null,null,null,null,null,null,null,null,null,null,"leszczyński","Rydzyna"]
[null,null,null,null,null,null,null,null,null,null,null,null,null,null,null,null,null,null,null,null,null,null,null,null,null,"leszczyński","Święciechowa"]
[null,null,null,null,null,null,null,null,null,null,null,null,null,null,null,null,null,null,null,null,null,null,null,null,null,"leszczyński","Wijewo"]
[null,null,null,null,null,null,null,null,null,null,null,null,null,null,null,null,null,null,null,null,null,null,null,null,null,"leszczyński","Włoszakowice"]
[null,null,null,null,null,null,null,null,null,null,null,null,null,null,null,null,null,null,null,null,null,null,null,null,null,"międzychodzki","Chrzypsko Wielkie"]
[null,null,null,null,null,null,null,null,null,null,null,null,null,null,null,null,null,null,null,null,null,null,null,null,null,"międzychodzki","Kwilcz"]
[null,null,null,null,null,null,null,null,null,null,null,null,null,null,null,null,null,null,null,null,null,null,null,null,null,"międzychodzki","Międzychód"]
[null,null,null,null,null,null,null,null,null,null,null,null,null,null,null,null,null,null,null,null,null,null,null,null,null,"międzychodzki","Sieraków"]
[null,null,null,null,null,null,null,null,null,null,null,null,null,null,null,null,null,null,null,null,null,null,null,null,null,"nowotomyski","Kuślin"]
[null,null,null,null,null,null,null,null,null,null,null,null,null,null,null,null,null,null,null,null,null,null,null,null,null,"nowotomyski","Lwówek"]
[null,null,null,null,null,null,null,null,null,null,null,null,null,null,null,null,null,null,null,null,null,null,null,null,null,"nowotomyski","Miedzichowo"]
[null,null,null,null,null,null,null,null,null,null,null,null,null,null,null,null,null,null,null,null,null,null,null,null,null,"nowotomyski","Nowy Tomyśl"]
[null,null,null,null,null,null,null,null,null,null,null,null,null,null,null,null,null,null,null,null,null,null,null,null,null,"nowotomyski","Opalenica"]
[null,null,null,null,null,null,null,null,null,null,null,null,null,null,null,null,null,null,null,null,null,null,null,null,null,"nowotomyski","Zbąszyń"]
[null,null,null,null,null,null,null,null,null,null,null,null,null,null,null,null,null,null,null,null,null,null,null,null,null,"rawicki","Bojanowo"]
[null,null,null,null,null,null,null,null,null,null,null,null,null,null,null,null,null,null,null,null,null,null,null,null,null,"rawicki","Jutrosin"]
[null,null,null,null,null,null,null,null,null,null,null,null,null,null,null,null,null,null,null,null,null,null,null,null,null,"rawicki","Miejska Górka"]
[null,null,null,null,null,null,null,null,null,null,null,null,null,null,null,null,null,null,null,null,null,null,null,null,null,"rawicki","Pakosław"]
[null,null,null,null,null,null,null,null,null,null,null,null,null,null,null,null,null,null,null,null,null,null,null,null,null,"rawicki","Rawicz"]
[null,null,null,null,null,null,null,null,null,null,null,null,null,null,null,null,null,null,null,null,null,null,null,null,null,"wolsztyński","Przemęt"]
[null,null,null,null,null,null,null,null,null,null,null,null,null,null,null,null,null,null,null,null,null,null,null,null,null,"wolsztyński","Siedlec"]
[null,null,null,null,null,null,null,null,null,null,null,null,null,null,null,null,null,null,null,null,null,null,null,null,null,"wolsztyński","Wolsztyn"]
[null,null,null,null,null,null,null,null,null,null,null,null,null,null,null,null,null,null,null,null,null,null,null,null,null,"Leszno","Leszno"]
[null,null,null,null,null,null,null,null,null,null,null,null,null,null,null,null,null,null,null,null,null,null,null,null,null,"chodzieski","Chodzież"]
[null,null,null,null,null,null,null,null,null,null,null,null,null,null,null,null,null,null,null,null,null,null,null,null,null,"chodzieski","Budzyń"]
[null,null,null,null,null,null,null,null,null,null,null,null,null,null,null,null,null,null,null,null,null,null,null,null,null,"chodzieski","Chodzież"]
[null,null,null,null,null,null,null,null,null,null,null,null,null,null,null,null,null,null,null,null,null,null,null,null,null,"chodzieski","Margonin"]
[null,null,null,null,null,null,null,null,null,null,null,null,null,null,null,null,null,null,null,null,null,null,null,null,null,"chodzieski","Szamocin"]
[null,null,null,null,null,null,null,null,null,null,null,null,null,null,null,null,null,null,null,null,null,null,null,null,null,"czarnkowsko-trzcianecki","Czarnków"]
[null,null,null,null,null,null,null,null,null,null,null,null,null,null,null,null,null,null,null,null,null,null,null,null,null,"czarnkowsko-trzcianecki","Drawsko"]
[null,null,null,null,null,null,null,null,null,null,null,null,null,null,null,null,null,null,null,null,null,null,null,null,null,"czarnkowsko-trzcianecki","Krzyż Wielkopolski"]
[null,null,null,null,null,null,null,null,null,null,null,null,null,null,null,null,null,null,null,null,null,null,null,null,null,"czarnkowsko-trzcianecki","Lubasz"]
[null,null,null,null,null,null,null,null,null,null,null,null,null,null,null,null,null,null,null,null,null,null,null,null,null,"czarnkowsko-trzcianecki","Połajewo"]
[null,null,null,null,null,null,null,null,null,null,null,null,null,null,null,null,null,null,null,null,null,null,null,null,null,"czarnkowsko-trzcianecki","Trzcianka"]
[null,null,null,null,null,null,null,null,null,null,null,null,null,null,null,null,null,null,null,null,null,null,null,null,null,"czarnkowsko-trzcianecki","Wieleń"]
[null,null,null,null,null,null,null,null,null,null,null,null,null,null,null,null,null,null,null,null,null,null,null,null,null,"pilski","Piła"]
[null,null,null,null,null,null,null,null,null,null,null,null,null,null,null,null,null,null,null,null,null,null,null,null,null,"pilski","Białośliwie"]
[null,null,null,null,null,null,null,null,null,null,null,null,null,null,null,null,null,null,null,null,null,null,null,null,null,"pilski","Kaczory"]
[null,null,null,null,null,null,null,null,null,null,null,null,null,null,null,null,null,null,null,null,null,null,null,null,null,"pilski","Łobżenica"]
[null,null,null,null,null,null,null,null,null,null,null,null,null,null,null,null,null,null,null,null,null,null,null,null,null,"pilski","Miasteczko Krajeńskie"]
[null,null,null,null,null,null,null,null,null,null,null,null,null,null,null,null,null,null,null,null,null,null,null,null,null,"pilski","Szydłowo"]
[null,null,null,null,null,null,null,null,null,null,null,null,null,null,null,null,null,null,null,null,null,null,null,null,null,"pilski","Ujście"]
[null,null,null,null,null,null,null,null,null,null,null,null,null,null,null,null,null,null,null,null,null,null,null,null,null,"pilski","Wyrzysk"]
[null,null,null,null,null,null,null,null,null,null,null,null,null,null,null,null,null,null,null,null,null,null,null,null,null,"pilski","Wysoka"]
[null,null,null,null,null,null,null,null,null,null,null,null,null,null,null,null,null,null,null,null,null,null,null,null,null,"wągrowiecki","Wągrowiec"]
[null,null,null,null,null,null,null,null,null,null,null,null,null,null,null,null,null,null,null,null,null,null,null,null,null,"wągrowiecki","Damasławek"]
[null,null,null,null,null,null,null,null,null,null,null,null,null,null,null,null,null,null,null,null,null,null,null,null,null,"wągrowiecki","Gołańcz"]
[null,null,null,null,null,null,null,null,null,null,null,null,null,null,null,null,null,null,null,null,null,null,null,null,null,"wągrowiecki","Mieścisko"]
[null,null,null,null,null,null,null,null,null,null,null,null,null,null,null,null,null,null,null,null,null,null,null,null,null,"wągrowiecki","Skoki"]
[null,null,null,null,null,null,null,null,null,null,null,null,null,null,null,null,null,null,null,null,null,null,null,null,null,"wągrowiecki","Wapno"]
[null,null,null,null,null,null,null,null,null,null,null,null,null,null,null,null,null,null,null,null,null,null,null,null,null,"wągrowiecki","Wągrowiec"]
[null,null,null,null,null,null,null,null,null,null,null,null,null,null,null,null,null,null,null,null,null,null,null,null,null,"złotowski","Złotów"]
[null,null,null,null,null,null,null,null,null,null,null,null,null,null,null,null,null,null,null,null,null,null,null,null,null,"złotowski","Jastrowie"]
[null,null,null,null,null,null,null,null,null,null,null,null,null,null,null,null,null,null,null,null,null,null,null,null,null,"złotowski","Krajenka"]
[null,null,null,null,null,null,null,null,null,null,null,null,null,null,null,null,null,null,null,null,null,null,null,null,null,"złotowski","Lipka"]
[null,null,null,null,null,null,null,null,null,null,null,null,null,null,null,null,null,null,null,null,null,null,null,null,null,"złotowski","Okonek"]
[null,null,null,null,null,null,null,null,null,null,null,null,null,null,null,null,null,null,null,null,null,null,null,null,null,"złotowski","Tarnówka"]
[null,null,null,null,null,null,null,null,null,null,null,null,null,null,null,null,null,null,null,null,null,null,null,null,null,"złotowski","Zakrzewo"]
[null,null,null,null,null,null,null,null,null,null,null,null,null,null,null,null,null,null,null,null,null,null,null,null,null,"złotowski","Złotów"]
[null,null,null,null,null,null,null,null,null,null,null,null,null,null,null,null,null,null,null,null,null,null,null,null,null,"obornicki","Oborniki"]
[null,null,null,null,null,null,null,null,null,null,null,null,null,null,null,null,null,null,null,null,null,null,null,null,null,"obornicki","Rogoźno"]
[null,null,null,null,null,null,null,null,null,null,null,null,null,null,null,null,null,null,null,null,null,null,null,null,null,"obornicki","Ryczywół"]
[null,null,null,null,null,null,null,null,null,null,null,null,null,null,null,null,null,null,null,null,null,null,null,null,null,"poznański","Luboń"]
[null,null,null,null,null,null,null,null,null,null,null,null,null,null,null,null,null,null,null,null,null,null,null,null,null,"poznański","Puszczykowo"]
[null,null,null,null,null,null,null,null,null,null,null,null,null,null,null,null,null,null,null,null,null,null,null,null,null,"poznański","Buk"]
[null,null,null,null,null,null,null,null,null,null,null,null,null,null,null,null,null,null,null,null,null,null,null,null,null,"poznański","Czerwonak"]
[null,null,null,null,null,null,null,null,null,null,null,null,null,null,null,null,null,null,null,null,null,null,null,null,null,"poznański","Dopiewo"]
[null,null,null,null,null,null,null,null,null,null,null,null,null,null,null,null,null,null,null,null,null,null,null,null,null,"poznański","Kleszczewo"]
[null,null,null,null,null,null,null,null,null,null,null,null,null,null,null,null,null,null,null,null,null,null,null,null,null,"poznański","Komorniki"]
[null,null,null,null,null,null,null,null,null,null,null,null,null,null,null,null,null,null,null,null,null,null,null,null,null,"poznański","Kostrzyn"]
[null,null,null,null,null,null,null,null,null,null,null,null,null,null,null,null,null,null,null,null,null,null,null,null,null,"poznański","Kórnik"]
[null,null,null,null,null,null,null,null,null,null,null,null,null,null,null,null,null,null,null,null,null,null,null,null,null,"poznański","Mosina"]
[null,null,null,null,null,null,null,null,null,null,null,null,null,null,null,null,null,null,null,null,null,null,null,null,null,"poznański","Murowana Goślina"]
[null,null,null,null,null,null,null,null,null,null,null,null,null,null,null,null,null,null,null,null,null,null,null,null,null,"poznański","Pobiedziska"]
[null,null,null,null,null,null,null,null,null,null,null,null,null,null,null,null,null,null,null,null,null,null,null,null,null,"poznański","Rokietnica"]
[null,null,null,null,null,null,null,null,null,null,null,null,null,null,null,null,null,null,null,null,null,null,null,null,null,"poznański","Stęszew"]
[null,null,null,null,null,null,null,null,null,null,null,null,null,null,null,null,null,null,null,null,null,null,null,null,null,"poznański","Suchy Las"]
[null,null,null,null,null,null,null,null,null,null,null,null,null,null,null,null,null,null,null,null,null,null,null,null,null,"poznański","Swarzędz"]
[null,null,null,null,null,null,null,null,null,null,null,null,null,null,null,null,null,null,null,null,null,null,null,null,null,"poznański","Tarnowo Podgórne"]
[null,null,null,null,null,null,null,null,null,null,null,null,null,null,null,null,null,null,null,null,null,null,null,null,null,"szamotulski","Obrzycko"]
[null,null,null,null,null,null,null,null,null,null,null,null,null,null,null,null,null,null,null,null,null,null,null,null,null,"szamotulski","Duszniki"]
[null,null,null,null,null,null,null,null,null,null,null,null,null,null,null,null,null,null,null,null,null,null,null,null,null,"szamotulski","Kaźmierz"]
[null,null,null,null,null,null,null,null,null,null,null,null,null,null,null,null,null,null,null,null,null,null,null,null,null,"szamotulski","Obrzycko"]
[null,null,null,null,null,null,null,null,null,null,null,null,null,null,null,null,null,null,null,null,null,null,null,null,null,"szamotulski","Ostroróg"]
[null,null,null,null,null,null,null,null,null,null,null,null,null,null,null,null,null,null,null,null,null,null,null,null,null,"szamotulski","Pniewy"]
[null,null,null,null,null,null,null,null,null,null,null,null,null,null,null,null,null,null,null,null,null,null,null,null,null,"szamotulski","Szamotuły"]
[null,null,null,null,null,null,null,null,null,null,null,null,null,null,null,null,null,null,null,null,null,null,null,null,null,"szamotulski","Wronki"]
[null,null,null,null,null,null,null,null,null,null,null,null,null,null,null,null,null,null,null,null,null,null,null,null,null,"średzki","Dominowo"]
[null,null,null,null,null,null,null,null,null,null,null,null,null,null,null,null,null,null,null,null,null,null,null,null,null,"średzki","Krzykosy"]
[null,null,null,null,null,null,null,null,null,null,null,null,null,null,null,null,null,null,null,null,null,null,null,null,null,"średzki","Nowe Miasto nad Wartą"]
[null,null,null,null,null,null,null,null,null,null,null,null,null,null,null,null,null,null,null,null,null,null,null,null,null,"średzki","Środa Wielkopolska"]
[null,null,null,null,null,null,null,null,null,null,null,null,null,null,null,null,null,null,null,null,null,null,null,null,null,"średzki","Zaniemyśl"]
[null,null,null,null,null,null,null,null,null,null,null,null,null,null,null,null,null,null,null,null,null,null,null,null,null,"śremski","Brodnica"]
[null,null,null,null,null,null,null,null,null,null,null,null,null,null,null,null,null,null,null,null,null,null,null,null,null,"śremski","Dolsk"]
[null,null,null,null,null,null,null,null,null,null,null,null,null,null,null,null,null,null,null,null,null,null,null,null,null,"śremski","Książ Wielkopolski"]
[null,null,null,null,null,null,null,null,null,null,null,null,null,null,null,null,null,null,null,null,null,null,null,null,null,"śremski","Śrem"]
[null,null,null,null,null,null,null,null,null,null,null,null,null,null,null,null,null,null,null,null,null,null,null,null,null,"Poznań","Poznań"]
[null,null,null,null,null,null,null,null,null,null,null,null,null,null,null,null,null,null,null,null,null,null,null,null,null,"Poznań","Poznań-Grunwald"]
[null,null,null,null,null,null,null,null,null,null,null,null,null,null,null,null,null,null,null,null,null,null,null,null,null,"Poznań","Poznań-Jeżyce"]
[null,null,null,null,null,null,null,null,null,null,null,null,null,null,null,null,null,null,null,null,null,null,null,null,null,"Poznań","Poznań-Nowe Miasto"]
[null,null,null,null,null,null,null,null,null,null,null,null,null,null,null,null,null,null,null,null,null,null,null,null,null,"Poznań","Poznań-Stare Miasto"]
[null,null,null,null,null,null,null,null,null,null,null,null,null,null,null,null,null,null,null,null,null,null,null,null,null,"Poznań","Poznań-Wilda"]
[null,null,null,null,null,null,null,null,null,null,null,null,null,null,null,null,null,null,null,null,null,null,null,null,null,"białogardzki","Białogard"]
[null,null,null,null,null,null,null,null,null,null,null,null,null,null,null,null,null,null,null,null,null,null,null,null,null,"białogardzki","Karlino"]
[null,null,null,null,null,null,null,null,null,null,null,null,null,null,null,null,null,null,null,null,null,null,null,null,null,"białogardzki","Tychowo"]
[null,null,null,null,null,null,null,null,null,null,null,null,null,null,null,null,null,null,null,null,null,null,null,null,null,"kołobrzeski","Kołobrzeg"]
[null,null,null,null,null,null,null,null,null,null,null,null,null,null,null,null,null,null,null,null,null,null,null,null,null,"kołobrzeski","Dygowo"]
[null,null,null,null,null,null,null,null,null,null,null,null,null,null,null,null,null,null,null,null,null,null,null,null,null,"kołobrzeski","Gościno"]
[null,null,null,null,null,null,null,null,null,null,null,null,null,null,null,null,null,null,null,null,null,null,null,null,null,"kołobrzeski","Kołobrzeg"]
[null,null,null,null,null,null,null,null,null,null,null,null,null,null,null,null,null,null,null,null,null,null,null,null,null,"kołobrzeski","Rymań"]
[null,null,null,null,null,null,null,null,null,null,null,null,null,null,null,null,null,null,null,null,null,null,null,null,null,"kołobrzeski","Siemyśl"]
[null,null,null,null,null,null,null,null,null,null,null,null,null,null,null,null,null,null,null,null,null,null,null,null,null,"kołobrzeski","Ustronie Morskie"]
[null,null,null,null,null,null,null,null,null,null,null,null,null,null,null,null,null,null,null,null,null,null,null,null,null,"koszaliński","Będzino"]
[null,null,null,null,null,null,null,null,null,null,null,null,null,null,null,null,null,null,null,null,null,null,null,null,null,"koszaliński","Biesiekierz"]
[null,null,null,null,null,null,null,null,null,null,null,null,null,null,null,null,null,null,null,null,null,null,null,null,null,"koszaliński","Bobolice"]
[null,null,null,null,null,null,null,null,null,null,null,null,null,null,null,null,null,null,null,null,null,null,null,null,null,"koszaliński","Manowo"]
[null,null,null,null,null,null,null,null,null,null,null,null,null,null,null,null,null,null,null,null,null,null,null,null,null,"koszaliński","Mielno"]
[null,null,null,null,null,null,null,null,null,null,null,null,null,null,null,null,null,null,null,null,null,null,null,null,null,"koszaliński","Polanów"]
[null,null,null,null,null,null,null,null,null,null,null,null,null,null,null,null,null,null,null,null,null,null,null,null,null,"koszaliński","Sianów"]
[null,null,null,null,null,null,null,null,null,null,null,null,null,null,null,null,null,null,null,null,null,null,null,null,null,"koszaliński","Świeszyno"]
[null,null,null,null,null,null,null,null,null,null,null,null,null,null,null,null,null,null,null,null,null,null,null,null,null,"sławieński","Darłowo"]
[null,null,null,null,null,null,null,null,null,null,null,null,null,null,null,null,null,null,null,null,null,null,null,null,null,"sławieński","Sławno"]
[null,null,null,null,null,null,null,null,null,null,null,null,null,null,null,null,null,null,null,null,null,null,null,null,null,"sławieński","Malechowo"]
[null,null,null,null,null,null,null,null,null,null,null,null,null,null,null,null,null,null,null,null,null,null,null,null,null,"sławieński","Postomino"]
[null,null,null,null,null,null,null,null,null,null,null,null,null,null,null,null,null,null,null,null,null,null,null,null,null,"sławieński","Sławno"]
[null,null,null,null,null,null,null,null,null,null,null,null,null,null,null,null,null,null,null,null,null,null,null,null,null,"Koszalin","Koszalin"]
[null,null,null,null,null,null,null,null,null,null,null,null,null,null,null,null,null,null,null,null,null,null,null,null,null,"choszczeński","Bierzwnik"]
[null,null,null,null,null,null,null,null,null,null,null,null,null,null,null,null,null,null,null,null,null,null,null,null,null,"choszczeński","Choszczno"]
[null,null,null,null,null,null,null,null,null,null,null,null,null,null,null,null,null,null,null,null,null,null,null,null,null,"choszczeński","Drawno"]
[null,null,null,null,null,null,null,null,null,null,null,null,null,null,null,null,null,null,null,null,null,null,null,null,null,"choszczeński","Krzęcin"]
[null,null,null,null,null,null,null,null,null,null,null,null,null,null,null,null,null,null,null,null,null,null,null,null,null,"choszczeński","Pełczyce"]
[null,null,null,null,null,null,null,null,null,null,null,null,null,null,null,null,null,null,null,null,null,null,null,null,null,"choszczeński","Recz"]
[null,null,null,null,null,null,null,null,null,null,null,null,null,null,null,null,null,null,null,null,null,null,null,null,null,"drawski","Czaplinek"]
[null,null,null,null,null,null,null,null,null,null,null,null,null,null,null,null,null,null,null,null,null,null,null,null,null,"drawski","Drawsko Pomorskie"]
[null,null,null,null,null,null,null,null,null,null,null,null,null,null,null,null,null,null,null,null,null,null,null,null,null,"drawski","Kalisz Pomorski"]
[null,null,null,null,null,null,null,null,null,null,null,null,null,null,null,null,null,null,null,null,null,null,null,null,null,"drawski","Wierzchowo"]
[null,null,null,null,null,null,null,null,null,null,null,null,null,null,null,null,null,null,null,null,null,null,null,null,null,"drawski","Złocieniec"]
[null,null,null,null,null,null,null,null,null,null,null,null,null,null,null,null,null,null,null,null,null,null,null,null,null,"myśliborski","Barlinek"]
[null,null,null,null,null,null,null,null,null,null,null,null,null,null,null,null,null,null,null,null,null,null,null,null,null,"myśliborski","Boleszkowice"]
[null,null,null,null,null,null,null,null,null,null,null,null,null,null,null,null,null,null,null,null,null,null,null,null,null,"myśliborski","Dębno"]
[null,null,null,null,null,null,null,null,null,null,null,null,null,null,null,null,null,null,null,null,null,null,null,null,null,"myśliborski","Myślibórz"]
[null,null,null,null,null,null,null,null,null,null,null,null,null,null,null,null,null,null,null,null,null,null,null,null,null,"myśliborski","Nowogródek Pomorski"]
[null,null,null,null,null,null,null,null,null,null,null,null,null,null,null,null,null,null,null,null,null,null,null,null,null,"pyrzycki","Bielice"]
[null,null,null,null,null,null,null,null,null,null,null,null,null,null,null,null,null,null,null,null,null,null,null,null,null,"pyrzycki","Kozielice"]
[null,null,null,null,null,null,null,null,null,null,null,null,null,null,null,null,null,null,null,null,null,null,null,null,null,"pyrzycki","Lipiany"]
[null,null,null,null,null,null,null,null,null,null,null,null,null,null,null,null,null,null,null,null,null,null,null,null,null,"pyrzycki","Przelewice"]
[null,null,null,null,null,null,null,null,null,null,null,null,null,null,null,null,null,null,null,null,null,null,null,null,null,"pyrzycki","Pyrzyce"]
[null,null,null,null,null,null,null,null,null,null,null,null,null,null,null,null,null,null,null,null,null,null,null,null,null,"pyrzycki","Warnice"]
[null,null,null,null,null,null,null,null,null,null,null,null,null,null,null,null,null,null,null,null,null,null,null,null,null,"szczecinecki","Szczecinek"]
[null,null,null,null,null,null,null,null,null,null,null,null,null,null,null,null,null,null,null,null,null,null,null,null,null,"szczecinecki","Barwice"]
[null,null,null,null,null,null,null,null,null,null,null,null,null,null,null,null,null,null,null,null,null,null,null,null,null,"szczecinecki","Biały Bór"]
[null,null,null,null,null,null,null,null,null,null,null,null,null,null,null,null,null,null,null,null,null,null,null,null,null,"szczecinecki","Borne Sulinowo"]
[null,null,null,null,null,null,null,null,null,null,null,null,null,null,null,null,null,null,null,null,null,null,null,null,null,"szczecinecki","Grzmiąca"]
[null,null,null,null,null,null,null,null,null,null,null,null,null,null,null,null,null,null,null,null,null,null,null,null,null,"szczecinecki","Szczecinek"]
[null,null,null,null,null,null,null,null,null,null,null,null,null,null,null,null,null,null,null,null,null,null,null,null,null,"świdwiński","Świdwin"]
[null,null,null,null,null,null,null,null,null,null,null,null,null,null,null,null,null,null,null,null,null,null,null,null,null,"świdwiński","Brzeżno"]
[null,null,null,null,null,null,null,null,null,null,null,null,null,null,null,null,null,null,null,null,null,null,null,null,null,"świdwiński","Połczyn-Zdrój"]
[null,null,null,null,null,null,null,null,null,null,null,null,null,null,null,null,null,null,null,null,null,null,null,null,null,"świdwiński","Rąbino"]
[null,null,null,null,null,null,null,null,null,null,null,null,null,null,null,null,null,null,null,null,null,null,null,null,null,"świdwiński","Sławoborze"]
[null,null,null,null,null,null,null,null,null,null,null,null,null,null,null,null,null,null,null,null,null,null,null,null,null,"świdwiński","Świdwin"]
[null,null,null,null,null,null,null,null,null,null,null,null,null,null,null,null,null,null,null,null,null,null,null,null,null,"wałecki","Wałcz"]
[null,null,null,null,null,null,null,null,null,null,null,null,null,null,null,null,null,null,null,null,null,null,null,null,null,"wałecki","Człopa"]
[null,null,null,null,null,null,null,null,null,null,null,null,null,null,null,null,null,null,null,null,null,null,null,null,null,"wałecki","Mirosławiec"]
[null,null,null,null,null,null,null,null,null,null,null,null,null,null,null,null,null,null,null,null,null,null,null,null,null,"wałecki","Tuczno"]
[null,null,null,null,null,null,null,null,null,null,null,null,null,null,null,null,null,null,null,null,null,null,null,null,null,"wałecki","Wałcz"]
[null,null,null,null,null,null,null,null,null,null,null,null,null,null,null,null,null,null,null,null,null,null,null,null,null,"łobeski","Dobra"]
[null,null,null,null,null,null,null,null,null,null,null,null,null,null,null,null,null,null,null,null,null,null,null,null,null,"łobeski","Łobez"]
[null,null,null,null,null,null,null,null,null,null,null,null,null,null,null,null,null,null,null,null,null,null,null,null,null,"łobeski","Radowo Małe"]
[null,null,null,null,null,null,null,null,null,null,null,null,null,null,null,null,null,null,null,null,null,null,null,null,null,"łobeski","Resko"]
[null,null,null,null,null,null,null,null,null,null,null,null,null,null,null,null,null,null,null,null,null,null,null,null,null,"łobeski","Węgorzyno"]
[null,null,null,null,null,null,null,null,null,null,null,null,null,null,null,null,null,null,null,null,null,null,null,null,null,"Szczecin","Szczecin"]
[null,null,null,null,null,null,null,null,null,null,null,null,null,null,null,null,null,null,null,null,null,null,null,null,null,"goleniowski","Goleniów"]
[null,null,null,null,null,null,null,null,null,null,null,null,null,null,null,null,null,null,null,null,null,null,null,null,null,"goleniowski","Maszewo"]
[null,null,null,null,null,null,null,null,null,null,null,null,null,null,null,null,null,null,null,null,null,null,null,null,null,"goleniowski","Nowogard"]
[null,null,null,null,null,null,null,null,null,null,null,null,null,null,null,null,null,null,null,null,null,null,null,null,null,"goleniowski","Osina"]
[null,null,null,null,null,null,null,null,null,null,null,null,null,null,null,null,null,null,null,null,null,null,null,null,null,"goleniowski","Przybiernów"]
[null,null,null,null,null,null,null,null,null,null,null,null,null,null,null,null,null,null,null,null,null,null,null,null,null,"goleniowski","Stepnica"]
[null,null,null,null,null,null,null,null,null,null,null,null,null,null,null,null,null,null,null,null,null,null,null,null,null,"gryficki","Brojce"]
[null,null,null,null,null,null,null,null,null,null,null,null,null,null,null,null,null,null,null,null,null,null,null,null,null,"gryficki","Gryfice"]
[null,null,null,null,null,null,null,null,null,null,null,null,null,null,null,null,null,null,null,null,null,null,null,null,null,"gryficki","Karnice"]
[null,null,null,null,null,null,null,null,null,null,null,null,null,null,null,null,null,null,null,null,null,null,null,null,null,"gryficki","Płoty"]
[null,null,null,null,null,null,null,null,null,null,null,null,null,null,null,null,null,null,null,null,null,null,null,null,null,"gryficki","Rewal"]
[null,null,null,null,null,null,null,null,null,null,null,null,null,null,null,null,null,null,null,null,null,null,null,null,null,"gryficki","Trzebiatów"]
[null,null,null,null,null,null,null,null,null,null,null,null,null,null,null,null,null,null,null,null,null,null,null,null,null,"gryfiński","Banie"]
[null,null,null,null,null,null,null,null,null,null,null,null,null,null,null,null,null,null,null,null,null,null,null,null,null,"gryfiński","Cedynia"]
[null,null,null,null,null,null,null,null,null,null,null,null,null,null,null,null,null,null,null,null,null,null,null,null,null,"gryfiński","Chojna"]
[null,null,null,null,null,null,null,null,null,null,null,null,null,null,null,null,null,null,null,null,null,null,null,null,null,"gryfiński","Gryfino"]
[null,null,null,null,null,null,null,null,null,null,null,null,null,null,null,null,null,null,null,null,null,null,null,null,null,"gryfiński","Mieszkowice"]
[null,null,null,null,null,null,null,null,null,null,null,null,null,null,null,null,null,null,null,null,null,null,null,null,null,"gryfiński","Moryń"]
[null,null,null,null,null,null,null,null,null,null,null,null,null,null,null,null,null,null,null,null,null,null,null,null,null,"gryfiński","Stare Czarnowo"]
[null,null,null,null,null,null,null,null,null,null,null,null,null,null,null,null,null,null,null,null,null,null,null,null,null,"gryfiński","Trzcińsko-Zdrój"]
[null,null,null,null,null,null,null,null,null,null,null,null,null,null,null,null,null,null,null,null,null,null,null,null,null,"gryfiński","Widuchowa"]
[null,null,null,null,null,null,null,null,null,null,null,null,null,null,null,null,null,null,null,null,null,null,null,null,null,"kamieński","Dziwnów"]
[null,null,null,null,null,null,null,null,null,null,null,null,null,null,null,null,null,null,null,null,null,null,null,null,null,"kamieński","Golczewo"]
[null,null,null,null,null,null,null,null,null,null,null,null,null,null,null,null,null,null,null,null,null,null,null,null,null,"kamieński","Kamień Pomorski"]
[null,null,null,null,null,null,null,null,null,null,null,null,null,null,null,null,null,null,null,null,null,null,null,null,null,"kamieński","Międzyzdroje"]
[null,null,null,null,null,null,null,null,null,null,null,null,null,null,null,null,null,null,null,null,null,null,null,null,null,"kamieński","Świerzno"]
[null,null,null,null,null,null,null,null,null,null,null,null,null,null,null,null,null,null,null,null,null,null,null,null,null,"kamieński","Wolin"]
[null,null,null,null,null,null,null,null,null,null,null,null,null,null,null,null,null,null,null,null,null,null,null,null,null,"policki","Dobra (Szczecińska)"]
[null,null,null,null,null,null,null,null,null,null,null,null,null,null,null,null,null,null,null,null,null,null,null,null,null,"policki","Kołbaskowo"]
[null,null,null,null,null,null,null,null,null,null,null,null,null,null,null,null,null,null,null,null,null,null,null,null,null,"policki","Nowe Warpno"]
[null,null,null,null,null,null,null,null,null,null,null,null,null,null,null,null,null,null,null,null,null,null,null,null,null,"policki","Police"]
[null,null,null,null,null,null,null,null,null,null,null,null,null,null,null,null,null,null,null,null,null,null,null,null,null,"stargardzki","Stargard"]
[null,null,null,null,null,null,null,null,null,null,null,null,null,null,null,null,null,null,null,null,null,null,null,null,null,"stargardzki","Chociwel"]
[null,null,null,null,null,null,null,null,null,null,null,null,null,null,null,null,null,null,null,null,null,null,null,null,null,"stargardzki","Dobrzany"]
[null,null,null,null,null,null,null,null,null,null,null,null,null,null,null,null,null,null,null,null,null,null,null,null,null,"stargardzki","Dolice"]
[null,null,null,null,null,null,null,null,null,null,null,null,null,null,null,null,null,null,null,null,null,null,null,null,null,"stargardzki","Ińsko"]
[null,null,null,null,null,null,null,null,null,null,null,null,null,null,null,null,null,null,null,null,null,null,null,null,null,"stargardzki","Kobylanka"]
[null,null,null,null,null,null,null,null,null,null,null,null,null,null,null,null,null,null,null,null,null,null,null,null,null,"stargardzki","Marianowo"]
[null,null,null,null,null,null,null,null,null,null,null,null,null,null,null,null,null,null,null,null,null,null,null,null,null,"stargardzki","Stara Dąbrowa"]
[null,null,null,null,null,null,null,null,null,null,null,null,null,null,null,null,null,null,null,null,null,null,null,null,null,"stargardzki","Stargard"]
[null,null,null,null,null,null,null,null,null,null,null,null,null,null,null,null,null,null,null,null,null,null,null,null,null,"stargardzki","Suchań"]
[null,null,null,null,null,null,null,null,null,null,null,null,null,null,null,null,null,null,null,null,null,null,null,null,null,"Świnoujście","Świnoujście"]
[null,null,null,null,null,null,null,null,null,null,null,null,null,null,null,null,null,null,null,null,null,null,null,null,null,"bolesławiecki","Bolesławiec"]
[null,null,null,null,null,null,null,null,null,null,null,null,null,null,null,null,null,null,null,null,null,null,null,null,null,"bolesławiecki","Gromadka"]
[null,null,null,null,null,null,null,null,null,null,null,null,null,null,null,null,null,null,null,null,null,null,null,null,null,"bolesławiecki","Nowogrodziec"]
[null,null,null,null,null,null,null,null,null,null,null,null,null,null,null,null,null,null,null,null,null,null,null,null,null,"bolesławiecki","Osiecznica"]
[null,null,null,null,null,null,null,null,null,null,null,null,null,null,null,null,null,null,null,null,null,null,null,null,null,"bolesławiecki","Warta Bolesławiecka"]
[null,null,null,null,null,null,null,null,null,null,null,null,null,null,null,null,null,null,null,null,null,null,null,null,null,"jaworski","Jawor"]
[null,null,null,null,null,null,null,null,null,null,null,null,null,null,null,null,null,null,null,null,null,null,null,null,null,"jaworski","Bolków"]
[null,null,null,null,null,null,null,null,null,null,null,null,null,null,null,null,null,null,null,null,null,null,null,null,null,"jaworski","Męcinka"]
[null,null,null,null,null,null,null,null,null,null,null,null,null,null,null,null,null,null,null,null,null,null,null,null,null,"jaworski","Mściwojów"]
[null,null,null,null,null,null,null,null,null,null,null,null,null,null,null,null,null,null,null,null,null,null,null,null,null,"jaworski","Paszowice"]
[null,null,null,null,null,null,null,null,null,null,null,null,null,null,null,null,null,null,null,null,null,null,null,null,null,"jaworski","Wądroże Wielkie"]
[null,null,null,null,null,null,null,null,null,null,null,null,null,null,null,null,null,null,null,null,null,null,null,null,null,"karkonoski","Karpacz"]
[null,null,null,null,null,null,null,null,null,null,null,null,null,null,null,null,null,null,null,null,null,null,null,null,null,"karkonoski","Kowary"]
[null,null,null,null,null,null,null,null,null,null,null,null,null,null,null,null,null,null,null,null,null,null,null,null,null,"karkonoski","Piechowice"]
[null,null,null,null,null,null,null,null,null,null,null,null,null,null,null,null,null,null,null,null,null,null,null,null,null,"karkonoski","Szklarska Poręba"]
[null,null,null,null,null,null,null,null,null,null,null,null,null,null,null,null,null,null,null,null,null,null,null,null,null,"karkonoski","Janowice Wielkie"]
[null,null,null,null,null,null,null,null,null,null,null,null,null,null,null,null,null,null,null,null,null,null,null,null,null,"karkonoski","Jeżów Sudecki"]
[null,null,null,null,null,null,null,null,null,null,null,null,null,null,null,null,null,null,null,null,null,null,null,null,null,"karkonoski","Mysłakowice"]
[null,null,null,null,null,null,null,null,null,null,null,null,null,null,null,null,null,null,null,null,null,null,null,null,null,"karkonoski","Podgórzyn"]
[null,null,null,null,null,null,null,null,null,null,null,null,null,null,null,null,null,null,null,null,null,null,null,null,null,"karkonoski","Stara Kamienica"]
[null,null,null,null,null,null,null,null,null,null,null,null,null,null,null,null,null,null,null,null,null,null,null,null,null,"kamiennogórski","Kamienna Góra"]
[null,null,null,null,null,null,null,null,null,null,null,null,null,null,null,null,null,null,null,null,null,null,null,null,null,"kamiennogórski","Kamienna Góra"]
[null,null,null,null,null,null,null,null,null,null,null,null,null,null,null,null,null,null,null,null,null,null,null,null,null,"kamiennogórski","Lubawka"]
[null,null,null,null,null,null,null,null,null,null,null,null,null,null,null,null,null,null,null,null,null,null,null,null,null,"kamiennogórski","Marciszów"]
[null,null,null,null,null,null,null,null,null,null,null,null,null,null,null,null,null,null,null,null,null,null,null,null,null,"lubański","Lubań"]
[null,null,null,null,null,null,null,null,null,null,null,null,null,null,null,null,null,null,null,null,null,null,null,null,null,"lubański","Świeradów-Zdrój"]
[null,null,null,null,null,null,null,null,null,null,null,null,null,null,null,null,null,null,null,null,null,null,null,null,null,"lubański","Leśna"]
[null,null,null,null,null,null,null,null,null,null,null,null,null,null,null,null,null,null,null,null,null,null,null,null,null,"lubański","Lubań"]
[null,null,null,null,null,null,null,null,null,null,null,null,null,null,null,null,null,null,null,null,null,null,null,null,null,"lubański","Olszyna"]
[null,null,null,null,null,null,null,null,null,null,null,null,null,null,null,null,null,null,null,null,null,null,null,null,null,"lubański","Platerówka"]
[null,null,null,null,null,null,null,null,null,null,null,null,null,null,null,null,null,null,null,null,null,null,null,null,null,"lubański","Siekierczyn"]
[null,null,null,null,null,null,null,null,null,null,null,null,null,null,null,null,null,null,null,null,null,null,null,null,null,"lwówecki","Gryfów Śląski"]
[null,null,null,null,null,null,null,null,null,null,null,null,null,null,null,null,null,null,null,null,null,null,null,null,null,"lwówecki","Lubomierz"]
[null,null,null,null,null,null,null,null,null,null,null,null,null,null,null,null,null,null,null,null,null,null,null,null,null,"lwówecki","Lwówek Śląski"]
[null,null,null,null,null,null,null,null,null,null,null,null,null,null,null,null,null,null,null,null,null,null,null,null,null,"lwówecki","Mirsk"]
[null,null,null,null,null,null,null,null,null,null,null,null,null,null,null,null,null,null,null,null,null,null,null,null,null,"lwówecki","Wleń"]
[null,null,null,null,null,null,null,null,null,null,null,null,null,null,null,null,null,null,null,null,null,null,null,null,null,"zgorzelecki","Zawidów"]
[null,null,null,null,null,null,null,null,null,null,null,null,null,null,null,null,null,null,null,null,null,null,null,null,null,"zgorzelecki","Zgorzelec"]
[null,null,null,null,null,null,null,null,null,null,null,null,null,null,null,null,null,null,null,null,null,null,null,null,null,"zgorzelecki","Bogatynia"]
[null,null,null,null,null,null,null,null,null,null,null,null,null,null,null,null,null,null,null,null,null,null,null,null,null,"zgorzelecki","Pieńsk"]
[null,null,null,null,null,null,null,null,null,null,null,null,null,null,null,null,null,null,null,null,null,null,null,null,null,"zgorzelecki","Sulików"]
[null,null,null,null,null,null,null,null,null,null,null,null,null,null,null,null,null,null,null,null,null,null,null,null,null,"zgorzelecki","Węgliniec"]
[null,null,null,null,null,null,null,null,null,null,null,null,null,null,null,null,null,null,null,null,null,null,null,null,null,"zgorzelecki","Zgorzelec"]
[null,null,null,null,null,null,null,null,null,null,null,null,null,null,null,null,null,null,null,null,null,null,null,null,null,"złotoryjski","Wojcieszów"]
[null,null,null,null,null,null,null,null,null,null,null,null,null,null,null,null,null,null,null,null,null,null,null,null,null,"złotoryjski","Złotoryja"]
[null,null,null,null,null,null,null,null,null,null,null,null,null,null,null,null,null,null,null,null,null,null,null,null,null,"złotoryjski","Pielgrzymka"]
[null,null,null,null,null,null,null,null,null,null,null,null,null,null,null,null,null,null,null,null,null,null,null,null,null,"złotoryjski","Świerzawa"]
[null,null,null,null,null,null,null,null,null,null,null,null,null,null,null,null,null,null,null,null,null,null,null,null,null,"złotoryjski","Zagrodno"]
[null,null,null,null,null,null,null,null,null,null,null,null,null,null,null,null,null,null,null,null,null,null,null,null,null,"złotoryjski","Złotoryja"]
[null,null,null,null,null,null,null,null,null,null,null,null,null,null,null,null,null,null,null,null,null,null,null,null,null,"Jelenia Góra","Jelenia Góra"]
[null,null,null,null,null,null,null,null,null,null,null,null,null,null,null,null,null,null,null,null,null,null,null,null,null,"głogowski","Głogów"]
[null,null,null,null,null,null,null,null,null,null,null,null,null,null,null,null,null,null,null,null,null,null,null,null,null,"głogowski","Głogów"]
[null,null,null,null,null,null,null,null,null,null,null,null,null,null,null,null,null,null,null,null,null,null,null,null,null,"głogowski","Jerzmanowa"]
[null,null,null,null,null,null,null,null,null,null,null,null,null,null,null,null,null,null,null,null,null,null,null,null,null,"głogowski","Kotla"]
[null,null,null,null,null,null,null,null,null,null,null,null,null,null,null,null,null,null,null,null,null,null,null,null,null,"głogowski","Pęcław"]
[null,null,null,null,null,null,null,null,null,null,null,null,null,null,null,null,null,null,null,null,null,null,null,null,null,"głogowski","Żukowice"]
[null,null,null,null,null,null,null,null,null,null,null,null,null,null,null,null,null,null,null,null,null,null,null,null,null,"górowski","Góra"]
[null,null,null,null,null,null,null,null,null,null,null,null,null,null,null,null,null,null,null,null,null,null,null,null,null,"górowski","Jemielno"]
[null,null,null,null,null,null,null,null,null,null,null,null,null,null,null,null,null,null,null,null,null,null,null,null,null,"górowski","Niechlów"]
[null,null,null,null,null,null,null,null,null,null,null,null,null,null,null,null,null,null,null,null,null,null,null,null,null,"górowski","Wąsosz"]
[null,null,null,null,null,null,null,null,null,null,null,null,null,null,null,null,null,null,null,null,null,null,null,null,null,"legnicki","Chojnów"]
[null,null,null,null,null,null,null,null,null,null,null,null,null,null,null,null,null,null,null,null,null,null,null,null,null,"legnicki","Krotoszyce"]
[null,null,null,null,null,null,null,null,null,null,null,null,null,null,null,null,null,null,null,null,null,null,null,null,null,"legnicki","Kunice"]
[null,null,null,null,null,null,null,null,null,null,null,null,null,null,null,null,null,null,null,null,null,null,null,null,null,"legnicki","Legnickie Pole"]
[null,null,null,null,null,null,null,null,null,null,null,null,null,null,null,null,null,null,null,null,null,null,null,null,null,"legnicki","Miłkowice"]
[null,null,null,null,null,null,null,null,null,null,null,null,null,null,null,null,null,null,null,null,null,null,null,null,null,"legnicki","Prochowice"]
[null,null,null,null,null,null,null,null,null,null,null,null,null,null,null,null,null,null,null,null,null,null,null,null,null,"legnicki","Ruja"]
[null,null,null,null,null,null,null,null,null,null,null,null,null,null,null,null,null,null,null,null,null,null,null,null,null,"lubiński","Lubin"]
[null,null,null,null,null,null,null,null,null,null,null,null,null,null,null,null,null,null,null,null,null,null,null,null,null,"lubiński","Rudna"]
[null,null,null,null,null,null,null,null,null,null,null,null,null,null,null,null,null,null,null,null,null,null,null,null,null,"lubiński","Ścinawa"]
[null,null,null,null,null,null,null,null,null,null,null,null,null,null,null,null,null,null,null,null,null,null,null,null,null,"polkowicki","Chocianów"]
[null,null,null,null,null,null,null,null,null,null,null,null,null,null,null,null,null,null,null,null,null,null,null,null,null,"polkowicki","Gaworzyce"]
[null,null,null,null,null,null,null,null,null,null,null,null,null,null,null,null,null,null,null,null,null,null,null,null,null,"polkowicki","Grębocice"]
[null,null,null,null,null,null,null,null,null,null,null,null,null,null,null,null,null,null,null,null,null,null,null,null,null,"polkowicki","Polkowice"]
[null,null,null,null,null,null,null,null,null,null,null,null,null,null,null,null,null,null,null,null,null,null,null,null,null,"polkowicki","Przemków"]
[null,null,null,null,null,null,null,null,null,null,null,null,null,null,null,null,null,null,null,null,null,null,null,null,null,"polkowicki","Radwanice"]
[null,null,null,null,null,null,null,null,null,null,null,null,null,null,null,null,null,null,null,null,null,null,null,null,null,"Legnica","Legnica"]
[null,null,null,null,null,null,null,null,null,null,null,null,null,null,null,null,null,null,null,null,null,null,null,null,null,"dzierżoniowski","Bielawa"]
[null,null,null,null,null,null,null,null,null,null,null,null,null,null,null,null,null,null,null,null,null,null,null,null,null,"dzierżoniowski","Dzierżoniów"]
[null,null,null,null,null,null,null,null,null,null,null,null,null,null,null,null,null,null,null,null,null,null,null,null,null,"dzierżoniowski","Pieszyce"]
[null,null,null,null,null,null,null,null,null,null,null,null,null,null,null,null,null,null,null,null,null,null,null,null,null,"dzierżoniowski","Piława Górna"]
[null,null,null,null,null,null,null,null,null,null,null,null,null,null,null,null,null,null,null,null,null,null,null,null,null,"dzierżoniowski","Dzierżoniów"]
[null,null,null,null,null,null,null,null,null,null,null,null,null,null,null,null,null,null,null,null,null,null,null,null,null,"dzierżoniowski","Łagiewniki"]
[null,null,null,null,null,null,null,null,null,null,null,null,null,null,null,null,null,null,null,null,null,null,null,null,null,"dzierżoniowski","Niemcza"]
[null,null,null,null,null,null,null,null,null,null,null,null,null,null,null,null,null,null,null,null,null,null,null,null,null,"kłodzki","Duszniki-Zdrój"]
[null,null,null,null,null,null,null,null,null,null,null,null,null,null,null,null,null,null,null,null,null,null,null,null,null,"kłodzki","Kłodzko"]
[null,null,null,null,null,null,null,null,null,null,null,null,null,null,null,null,null,null,null,null,null,null,null,null,null,"kłodzki","Kudowa-Zdrój"]
[null,null,null,null,null,null,null,null,null,null,null,null,null,null,null,null,null,null,null,null,null,null,null,null,null,"kłodzki","Nowa Ruda"]
[null,null,null,null,null,null,null,null,null,null,null,null,null,null,null,null,null,null,null,null,null,null,null,null,null,"kłodzki","Polanica-Zdrój"]
[null,null,null,null,null,null,null,null,null,null,null,null,null,null,null,null,null,null,null,null,null,null,null,null,null,"kłodzki","Bystrzyca Kłodzka"]
[null,null,null,null,null,null,null,null,null,null,null,null,null,null,null,null,null,null,null,null,null,null,null,null,null,"kłodzki","Kłodzko"]
[null,null,null,null,null,null,null,null,null,null,null,null,null,null,null,null,null,null,null,null,null,null,null,null,null,"kłodzki","Lądek-Zdrój"]
[null,null,null,null,null,null,null,null,null,null,null,null,null,null,null,null,null,null,null,null,null,null,null,null,null,"kłodzki","Lewin Kłodzki"]
[null,null,null,null,null,null,null,null,null,null,null,null,null,null,null,null,null,null,null,null,null,null,null,null,null,"kłodzki","Międzylesie"]
[null,null,null,null,null,null,null,null,null,null,null,null,null,null,null,null,null,null,null,null,null,null,null,null,null,"kłodzki","Nowa Ruda"]
[null,null,null,null,null,null,null,null,null,null,null,null,null,null,null,null,null,null,null,null,null,null,null,null,null,"kłodzki","Radków"]
[null,null,null,null,null,null,null,null,null,null,null,null,null,null,null,null,null,null,null,null,null,null,null,null,null,"kłodzki","Stronie Śląskie"]
[null,null,null,null,null,null,null,null,null,null,null,null,null,null,null,null,null,null,null,null,null,null,null,null,null,"kłodzki","Szczytna"]
[null,null,null,null,null,null,null,null,null,null,null,null,null,null,null,null,null,null,null,null,null,null,null,null,null,"świdnicki","Świdnica"]
[null,null,null,null,null,null,null,null,null,null,null,null,null,null,null,null,null,null,null,null,null,null,null,null,null,"świdnicki","Świebodzice"]
[null,null,null,null,null,null,null,null,null,null,null,null,null,null,null,null,null,null,null,null,null,null,null,null,null,"świdnicki","Dobromierz"]
[null,null,null,null,null,null,null,null,null,null,null,null,null,null,null,null,null,null,null,null,null,null,null,null,null,"świdnicki","Jaworzyna Śląska"]
[null,null,null,null,null,null,null,null,null,null,null,null,null,null,null,null,null,null,null,null,null,null,null,null,null,"świdnicki","Marcinowice"]
[null,null,null,null,null,null,null,null,null,null,null,null,null,null,null,null,null,null,null,null,null,null,null,null,null,"świdnicki","Strzegom"]
[null,null,null,null,null,null,null,null,null,null,null,null,null,null,null,null,null,null,null,null,null,null,null,null,null,"świdnicki","Świdnica"]
[null,null,null,null,null,null,null,null,null,null,null,null,null,null,null,null,null,null,null,null,null,null,null,null,null,"świdnicki","Żarów"]
[null,null,null,null,null,null,null,null,null,null,null,null,null,null,null,null,null,null,null,null,null,null,null,null,null,"wałbrzyski","Boguszów-Gorce"]
[null,null,null,null,null,null,null,null,null,null,null,null,null,null,null,null,null,null,null,null,null,null,null,null,null,"wałbrzyski","Jedlina-Zdrój"]
[null,null,null,null,null,null,null,null,null,null,null,null,null,null,null,null,null,null,null,null,null,null,null,null,null,"wałbrzyski","Szczawno-Zdrój"]
[null,null,null,null,null,null,null,null,null,null,null,null,null,null,null,null,null,null,null,null,null,null,null,null,null,"wałbrzyski","Czarny Bór"]
[null,null,null,null,null,null,null,null,null,null,null,null,null,null,null,null,null,null,null,null,null,null,null,null,null,"wałbrzyski","Głuszyca"]
[null,null,null,null,null,null,null,null,null,null,null,null,null,null,null,null,null,null,null,null,null,null,null,null,null,"wałbrzyski","Mieroszów"]
[null,null,null,null,null,null,null,null,null,null,null,null,null,null,null,null,null,null,null,null,null,null,null,null,null,"wałbrzyski","Stare Bogaczowice"]
[null,null,null,null,null,null,null,null,null,null,null,null,null,null,null,null,null,null,null,null,null,null,null,null,null,"wałbrzyski","Walim"]
[null,null,null,null,null,null,null,null,null,null,null,null,null,null,null,null,null,null,null,null,null,null,null,null,null,"ząbkowicki","Bardo"]
[null,null,null,null,null,null,null,null,null,null,null,null,null,null,null,null,null,null,null,null,null,null,null,null,null,"ząbkowicki","Ciepłowody"]
[null,null,null,null,null,null,null,null,null,null,null,null,null,null,null,null,null,null,null,null,null,null,null,null,null,"ząbkowicki","Kamieniec Ząbkowicki"]
[null,null,null,null,null,null,null,null,null,null,null,null,null,null,null,null,null,null,null,null,null,null,null,null,null,"ząbkowicki","Stoszowice"]
[null,null,null,null,null,null,null,null,null,null,null,null,null,null,null,null,null,null,null,null,null,null,null,null,null,"ząbkowicki","Ząbkowice Śląskie"]
[null,null,null,null,null,null,null,null,null,null,null,null,null,null,null,null,null,null,null,null,null,null,null,null,null,"ząbkowicki","Ziębice"]
[null,null,null,null,null,null,null,null,null,null,null,null,null,null,null,null,null,null,null,null,null,null,null,null,null,"ząbkowicki","Złoty Stok"]
[null,null,null,null,null,null,null,null,null,null,null,null,null,null,null,null,null,null,null,null,null,null,null,null,null,"Wałbrzych","Wałbrzych"]
[null,null,null,null,null,null,null,null,null,null,null,null,null,null,null,null,null,null,null,null,null,null,null,null,null,"milicki","Cieszków"]
[null,null,null,null,null,null,null,null,null,null,null,null,null,null,null,null,null,null,null,null,null,null,null,null,null,"milicki","Krośnice"]
[null,null,null,null,null,null,null,null,null,null,null,null,null,null,null,null,null,null,null,null,null,null,null,null,null,"milicki","Milicz"]
[null,null,null,null,null,null,null,null,null,null,null,null,null,null,null,null,null,null,null,null,null,null,null,null,null,"oleśnicki","Oleśnica"]
[null,null,null,null,null,null,null,null,null,null,null,null,null,null,null,null,null,null,null,null,null,null,null,null,null,"oleśnicki","Bierutów"]
[null,null,null,null,null,null,null,null,null,null,null,null,null,null,null,null,null,null,null,null,null,null,null,null,null,"oleśnicki","Dobroszyce"]
[null,null,null,null,null,null,null,null,null,null,null,null,null,null,null,null,null,null,null,null,null,null,null,null,null,"oleśnicki","Dziadowa Kłoda"]
[null,null,null,null,null,null,null,null,null,null,null,null,null,null,null,null,null,null,null,null,null,null,null,null,null,"oleśnicki","Międzybórz"]
[null,null,null,null,null,null,null,null,null,null,null,null,null,null,null,null,null,null,null,null,null,null,null,null,null,"oleśnicki","Oleśnica"]
[null,null,null,null,null,null,null,null,null,null,null,null,null,null,null,null,null,null,null,null,null,null,null,null,null,"oleśnicki","Syców"]
[null,null,null,null,null,null,null,null,null,null,null,null,null,null,null,null,null,null,null,null,null,null,null,null,null,"oleśnicki","Twardogóra"]
[null,null,null,null,null,null,null,null,null,null,null,null,null,null,null,null,null,null,null,null,null,null,null,null,null,"oławski","Oława"]
[null,null,null,null,null,null,null,null,null,null,null,null,null,null,null,null,null,null,null,null,null,null,null,null,null,"oławski","Domaniów"]
[null,null,null,null,null,null,null,null,null,null,null,null,null,null,null,null,null,null,null,null,null,null,null,null,null,"oławski","Jelcz-Laskowice"]
[null,null,null,null,null,null,null,null,null,null,null,null,null,null,null,null,null,null,null,null,null,null,null,null,null,"oławski","Oława"]
[null,null,null,null,null,null,null,null,null,null,null,null,null,null,null,null,null,null,null,null,null,null,null,null,null,"strzeliński","Borów"]
[null,null,null,null,null,null,null,null,null,null,null,null,null,null,null,null,null,null,null,null,null,null,null,null,null,"strzeliński","Kondratowice"]
[null,null,null,null,null,null,null,null,null,null,null,null,null,null,null,null,null,null,null,null,null,null,null,null,null,"strzeliński","Przeworno"]
[null,null,null,null,null,null,null,null,null,null,null,null,null,null,null,null,null,null,null,null,null,null,null,null,null,"strzeliński","Strzelin"]
[null,null,null,null,null,null,null,null,null,null,null,null,null,null,null,null,null,null,null,null,null,null,null,null,null,"strzeliński","Wiązów"]
[null,null,null,null,null,null,null,null,null,null,null,null,null,null,null,null,null,null,null,null,null,null,null,null,null,"średzki","Kostomłoty"]
[null,null,null,null,null,null,null,null,null,null,null,null,null,null,null,null,null,null,null,null,null,null,null,null,null,"średzki","Malczyce"]
[null,null,null,null,null,null,null,null,null,null,null,null,null,null,null,null,null,null,null,null,null,null,null,null,null,"średzki","Miękinia"]
[null,null,null,null,null,null,null,null,null,null,null,null,null,null,null,null,null,null,null,null,null,null,null,null,null,"średzki","Środa Śląska"]
[null,null,null,null,null,null,null,null,null,null,null,null,null,null,null,null,null,null,null,null,null,null,null,null,null,"średzki","Udanin"]
[null,null,null,null,null,null,null,null,null,null,null,null,null,null,null,null,null,null,null,null,null,null,null,null,null,"trzebnicki","Oborniki Śląskie"]
[null,null,null,null,null,null,null,null,null,null,null,null,null,null,null,null,null,null,null,null,null,null,null,null,null,"trzebnicki","Prusice"]
[null,null,null,null,null,null,null,null,null,null,null,null,null,null,null,null,null,null,null,null,null,null,null,null,null,"trzebnicki","Trzebnica"]
[null,null,null,null,null,null,null,null,null,null,null,null,null,null,null,null,null,null,null,null,null,null,null,null,null,"trzebnicki","Wisznia Mała"]
[null,null,null,null,null,null,null,null,null,null,null,null,null,null,null,null,null,null,null,null,null,null,null,null,null,"trzebnicki","Zawonia"]
[null,null,null,null,null,null,null,null,null,null,null,null,null,null,null,null,null,null,null,null,null,null,null,null,null,"trzebnicki","Żmigród"]
[null,null,null,null,null,null,null,null,null,null,null,null,null,null,null,null,null,null,null,null,null,null,null,null,null,"wołowski","Brzeg Dolny"]
[null,null,null,null,null,null,null,null,null,null,null,null,null,null,null,null,null,null,null,null,null,null,null,null,null,"wołowski","Wińsko"]
[null,null,null,null,null,null,null,null,null,null,null,null,null,null,null,null,null,null,null,null,null,null,null,null,null,"wołowski","Wołów"]
[null,null,null,null,null,null,null,null,null,null,null,null,null,null,null,null,null,null,null,null,null,null,null,null,null,"wrocławski","Czernica"]
[null,null,null,null,null,null,null,null,null,null,null,null,null,null,null,null,null,null,null,null,null,null,null,null,null,"wrocławski","Długołęka"]
[null,null,null,null,null,null,null,null,null,null,null,null,null,null,null,null,null,null,null,null,null,null,null,null,null,"wrocławski","Jordanów Śląski"]
[null,null,null,null,null,null,null,null,null,null,null,null,null,null,null,null,null,null,null,null,null,null,null,null,null,"wrocławski","Kąty Wrocławskie"]
[null,null,null,null,null,null,null,null,null,null,null,null,null,null,null,null,null,null,null,null,null,null,null,null,null,"wrocławski","Kobierzyce"]
[null,null,null,null,null,null,null,null,null,null,null,null,null,null,null,null,null,null,null,null,null,null,null,null,null,"wrocławski","Mietków"]
[null,null,null,null,null,null,null,null,null,null,null,null,null,null,null,null,null,null,null,null,null,null,null,null,null,"wrocławski","Sobótka"]
[null,null,null,null,null,null,null,null,null,null,null,null,null,null,null,null,null,null,null,null,null,null,null,null,null,"wrocławski","Siechnice"]
[null,null,null,null,null,null,null,null,null,null,null,null,null,null,null,null,null,null,null,null,null,null,null,null,null,"wrocławski","Żórawina"]
[null,null,null,null,null,null,null,null,null,null,null,null,null,null,null,null,null,null,null,null,null,null,null,null,null,"Wrocław","Wrocław"]
[null,null,null,null,null,null,null,null,null,null,null,null,null,null,null,null,null,null,null,null,null,null,null,null,null,"Wrocław","Wrocław-Fabryczna"]
[null,null,null,null,null,null,null,null,null,null,null,null,null,null,null,null,null,null,null,null,null,null,null,null,null,"Wrocław","Wrocław-Krzyki"]
[null,null,null,null,null,null,null,null,null,null,null,null,null,null,null,null,null,null,null,null,null,null,null,null,null,"Wrocław","Wrocław-Psie Pole"]
[null,null,null,null,null,null,null,null,null,null,null,null,null,null,null,null,null,null,null,null,null,null,null,null,null,"Wrocław","Wrocław-Stare Miasto"]
[null,null,null,null,null,null,null,null,null,null,null,null,null,null,null,null,null,null,null,null,null,null,null,null,null,"Wrocław","Wrocław-Śródmieście"]
[null,null,null,null,null,null,null,null,null,null,null,null,null,null,null,null,null,null,null,null,null,null,null,null,null,"brzeski","Brzeg"]
[null,null,null,null,null,null,null,null,null,null,null,null,null,null,null,null,null,null,null,null,null,null,null,null,null,"brzeski","Skarbimierz"]
[null,null,null,null,null,null,null,null,null,null,null,null,null,null,null,null,null,null,null,null,null,null,null,null,null,"brzeski","Grodków"]
[null,null,null,null,null,null,null,null,null,null,null,null,null,null,null,null,null,null,null,null,null,null,null,null,null,"brzeski","Lewin Brzeski"]
[null,null,null,null,null,null,null,null,null,null,null,null,null,null,null,null,null,null,null,null,null,null,null,null,null,"brzeski","Lubsza"]
[null,null,null,null,null,null,null,null,null,null,null,null,null,null,null,null,null,null,null,null,null,null,null,null,null,"brzeski","Olszanka"]
[null,null,null,null,null,null,null,null,null,null,null,null,null,null,null,null,null,null,null,null,null,null,null,null,null,"głubczycki","Baborów"]
[null,null,null,null,null,null,null,null,null,null,null,null,null,null,null,null,null,null,null,null,null,null,null,null,null,"głubczycki","Branice"]
[null,null,null,null,null,null,null,null,null,null,null,null,null,null,null,null,null,null,null,null,null,null,null,null,null,"głubczycki","Głubczyce"]
[null,null,null,null,null,null,null,null,null,null,null,null,null,null,null,null,null,null,null,null,null,null,null,null,null,"głubczycki","Kietrz"]
[null,null,null,null,null,null,null,null,null,null,null,null,null,null,null,null,null,null,null,null,null,null,null,null,null,"namysłowski","Domaszowice"]
[null,null,null,null,null,null,null,null,null,null,null,null,null,null,null,null,null,null,null,null,null,null,null,null,null,"namysłowski","Namysłów"]
[null,null,null,null,null,null,null,null,null,null,null,null,null,null,null,null,null,null,null,null,null,null,null,null,null,"namysłowski","Pokój"]
[null,null,null,null,null,null,null,null,null,null,null,null,null,null,null,null,null,null,null,null,null,null,null,null,null,"namysłowski","Świerczów"]
[null,null,null,null,null,null,null,null,null,null,null,null,null,null,null,null,null,null,null,null,null,null,null,null,null,"namysłowski","Wilków"]
[null,null,null,null,null,null,null,null,null,null,null,null,null,null,null,null,null,null,null,null,null,null,null,null,null,"nyski","Głuchołazy"]
[null,null,null,null,null,null,null,null,null,null,null,null,null,null,null,null,null,null,null,null,null,null,null,null,null,"nyski","Kamiennik"]
[null,null,null,null,null,null,null,null,null,null,null,null,null,null,null,null,null,null,null,null,null,null,null,null,null,"nyski","Korfantów"]
[null,null,null,null,null,null,null,null,null,null,null,null,null,null,null,null,null,null,null,null,null,null,null,null,null,"nyski","Łambinowice"]
[null,null,null,null,null,null,null,null,null,null,null,null,null,null,null,null,null,null,null,null,null,null,null,null,null,"nyski","Nysa"]
[null,null,null,null,null,null,null,null,null,null,null,null,null,null,null,null,null,null,null,null,null,null,null,null,null,"nyski","Otmuchów"]
[null,null,null,null,null,null,null,null,null,null,null,null,null,null,null,null,null,null,null,null,null,null,null,null,null,"nyski","Paczków"]
[null,null,null,null,null,null,null,null,null,null,null,null,null,null,null,null,null,null,null,null,null,null,null,null,null,"nyski","Pakosławice"]
[null,null,null,null,null,null,null,null,null,null,null,null,null,null,null,null,null,null,null,null,null,null,null,null,null,"nyski","Skoroszyce"]
[null,null,null,null,null,null,null,null,null,null,null,null,null,null,null,null,null,null,null,null,null,null,null,null,null,"prudnicki","Biała"]
[null,null,null,null,null,null,null,null,null,null,null,null,null,null,null,null,null,null,null,null,null,null,null,null,null,"prudnicki","Głogówek"]
[null,null,null,null,null,null,null,null,null,null,null,null,null,null,null,null,null,null,null,null,null,null,null,null,null,"prudnicki","Lubrza"]
[null,null,null,null,null,null,null,null,null,null,null,null,null,null,null,null,null,null,null,null,null,null,null,null,null,"prudnicki","Prudnik"]
[null,null,null,null,null,null,null,null,null,null,null,null,null,null,null,null,null,null,null,null,null,null,null,null,null,"kędzierzyńsko-kozielski","Kędzierzyn-Koźle"]
[null,null,null,null,null,null,null,null,null,null,null,null,null,null,null,null,null,null,null,null,null,null,null,null,null,"kędzierzyńsko-kozielski","Bierawa"]
[null,null,null,null,null,null,null,null,null,null,null,null,null,null,null,null,null,null,null,null,null,null,null,null,null,"kędzierzyńsko-kozielski","Cisek"]
[null,null,null,null,null,null,null,null,null,null,null,null,null,null,null,null,null,null,null,null,null,null,null,null,null,"kędzierzyńsko-kozielski","Pawłowiczki"]
[null,null,null,null,null,null,null,null,null,null,null,null,null,null,null,null,null,null,null,null,null,null,null,null,null,"kędzierzyńsko-kozielski","Polska Cerekiew"]
[null,null,null,null,null,null,null,null,null,null,null,null,null,null,null,null,null,null,null,null,null,null,null,null,null,"kędzierzyńsko-kozielski","Reńska Wieś"]
[null,null,null,null,null,null,null,null,null,null,null,null,null,null,null,null,null,null,null,null,null,null,null,null,null,"kluczborski","Byczyna"]
[null,null,null,null,null,null,null,null,null,null,null,null,null,null,null,null,null,null,null,null,null,null,null,null,null,"kluczborski","Kluczbork"]
[null,null,null,null,null,null,null,null,null,null,null,null,null,null,null,null,null,null,null,null,null,null,null,null,null,"kluczborski","Lasowice Wielkie"]
[null,null,null,null,null,null,null,null,null,null,null,null,null,null,null,null,null,null,null,null,null,null,null,null,null,"kluczborski","Wołczyn"]
[null,null,null,null,null,null,null,null,null,null,null,null,null,null,null,null,null,null,null,null,null,null,null,null,null,"krapkowicki","Gogolin"]
[null,null,null,null,null,null,null,null,null,null,null,null,null,null,null,null,null,null,null,null,null,null,null,null,null,"krapkowicki","Krapkowice"]
[null,null,null,null,null,null,null,null,null,null,null,null,null,null,null,null,null,null,null,null,null,null,null,null,null,"krapkowicki","Strzeleczki"]
[null,null,null,null,null,null,null,null,null,null,null,null,null,null,null,null,null,null,null,null,null,null,null,null,null,"krapkowicki","Walce"]
[null,null,null,null,null,null,null,null,null,null,null,null,null,null,null,null,null,null,null,null,null,null,null,null,null,"krapkowicki","Zdzieszowice"]
[null,null,null,null,null,null,null,null,null,null,null,null,null,null,null,null,null,null,null,null,null,null,null,null,null,"oleski","Dobrodzień"]
[null,null,null,null,null,null,null,null,null,null,null,null,null,null,null,null,null,null,null,null,null,null,null,null,null,"oleski","Gorzów Śląski"]
[null,null,null,null,null,null,null,null,null,null,null,null,null,null,null,null,null,null,null,null,null,null,null,null,null,"oleski","Olesno"]
[null,null,null,null,null,null,null,null,null,null,null,null,null,null,null,null,null,null,null,null,null,null,null,null,null,"oleski","Praszka"]
[null,null,null,null,null,null,null,null,null,null,null,null,null,null,null,null,null,null,null,null,null,null,null,null,null,"oleski","Radłów"]
[null,null,null,null,null,null,null,null,null,null,null,null,null,null,null,null,null,null,null,null,null,null,null,null,null,"oleski","Rudniki"]
[null,null,null,null,null,null,null,null,null,null,null,null,null,null,null,null,null,null,null,null,null,null,null,null,null,"oleski","Zębowice"]
[null,null,null,null,null,null,null,null,null,null,null,null,null,null,null,null,null,null,null,null,null,null,null,null,null,"opolski","Chrząstowice"]
[null,null,null,null,null,null,null,null,null,null,null,null,null,null,null,null,null,null,null,null,null,null,null,null,null,"opolski","Dąbrowa"]
[null,null,null,null,null,null,null,null,null,null,null,null,null,null,null,null,null,null,null,null,null,null,null,null,null,"opolski","Dobrzeń Wielki"]
[null,null,null,null,null,null,null,null,null,null,null,null,null,null,null,null,null,null,null,null,null,null,null,null,null,"opolski","Komprachcice"]
[null,null,null,null,null,null,null,null,null,null,null,null,null,null,null,null,null,null,null,null,null,null,null,null,null,"opolski","Łubniany"]
[null,null,null,null,null,null,null,null,null,null,null,null,null,null,null,null,null,null,null,null,null,null,null,null,null,"opolski","Murów"]
[null,null,null,null,null,null,null,null,null,null,null,null,null,null,null,null,null,null,null,null,null,null,null,null,null,"opolski","Niemodlin"]
[null,null,null,null,null,null,null,null,null,null,null,null,null,null,null,null,null,null,null,null,null,null,null,null,null,"opolski","Ozimek"]
[null,null,null,null,null,null,null,null,null,null,null,null,null,null,null,null,null,null,null,null,null,null,null,null,null,"opolski","Popielów"]
[null,null,null,null,null,null,null,null,null,null,null,null,null,null,null,null,null,null,null,null,null,null,null,null,null,"opolski","Prószków"]
[null,null,null,null,null,null,null,null,null,null,null,null,null,null,null,null,null,null,null,null,null,null,null,null,null,"opolski","Tarnów Opolski"]
[null,null,null,null,null,null,null,null,null,null,null,null,null,null,null,null,null,null,null,null,null,null,null,null,null,"opolski","Tułowice"]
[null,null,null,null,null,null,null,null,null,null,null,null,null,null,null,null,null,null,null,null,null,null,null,null,null,"opolski","Turawa"]
[null,null,null,null,null,null,null,null,null,null,null,null,null,null,null,null,null,null,null,null,null,null,null,null,null,"strzelecki","Izbicko"]
[null,null,null,null,null,null,null,null,null,null,null,null,null,null,null,null,null,null,null,null,null,null,null,null,null,"strzelecki","Jemielnica"]
[null,null,null,null,null,null,null,null,null,null,null,null,null,null,null,null,null,null,null,null,null,null,null,null,null,"strzelecki","Kolonowskie"]
[null,null,null,null,null,null,null,null,null,null,null,null,null,null,null,null,null,null,null,null,null,null,null,null,null,"strzelecki","Leśnica"]
[null,null,null,null,null,null,null,null,null,null,null,null,null,null,null,null,null,null,null,null,null,null,null,null,null,"strzelecki","Strzelce Opolskie"]
[null,null,null,null,null,null,null,null,null,null,null,null,null,null,null,null,null,null,null,null,null,null,null,null,null,"strzelecki","Ujazd"]
[null,null,null,null,null,null,null,null,null,null,null,null,null,null,null,null,null,null,null,null,null,null,null,null,null,"strzelecki","Zawadzkie"]
[null,null,null,null,null,null,null,null,null,null,null,null,null,null,null,null,null,null,null,null,null,null,null,null,null,"Opole","Opole"]
[null,null,null,null,null,null,null,null,null,null,null,null,null,null,null,null,null,null,null,null,null,null,null,null,null,"bydgoski","Białe Błota"]
[null,null,null,null,null,null,null,null,null,null,null,null,null,null,null,null,null,null,null,null,null,null,null,null,null,"bydgoski","Dąbrowa Chełmińska"]
[null,null,null,null,null,null,null,null,null,null,null,null,null,null,null,null,null,null,null,null,null,null,null,null,null,"bydgoski","Dobrcz"]
[null,null,null,null,null,null,null,null,null,null,null,null,null,null,null,null,null,null,null,null,null,null,null,null,null,"bydgoski","Koronowo"]
[null,null,null,null,null,null,null,null,null,null,null,null,null,null,null,null,null,null,null,null,null,null,null,null,null,"bydgoski","Nowa Wieś Wielka"]
[null,null,null,null,null,null,null,null,null,null,null,null,null,null,null,null,null,null,null,null,null,null,null,null,null,"bydgoski","Osielsko"]
[null,null,null,null,null,null,null,null,null,null,null,null,null,null,null,null,null,null,null,null,null,null,null,null,null,"bydgoski","Sicienko"]
[null,null,null,null,null,null,null,null,null,null,null,null,null,null,null,null,null,null,null,null,null,null,null,null,null,"bydgoski","Solec Kujawski"]
[null,null,null,null,null,null,null,null,null,null,null,null,null,null,null,null,null,null,null,null,null,null,null,null,null,"toruński","Chełmża"]
[null,null,null,null,null,null,null,null,null,null,null,null,null,null,null,null,null,null,null,null,null,null,null,null,null,"toruński","Czernikowo"]
[null,null,null,null,null,null,null,null,null,null,null,null,null,null,null,null,null,null,null,null,null,null,null,null,null,"toruński","Lubicz"]
[null,null,null,null,null,null,null,null,null,null,null,null,null,null,null,null,null,null,null,null,null,null,null,null,null,"toruński","Łubianka"]
[null,null,null,null,null,null,null,null,null,null,null,null,null,null,null,null,null,null,null,null,null,null,null,null,null,"toruński","Łysomice"]
[null,null,null,null,null,null,null,null,null,null,null,null,null,null,null,null,null,null,null,null,null,null,null,null,null,"toruński","Obrowo"]
[null,null,null,null,null,null,null,null,null,null,null,null,null,null,null,null,null,null,null,null,null,null,null,null,null,"toruński","Wielka Nieszawka"]
[null,null,null,null,null,null,null,null,null,null,null,null,null,null,null,null,null,null,null,null,null,null,null,null,null,"toruński","Zławieś Wielka"]
[null,null,null,null,null,null,null,null,null,null,null,null,null,null,null,null,null,null,null,null,null,null,null,null,null,"Bydgoszcz","Bydgoszcz"]
[null,null,null,null,null,null,null,null,null,null,null,null,null,null,null,null,null,null,null,null,null,null,null,null,null,"Toruń","Toruń"]
[null,null,null,null,null,null,null,null,null,null,null,null,null,null,null,null,null,null,null,null,null,null,null,null,null,"brodnicki","Brodnica"]
[null,null,null,null,null,null,null,null,null,null,null,null,null,null,null,null,null,null,null,null,null,null,null,null,null,"brodnicki","Bobrowo"]
[null,null,null,null,null,null,null,null,null,null,null,null,null,null,null,null,null,null,null,null,null,null,null,null,null,"brodnicki","Brzozie"]
[null,null,null,null,null,null,null,null,null,null,null,null,null,null,null,null,null,null,null,null,null,null,null,null,null,"brodnicki","Górzno"]
[null,null,null,null,null,null,null,null,null,null,null,null,null,null,null,null,null,null,null,null,null,null,null,null,null,"brodnicki","Bartniczka"]
[null,null,null,null,null,null,null,null,null,null,null,null,null,null,null,null,null,null,null,null,null,null,null,null,null,"brodnicki","Jabłonowo Pomorskie"]
[null,null,null,null,null,null,null,null,null,null,null,null,null,null,null,null,null,null,null,null,null,null,null,null,null,"brodnicki","Osiek"]
[null,null,null,null,null,null,null,null,null,null,null,null,null,null,null,null,null,null,null,null,null,null,null,null,null,"brodnicki","Świedziebnia"]
[null,null,null,null,null,null,null,null,null,null,null,null,null,null,null,null,null,null,null,null,null,null,null,null,null,"brodnicki","Zbiczno"]
[null,null,null,null,null,null,null,null,null,null,null,null,null,null,null,null,null,null,null,null,null,null,null,null,null,"chełmiński","Chełmno"]
[null,null,null,null,null,null,null,null,null,null,null,null,null,null,null,null,null,null,null,null,null,null,null,null,null,"chełmiński","Kijewo Królewskie"]
[null,null,null,null,null,null,null,null,null,null,null,null,null,null,null,null,null,null,null,null,null,null,null,null,null,"chełmiński","Lisewo"]
[null,null,null,null,null,null,null,null,null,null,null,null,null,null,null,null,null,null,null,null,null,null,null,null,null,"chełmiński","Papowo Biskupie"]
[null,null,null,null,null,null,null,null,null,null,null,null,null,null,null,null,null,null,null,null,null,null,null,null,null,"chełmiński","Stolno"]
[null,null,null,null,null,null,null,null,null,null,null,null,null,null,null,null,null,null,null,null,null,null,null,null,null,"chełmiński","Unisław"]
[null,null,null,null,null,null,null,null,null,null,null,null,null,null,null,null,null,null,null,null,null,null,null,null,null,"golubsko-dobrzyński","Ciechocin"]
[null,null,null,null,null,null,null,null,null,null,null,null,null,null,null,null,null,null,null,null,null,null,null,null,null,"golubsko-dobrzyński","Golub-Dobrzyń"]
[null,null,null,null,null,null,null,null,null,null,null,null,null,null,null,null,null,null,null,null,null,null,null,null,null,"golubsko-dobrzyński","Kowalewo Pomorskie"]
[null,null,null,null,null,null,null,null,null,null,null,null,null,null,null,null,null,null,null,null,null,null,null,null,null,"golubsko-dobrzyński","Radomin"]
[null,null,null,null,null,null,null,null,null,null,null,null,null,null,null,null,null,null,null,null,null,null,null,null,null,"golubsko-dobrzyński","Zbójno"]
[null,null,null,null,null,null,null,null,null,null,null,null,null,null,null,null,null,null,null,null,null,null,null,null,null,"grudziądzki","Grudziądz"]
[null,null,null,null,null,null,null,null,null,null,null,null,null,null,null,null,null,null,null,null,null,null,null,null,null,"grudziądzki","Gruta"]
[null,null,null,null,null,null,null,null,null,null,null,null,null,null,null,null,null,null,null,null,null,null,null,null,null,"grudziądzki","Łasin"]
[null,null,null,null,null,null,null,null,null,null,null,null,null,null,null,null,null,null,null,null,null,null,null,null,null,"grudziądzki","Radzyń Chełmiński"]
[null,null,null,null,null,null,null,null,null,null,null,null,null,null,null,null,null,null,null,null,null,null,null,null,null,"grudziądzki","Rogóźno"]
[null,null,null,null,null,null,null,null,null,null,null,null,null,null,null,null,null,null,null,null,null,null,null,null,null,"grudziądzki","Świecie nad Osą"]
[null,null,null,null,null,null,null,null,null,null,null,null,null,null,null,null,null,null,null,null,null,null,null,null,null,"rypiński","Rypin"]
[null,null,null,null,null,null,null,null,null,null,null,null,null,null,null,null,null,null,null,null,null,null,null,null,null,"rypiński","Brzuze"]
[null,null,null,null,null,null,null,null,null,null,null,null,null,null,null,null,null,null,null,null,null,null,null,null,null,"rypiński","Rogowo"]
[null,null,null,null,null,null,null,null,null,null,null,null,null,null,null,null,null,null,null,null,null,null,null,null,null,"rypiński","Skrwilno"]
[null,null,null,null,null,null,null,null,null,null,null,null,null,null,null,null,null,null,null,null,null,null,null,null,null,"rypiński","Wąpielsk"]
[null,null,null,null,null,null,null,null,null,null,null,null,null,null,null,null,null,null,null,null,null,null,null,null,null,"wąbrzeski","Wąbrzeźno"]
[null,null,null,null,null,null,null,null,null,null,null,null,null,null,null,null,null,null,null,null,null,null,null,null,null,"wąbrzeski","Dębowa Łąka"]
[null,null,null,null,null,null,null,null,null,null,null,null,null,null,null,null,null,null,null,null,null,null,null,null,null,"wąbrzeski","Książki"]
[null,null,null,null,null,null,null,null,null,null,null,null,null,null,null,null,null,null,null,null,null,null,null,null,null,"wąbrzeski","Płużnica"]
[null,null,null,null,null,null,null,null,null,null,null,null,null,null,null,null,null,null,null,null,null,null,null,null,null,"wąbrzeski","Ryńsk"]
[null,null,null,null,null,null,null,null,null,null,null,null,null,null,null,null,null,null,null,null,null,null,null,null,null,"Grudziądz","Grudziądz"]
[null,null,null,null,null,null,null,null,null,null,null,null,null,null,null,null,null,null,null,null,null,null,null,null,null,"aleksandrowski","Aleksandrów Kujawski"]
[null,null,null,null,null,null,null,null,null,null,null,null,null,null,null,null,null,null,null,null,null,null,null,null,null,"aleksandrowski","Ciechocinek"]
[null,null,null,null,null,null,null,null,null,null,null,null,null,null,null,null,null,null,null,null,null,null,null,null,null,"aleksandrowski","Nieszawa"]
[null,null,null,null,null,null,null,null,null,null,null,null,null,null,null,null,null,null,null,null,null,null,null,null,null,"aleksandrowski","Bądkowo"]
[null,null,null,null,null,null,null,null,null,null,null,null,null,null,null,null,null,null,null,null,null,null,null,null,null,"aleksandrowski","Koneck"]
[null,null,null,null,null,null,null,null,null,null,null,null,null,null,null,null,null,null,null,null,null,null,null,null,null,"aleksandrowski","Raciążek"]
[null,null,null,null,null,null,null,null,null,null,null,null,null,null,null,null,null,null,null,null,null,null,null,null,null,"aleksandrowski","Waganiec"]
[null,null,null,null,null,null,null,null,null,null,null,null,null,null,null,null,null,null,null,null,null,null,null,null,null,"aleksandrowski","Zakrzewo"]
[null,null,null,null,null,null,null,null,null,null,null,null,null,null,null,null,null,null,null,null,null,null,null,null,null,"lipnowski","Lipno"]
[null,null,null,null,null,null,null,null,null,null,null,null,null,null,null,null,null,null,null,null,null,null,null,null,null,"lipnowski","Bobrowniki"]
[null,null,null,null,null,null,null,null,null,null,null,null,null,null,null,null,null,null,null,null,null,null,null,null,null,"lipnowski","Chrostkowo"]
[null,null,null,null,null,null,null,null,null,null,null,null,null,null,null,null,null,null,null,null,null,null,null,null,null,"lipnowski","Dobrzyń nad Wisłą"]
[null,null,null,null,null,null,null,null,null,null,null,null,null,null,null,null,null,null,null,null,null,null,null,null,null,"lipnowski","Kikół"]
[null,null,null,null,null,null,null,null,null,null,null,null,null,null,null,null,null,null,null,null,null,null,null,null,null,"lipnowski","Lipno"]
[null,null,null,null,null,null,null,null,null,null,null,null,null,null,null,null,null,null,null,null,null,null,null,null,null,"lipnowski","Skępe"]
[null,null,null,null,null,null,null,null,null,null,null,null,null,null,null,null,null,null,null,null,null,null,null,null,null,"lipnowski","Tłuchowo"]
[null,null,null,null,null,null,null,null,null,null,null,null,null,null,null,null,null,null,null,null,null,null,null,null,null,"lipnowski","Wielgie"]
[null,null,null,null,null,null,null,null,null,null,null,null,null,null,null,null,null,null,null,null,null,null,null,null,null,"radziejowski","Radziejów"]
[null,null,null,null,null,null,null,null,null,null,null,null,null,null,null,null,null,null,null,null,null,null,null,null,null,"radziejowski","Bytoń"]
[null,null,null,null,null,null,null,null,null,null,null,null,null,null,null,null,null,null,null,null,null,null,null,null,null,"radziejowski","Dobre"]
[null,null,null,null,null,null,null,null,null,null,null,null,null,null,null,null,null,null,null,null,null,null,null,null,null,"radziejowski","Osięciny"]
[null,null,null,null,null,null,null,null,null,null,null,null,null,null,null,null,null,null,null,null,null,null,null,null,null,"radziejowski","Piotrków Kujawski"]
[null,null,null,null,null,null,null,null,null,null,null,null,null,null,null,null,null,null,null,null,null,null,null,null,null,"radziejowski","Radziejów"]
[null,null,null,null,null,null,null,null,null,null,null,null,null,null,null,null,null,null,null,null,null,null,null,null,null,"radziejowski","Topólka"]
[null,null,null,null,null,null,null,null,null,null,null,null,null,null,null,null,null,null,null,null,null,null,null,null,null,"włocławski","Kowal"]
[null,null,null,null,null,null,null,null,null,null,null,null,null,null,null,null,null,null,null,null,null,null,null,null,null,"włocławski","Baruchowo"]
[null,null,null,null,null,null,null,null,null,null,null,null,null,null,null,null,null,null,null,null,null,null,null,null,null,"włocławski","Boniewo"]
[null,null,null,null,null,null,null,null,null,null,null,null,null,null,null,null,null,null,null,null,null,null,null,null,null,"włocławski","Brześć Kujawski"]
[null,null,null,null,null,null,null,null,null,null,null,null,null,null,null,null,null,null,null,null,null,null,null,null,null,"włocławski","Choceń"]
[null,null,null,null,null,null,null,null,null,null,null,null,null,null,null,null,null,null,null,null,null,null,null,null,null,"włocławski","Chodecz"]
[null,null,null,null,null,null,null,null,null,null,null,null,null,null,null,null,null,null,null,null,null,null,null,null,null,"włocławski","Fabianki"]
[null,null,null,null,null,null,null,null,null,null,null,null,null,null,null,null,null,null,null,null,null,null,null,null,null,"włocławski","Izbica Kujawska"]
[null,null,null,null,null,null,null,null,null,null,null,null,null,null,null,null,null,null,null,null,null,null,null,null,null,"włocławski","Kowal"]
[null,null,null,null,null,null,null,null,null,null,null,null,null,null,null,null,null,null,null,null,null,null,null,null,null,"włocławski","Lubanie"]
[null,null,null,null,null,null,null,null,null,null,null,null,null,null,null,null,null,null,null,null,null,null,null,null,null,"włocławski","Lubień Kujawski"]
[null,null,null,null,null,null,null,null,null,null,null,null,null,null,null,null,null,null,null,null,null,null,null,null,null,"włocławski","Lubraniec"]
[null,null,null,null,null,null,null,null,null,null,null,null,null,null,null,null,null,null,null,null,null,null,null,null,null,"włocławski","Włocławek"]
[null,null,null,null,null,null,null,null,null,null,null,null,null,null,null,null,null,null,null,null,null,null,null,null,null,"Włocławek","Włocławek"]
[null,null,null,null,null,null,null,null,null,null,null,null,null,null,null,null,null,null,null,null,null,null,null,null,null,"inowrocławski","Inowrocław"]
[null,null,null,null,null,null,null,null,null,null,null,null,null,null,null,null,null,null,null,null,null,null,null,null,null,"inowrocławski","Dąbrowa Biskupia"]
[null,null,null,null,null,null,null,null,null,null,null,null,null,null,null,null,null,null,null,null,null,null,null,null,null,"inowrocławski","Gniewkowo"]
[null,null,null,null,null,null,null,null,null,null,null,null,null,null,null,null,null,null,null,null,null,null,null,null,null,"inowrocławski","Inowrocław"]
[null,null,null,null,null,null,null,null,null,null,null,null,null,null,null,null,null,null,null,null,null,null,null,null,null,"inowrocławski","Janikowo"]
[null,null,null,null,null,null,null,null,null,null,null,null,null,null,null,null,null,null,null,null,null,null,null,null,null,"inowrocławski","Kruszwica"]
[null,null,null,null,null,null,null,null,null,null,null,null,null,null,null,null,null,null,null,null,null,null,null,null,null,"inowrocławski","Pakość"]
[null,null,null,null,null,null,null,null,null,null,null,null,null,null,null,null,null,null,null,null,null,null,null,null,null,"inowrocławski","Rojewo"]
[null,null,null,null,null,null,null,null,null,null,null,null,null,null,null,null,null,null,null,null,null,null,null,null,null,"inowrocławski","Złotniki Kujawskie"]
[null,null,null,null,null,null,null,null,null,null,null,null,null,null,null,null,null,null,null,null,null,null,null,null,null,"mogileński","Dąbrowa"]
[null,null,null,null,null,null,null,null,null,null,null,null,null,null,null,null,null,null,null,null,null,null,null,null,null,"mogileński","Jeziora Wielkie"]
[null,null,null,null,null,null,null,null,null,null,null,null,null,null,null,null,null,null,null,null,null,null,null,null,null,"mogileński","Mogilno"]
[null,null,null,null,null,null,null,null,null,null,null,null,null,null,null,null,null,null,null,null,null,null,null,null,null,"mogileński","Strzelno"]
[null,null,null,null,null,null,null,null,null,null,null,null,null,null,null,null,null,null,null,null,null,null,null,null,null,"nakielski","Kcynia"]
[null,null,null,null,null,null,null,null,null,null,null,null,null,null,null,null,null,null,null,null,null,null,null,null,null,"nakielski","Mrocza"]
[null,null,null,null,null,null,null,null,null,null,null,null,null,null,null,null,null,null,null,null,null,null,null,null,null,"nakielski","Nakło nad Notecią"]
[null,null,null,null,null,null,null,null,null,null,null,null,null,null,null,null,null,null,null,null,null,null,null,null,null,"nakielski","Sadki"]
[null,null,null,null,null,null,null,null,null,null,null,null,null,null,null,null,null,null,null,null,null,null,null,null,null,"nakielski","Szubin"]
[null,null,null,null,null,null,null,null,null,null,null,null,null,null,null,null,null,null,null,null,null,null,null,null,null,"żniński","Barcin"]
[null,null,null,null,null,null,null,null,null,null,null,null,null,null,null,null,null,null,null,null,null,null,null,null,null,"żniński","Gąsawa"]
[null,null,null,null,null,null,null,null,null,null,null,null,null,null,null,null,null,null,null,null,null,null,null,null,null,"żniński","Janowiec Wielkopolski"]
[null,null,null,null,null,null,null,null,null,null,null,null,null,null,null,null,null,null,null,null,null,null,null,null,null,"żniński","Łabiszyn"]
[null,null,null,null,null,null,null,null,null,null,null,null,null,null,null,null,null,null,null,null,null,null,null,null,null,"żniński","Rogowo"]
[null,null,null,null,null,null,null,null,null,null,null,null,null,null,null,null,null,null,null,null,null,null,null,null,null,"żniński","Żnin"]
[null,null,null,null,null,null,null,null,null,null,null,null,null,null,null,null,null,null,null,null,null,null,null,null,null,"sępoleński","Kamień Krajeński"]
[null,null,null,null,null,null,null,null,null,null,null,null,null,null,null,null,null,null,null,null,null,null,null,null,null,"sępoleński","Sępólno Krajeńskie"]
[null,null,null,null,null,null,null,null,null,null,null,null,null,null,null,null,null,null,null,null,null,null,null,null,null,"sępoleński","Sośno"]
[null,null,null,null,null,null,null,null,null,null,null,null,null,null,null,null,null,null,null,null,null,null,null,null,null,"sępoleński","Więcbork"]
[null,null,null,null,null,null,null,null,null,null,null,null,null,null,null,null,null,null,null,null,null,null,null,null,null,"świecki","Bukowiec"]
[null,null,null,null,null,null,null,null,null,null,null,null,null,null,null,null,null,null,null,null,null,null,null,null,null,"świecki","Dragacz"]
[null,null,null,null,null,null,null,null,null,null,null,null,null,null,null,null,null,null,null,null,null,null,null,null,null,"świecki","Drzycim"]
[null,null,null,null,null,null,null,null,null,null,null,null,null,null,null,null,null,null,null,null,null,null,null,null,null,"świecki","Jeżewo"]
[null,null,null,null,null,null,null,null,null,null,null,null,null,null,null,null,null,null,null,null,null,null,null,null,null,"świecki","Lniano"]
[null,null,null,null,null,null,null,null,null,null,null,null,null,null,null,null,null,null,null,null,null,null,null,null,null,"świecki","Nowe"]
[null,null,null,null,null,null,null,null,null,null,null,null,null,null,null,null,null,null,null,null,null,null,null,null,null,"świecki","Osie"]
[null,null,null,null,null,null,null,null,null,null,null,null,null,null,null,null,null,null,null,null,null,null,null,null,null,"świecki","Pruszcz"]
[null,null,null,null,null,null,null,null,null,null,null,null,null,null,null,null,null,null,null,null,null,null,null,null,null,"świecki","Świecie"]
[null,null,null,null,null,null,null,null,null,null,null,null,null,null,null,null,null,null,null,null,null,null,null,null,null,"świecki","Świekatowo"]
[null,null,null,null,null,null,null,null,null,null,null,null,null,null,null,null,null,null,null,null,null,null,null,null,null,"świecki","Warlubie"]
[null,null,null,null,null,null,null,null,null,null,null,null,null,null,null,null,null,null,null,null,null,null,null,null,null,"tucholski","Cekcyn"]
[null,null,null,null,null,null,null,null,null,null,null,null,null,null,null,null,null,null,null,null,null,null,null,null,null,"tucholski","Gostycyn"]
[null,null,null,null,null,null,null,null,null,null,null,null,null,null,null,null,null,null,null,null,null,null,null,null,null,"tucholski","Kęsowo"]
[null,null,null,null,null,null,null,null,null,null,null,null,null,null,null,null,null,null,null,null,null,null,null,null,null,"tucholski","Lubiewo"]
[null,null,null,null,null,null,null,null,null,null,null,null,null,null,null,null,null,null,null,null,null,null,null,null,null,"tucholski","Śliwice"]
[null,null,null,null,null,null,null,null,null,null,null,null,null,null,null,null,null,null,null,null,null,null,null,null,null,"tucholski","Tuchola"]
[null,null,null,null,null,null,null,null,null,null,null,null,null,null,null,null,null,null,null,null,null,null,null,null,null,"gdański","Pruszcz Gdański"]
[null,null,null,null,null,null,null,null,null,null,null,null,null,null,null,null,null,null,null,null,null,null,null,null,null,"gdański","Cedry Wielkie"]
[null,null,null,null,null,null,null,null,null,null,null,null,null,null,null,null,null,null,null,null,null,null,null,null,null,"gdański","Kolbudy"]
[null,null,null,null,null,null,null,null,null,null,null,null,null,null,null,null,null,null,null,null,null,null,null,null,null,"gdański","Pruszcz Gdański"]
[null,null,null,null,null,null,null,null,null,null,null,null,null,null,null,null,null,null,null,null,null,null,null,null,null,"gdański","Przywidz"]
[null,null,null,null,null,null,null,null,null,null,null,null,null,null,null,null,null,null,null,null,null,null,null,null,null,"gdański","Pszczółki"]
[null,null,null,null,null,null,null,null,null,null,null,null,null,null,null,null,null,null,null,null,null,null,null,null,null,"gdański","Suchy Dąb"]
[null,null,null,null,null,null,null,null,null,null,null,null,null,null,null,null,null,null,null,null,null,null,null,null,null,"gdański","Trąbki Wielkie"]
[null,null,null,null,null,null,null,null,null,null,null,null,null,null,null,null,null,null,null,null,null,null,null,null,null,"kartuski","Chmielno"]
[null,null,null,null,null,null,null,null,null,null,null,null,null,null,null,null,null,null,null,null,null,null,null,null,null,"kartuski","Kartuzy"]
[null,null,null,null,null,null,null,null,null,null,null,null,null,null,null,null,null,null,null,null,null,null,null,null,null,"kartuski","Przodkowo"]
[null,null,null,null,null,null,null,null,null,null,null,null,null,null,null,null,null,null,null,null,null,null,null,null,null,"kartuski","Sierakowice"]
[null,null,null,null,null,null,null,null,null,null,null,null,null,null,null,null,null,null,null,null,null,null,null,null,null,"kartuski","Somonino"]
[null,null,null,null,null,null,null,null,null,null,null,null,null,null,null,null,null,null,null,null,null,null,null,null,null,"kartuski","Stężyca"]
[null,null,null,null,null,null,null,null,null,null,null,null,null,null,null,null,null,null,null,null,null,null,null,null,null,"kartuski","Sulęczyno"]
[null,null,null,null,null,null,null,null,null,null,null,null,null,null,null,null,null,null,null,null,null,null,null,null,null,"kartuski","Żukowo"]
[null,null,null,null,null,null,null,null,null,null,null,null,null,null,null,null,null,null,null,null,null,null,null,null,null,"nowodworski","Krynica Morska"]
[null,null,null,null,null,null,null,null,null,null,null,null,null,null,null,null,null,null,null,null,null,null,null,null,null,"nowodworski","Nowy Dwór Gdański"]
[null,null,null,null,null,null,null,null,null,null,null,null,null,null,null,null,null,null,null,null,null,null,null,null,null,"nowodworski","Ostaszewo"]
[null,null,null,null,null,null,null,null,null,null,null,null,null,null,null,null,null,null,null,null,null,null,null,null,null,"nowodworski","Stegna"]
[null,null,null,null,null,null,null,null,null,null,null,null,null,null,null,null,null,null,null,null,null,null,null,null,null,"nowodworski","Sztutowo"]
[null,null,null,null,null,null,null,null,null,null,null,null,null,null,null,null,null,null,null,null,null,null,null,null,null,"pucki","Hel"]
[null,null,null,null,null,null,null,null,null,null,null,null,null,null,null,null,null,null,null,null,null,null,null,null,null,"pucki","Jastarnia"]
[null,null,null,null,null,null,null,null,null,null,null,null,null,null,null,null,null,null,null,null,null,null,null,null,null,"pucki","Puck"]
[null,null,null,null,null,null,null,null,null,null,null,null,null,null,null,null,null,null,null,null,null,null,null,null,null,"pucki","Władysławowo"]
[null,null,null,null,null,null,null,null,null,null,null,null,null,null,null,null,null,null,null,null,null,null,null,null,null,"pucki","Kosakowo"]
[null,null,null,null,null,null,null,null,null,null,null,null,null,null,null,null,null,null,null,null,null,null,null,null,null,"pucki","Krokowa"]
[null,null,null,null,null,null,null,null,null,null,null,null,null,null,null,null,null,null,null,null,null,null,null,null,null,"pucki","Puck"]
[null,null,null,null,null,null,null,null,null,null,null,null,null,null,null,null,null,null,null,null,null,null,null,null,null,"wejherowski","Reda"]
[null,null,null,null,null,null,null,null,null,null,null,null,null,null,null,null,null,null,null,null,null,null,null,null,null,"wejherowski","Rumia"]
[null,null,null,null,null,null,null,null,null,null,null,null,null,null,null,null,null,null,null,null,null,null,null,null,null,"wejherowski","Wejherowo"]
[null,null,null,null,null,null,null,null,null,null,null,null,null,null,null,null,null,null,null,null,null,null,null,null,null,"wejherowski","Choczewo"]
[null,null,null,null,null,null,null,null,null,null,null,null,null,null,null,null,null,null,null,null,null,null,null,null,null,"wejherowski","Gniewino"]
[null,null,null,null,null,null,null,null,null,null,null,null,null,null,null,null,null,null,null,null,null,null,null,null,null,"wejherowski","Linia"]
[null,null,null,null,null,null,null,null,null,null,null,null,null,null,null,null,null,null,null,null,null,null,null,null,null,"wejherowski","Luzino"]
[null,null,null,null,null,null,null,null,null,null,null,null,null,null,null,null,null,null,null,null,null,null,null,null,null,"wejherowski","Łęczyce"]
[null,null,null,null,null,null,null,null,null,null,null,null,null,null,null,null,null,null,null,null,null,null,null,null,null,"wejherowski","Szemud"]
[null,null,null,null,null,null,null,null,null,null,null,null,null,null,null,null,null,null,null,null,null,null,null,null,null,"wejherowski","Wejherowo"]
[null,null,null,null,null,null,null,null,null,null,null,null,null,null,null,null,null,null,null,null,null,null,null,null,null,"bytowski","Borzytuchom"]
[null,null,null,null,null,null,null,null,null,null,null,null,null,null,null,null,null,null,null,null,null,null,null,null,null,"bytowski","Bytów"]
[null,null,null,null,null,null,null,null,null,null,null,null,null,null,null,null,null,null,null,null,null,null,null,null,null,"bytowski","Czarna Dąbrówka"]
[null,null,null,null,null,null,null,null,null,null,null,null,null,null,null,null,null,null,null,null,null,null,null,null,null,"bytowski","Kołczygłowy"]
[null,null,null,null,null,null,null,null,null,null,null,null,null,null,null,null,null,null,null,null,null,null,null,null,null,"bytowski","Lipnica"]
[null,null,null,null,null,null,null,null,null,null,null,null,null,null,null,null,null,null,null,null,null,null,null,null,null,"bytowski","Miastko"]
[null,null,null,null,null,null,null,null,null,null,null,null,null,null,null,null,null,null,null,null,null,null,null,null,null,"bytowski","Parchowo"]
[null,null,null,null,null,null,null,null,null,null,null,null,null,null,null,null,null,null,null,null,null,null,null,null,null,"bytowski","Studzienice"]
[null,null,null,null,null,null,null,null,null,null,null,null,null,null,null,null,null,null,null,null,null,null,null,null,null,"bytowski","Trzebielino"]
[null,null,null,null,null,null,null,null,null,null,null,null,null,null,null,null,null,null,null,null,null,null,null,null,null,"bytowski","Tuchomie"]
[null,null,null,null,null,null,null,null,null,null,null,null,null,null,null,null,null,null,null,null,null,null,null,null,null,"lęborski","Lębork"]
[null,null,null,null,null,null,null,null,null,null,null,null,null,null,null,null,null,null,null,null,null,null,null,null,null,"lęborski","Łeba"]
[null,null,null,null,null,null,null,null,null,null,null,null,null,null,null,null,null,null,null,null,null,null,null,null,null,"lęborski","Cewice"]
[null,null,null,null,null,null,null,null,null,null,null,null,null,null,null,null,null,null,null,null,null,null,null,null,null,"lęborski","Nowa Wieś Lęborska"]
[null,null,null,null,null,null,null,null,null,null,null,null,null,null,null,null,null,null,null,null,null,null,null,null,null,"lęborski","Wicko"]
[null,null,null,null,null,null,null,null,null,null,null,null,null,null,null,null,null,null,null,null,null,null,null,null,null,"słupski","Ustka"]
[null,null,null,null,null,null,null,null,null,null,null,null,null,null,null,null,null,null,null,null,null,null,null,null,null,"słupski","Damnica"]
[null,null,null,null,null,null,null,null,null,null,null,null,null,null,null,null,null,null,null,null,null,null,null,null,null,"słupski","Dębnica Kaszubska"]
[null,null,null,null,null,null,null,null,null,null,null,null,null,null,null,null,null,null,null,null,null,null,null,null,null,"słupski","Główczyce"]
[null,null,null,null,null,null,null,null,null,null,null,null,null,null,null,null,null,null,null,null,null,null,null,null,null,"słupski","Kępice"]
[null,null,null,null,null,null,null,null,null,null,null,null,null,null,null,null,null,null,null,null,null,null,null,null,null,"słupski","Kobylnica"]
[null,null,null,null,null,null,null,null,null,null,null,null,null,null,null,null,null,null,null,null,null,null,null,null,null,"słupski","Potęgowo"]
[null,null,null,null,null,null,null,null,null,null,null,null,null,null,null,null,null,null,null,null,null,null,null,null,null,"słupski","Słupsk"]
[null,null,null,null,null,null,null,null,null,null,null,null,null,null,null,null,null,null,null,null,null,null,null,null,null,"słupski","Smołdzino"]
[null,null,null,null,null,null,null,null,null,null,null,null,null,null,null,null,null,null,null,null,null,null,null,null,null,"słupski","Ustka"]
[null,null,null,null,null,null,null,null,null,null,null,null,null,null,null,null,null,null,null,null,null,null,null,null,null,"Słupsk","Słupsk"]
[null,null,null,null,null,null,null,null,null,null,null,null,null,null,null,null,null,null,null,null,null,null,null,null,null,"kwidzyński","Kwidzyn"]
[null,null,null,null,null,null,null,null,null,null,null,null,null,null,null,null,null,null,null,null,null,null,null,null,null,"kwidzyński","Gardeja"]
[null,null,null,null,null,null,null,null,null,null,null,null,null,null,null,null,null,null,null,null,null,null,null,null,null,"kwidzyński","Kwidzyn"]
[null,null,null,null,null,null,null,null,null,null,null,null,null,null,null,null,null,null,null,null,null,null,null,null,null,"kwidzyński","Prabuty"]
[null,null,null,null,null,null,null,null,null,null,null,null,null,null,null,null,null,null,null,null,null,null,null,null,null,"kwidzyński","Ryjewo"]
[null,null,null,null,null,null,null,null,null,null,null,null,null,null,null,null,null,null,null,null,null,null,null,null,null,"kwidzyński","Sadlinki"]
[null,null,null,null,null,null,null,null,null,null,null,null,null,null,null,null,null,null,null,null,null,null,null,null,null,"malborski","Malbork"]
[null,null,null,null,null,null,null,null,null,null,null,null,null,null,null,null,null,null,null,null,null,null,null,null,null,"malborski","Lichnowy"]
[null,null,null,null,null,null,null,null,null,null,null,null,null,null,null,null,null,null,null,null,null,null,null,null,null,"malborski","Malbork"]
[null,null,null,null,null,null,null,null,null,null,null,null,null,null,null,null,null,null,null,null,null,null,null,null,null,"malborski","Miłoradz"]
[null,null,null,null,null,null,null,null,null,null,null,null,null,null,null,null,null,null,null,null,null,null,null,null,null,"malborski","Nowy Staw"]
[null,null,null,null,null,null,null,null,null,null,null,null,null,null,null,null,null,null,null,null,null,null,null,null,null,"malborski","Stare Pole"]
[null,null,null,null,null,null,null,null,null,null,null,null,null,null,null,null,null,null,null,null,null,null,null,null,null,"starogardzki","Czarna Woda"]
[null,null,null,null,null,null,null,null,null,null,null,null,null,null,null,null,null,null,null,null,null,null,null,null,null,"starogardzki","Skórcz"]
[null,null,null,null,null,null,null,null,null,null,null,null,null,null,null,null,null,null,null,null,null,null,null,null,null,"starogardzki","Starogard Gdański"]
[null,null,null,null,null,null,null,null,null,null,null,null,null,null,null,null,null,null,null,null,null,null,null,null,null,"starogardzki","Bobowo"]
[null,null,null,null,null,null,null,null,null,null,null,null,null,null,null,null,null,null,null,null,null,null,null,null,null,"starogardzki","Kaliska"]
[null,null,null,null,null,null,null,null,null,null,null,null,null,null,null,null,null,null,null,null,null,null,null,null,null,"starogardzki","Lubichowo"]
[null,null,null,null,null,null,null,null,null,null,null,null,null,null,null,null,null,null,null,null,null,null,null,null,null,"starogardzki","Osieczna"]
[null,null,null,null,null,null,null,null,null,null,null,null,null,null,null,null,null,null,null,null,null,null,null,null,null,"starogardzki","Osiek"]
[null,null,null,null,null,null,null,null,null,null,null,null,null,null,null,null,null,null,null,null,null,null,null,null,null,"starogardzki","Skarszewy"]
[null,null,null,null,null,null,null,null,null,null,null,null,null,null,null,null,null,null,null,null,null,null,null,null,null,"starogardzki","Skórcz"]
[null,null,null,null,null,null,null,null,null,null,null,null,null,null,null,null,null,null,null,null,null,null,null,null,null,"starogardzki","Smętowo Graniczne"]
[null,null,null,null,null,null,null,null,null,null,null,null,null,null,null,null,null,null,null,null,null,null,null,null,null,"starogardzki","Starogard Gdański"]
[null,null,null,null,null,null,null,null,null,null,null,null,null,null,null,null,null,null,null,null,null,null,null,null,null,"starogardzki","Zblewo"]
[null,null,null,null,null,null,null,null,null,null,null,null,null,null,null,null,null,null,null,null,null,null,null,null,null,"tczewski","Gniew"]
[null,null,null,null,null,null,null,null,null,null,null,null,null,null,null,null,null,null,null,null,null,null,null,null,null,"tczewski","Morzeszczyn"]
[null,null,null,null,null,null,null,null,null,null,null,null,null,null,null,null,null,null,null,null,null,null,null,null,null,"tczewski","Pelplin"]
[null,null,null,null,null,null,null,null,null,null,null,null,null,null,null,null,null,null,null,null,null,null,null,null,null,"tczewski","Subkowy"]
[null,null,null,null,null,null,null,null,null,null,null,null,null,null,null,null,null,null,null,null,null,null,null,null,null,"tczewski","Tczew"]
[null,null,null,null,null,null,null,null,null,null,null,null,null,null,null,null,null,null,null,null,null,null,null,null,null,"sztumski","Dzierzgoń"]
[null,null,null,null,null,null,null,null,null,null,null,null,null,null,null,null,null,null,null,null,null,null,null,null,null,"sztumski","Mikołajki Pomorskie"]
[null,null,null,null,null,null,null,null,null,null,null,null,null,null,null,null,null,null,null,null,null,null,null,null,null,"sztumski","Stary Dzierzgoń"]
[null,null,null,null,null,null,null,null,null,null,null,null,null,null,null,null,null,null,null,null,null,null,null,null,null,"sztumski","Stary Targ"]
[null,null,null,null,null,null,null,null,null,null,null,null,null,null,null,null,null,null,null,null,null,null,null,null,null,"sztumski","Sztum"]
[null,null,null,null,null,null,null,null,null,null,null,null,null,null,null,null,null,null,null,null,null,null,null,null,null,"Gdańsk","Gdańsk"]
[null,null,null,null,null,null,null,null,null,null,null,null,null,null,null,null,null,null,null,null,null,null,null,null,null,"Gdynia","Gdynia"]
[null,null,null,null,null,null,null,null,null,null,null,null,null,null,null,null,null,null,null,null,null,null,null,null,null,"Sopot","Sopot"]
[null,null,null,null,null,null,null,null,null,null,null,null,null,null,null,null,null,null,null,null,null,null,null,null,null,"chojnicki","Chojnice"]
[null,null,null,null,null,null,null,null,null,null,null,null,null,null,null,null,null,null,null,null,null,null,null,null,null,"chojnicki","Brusy"]
[null,null,null,null,null,null,null,null,null,null,null,null,null,null,null,null,null,null,null,null,null,null,null,null,null,"chojnicki","Czersk"]
[null,null,null,null,null,null,null,null,null,null,null,null,null,null,null,null,null,null,null,null,null,null,null,null,null,"chojnicki","Konarzyny"]
[null,null,null,null,null,null,null,null,null,null,null,null,null,null,null,null,null,null,null,null,null,null,null,null,null,"człuchowski","Człuchów"]
[null,null,null,null,null,null,null,null,null,null,null,null,null,null,null,null,null,null,null,null,null,null,null,null,null,"człuchowski","Czarne"]
[null,null,null,null,null,null,null,null,null,null,null,null,null,null,null,null,null,null,null,null,null,null,null,null,null,"człuchowski","Debrzno"]
[null,null,null,null,null,null,null,null,null,null,null,null,null,null,null,null,null,null,null,null,null,null,null,null,null,"człuchowski","Koczała"]
[null,null,null,null,null,null,null,null,null,null,null,null,null,null,null,null,null,null,null,null,null,null,null,null,null,"człuchowski","Przechlewo"]
[null,null,null,null,null,null,null,null,null,null,null,null,null,null,null,null,null,null,null,null,null,null,null,null,null,"człuchowski","Rzeczenica"]
[null,null,null,null,null,null,null,null,null,null,null,null,null,null,null,null,null,null,null,null,null,null,null,null,null,"kościerski","Kościerzyna"]
[null,null,null,null,null,null,null,null,null,null,null,null,null,null,null,null,null,null,null,null,null,null,null,null,null,"kościerski","Dziemiany"]
[null,null,null,null,null,null,null,null,null,null,null,null,null,null,null,null,null,null,null,null,null,null,null,null,null,"kościerski","Karsin"]
[null,null,null,null,null,null,null,null,null,null,null,null,null,null,null,null,null,null,null,null,null,null,null,null,null,"kościerski","Kościerzyna"]
[null,null,null,null,null,null,null,null,null,null,null,null,null,null,null,null,null,null,null,null,null,null,null,null,null,"kościerski","Liniewo"]
[null,null,null,null,null,null,null,null,null,null,null,null,null,null,null,null,null,null,null,null,null,null,null,null,null,"kościerski","Lipusz"]
[null,null,null,null,null,null,null,null,null,null,null,null,null,null,null,null,null,null,null,null,null,null,null,null,null,"kościerski","Nowa Karczma"]
[null,null,null,null,null,null,null,null,null,null,null,null,null,null,null,null,null,null,null,null,null,null,null,null,null,"kościerski","Stara Kiszewa"]
[null,null,null,null,null,null,null,null,null,null,null,null,null,null,null,null,null,null,null,null,null,null,null,null,null,"braniewski","Braniewo"]
[null,null,null,null,null,null,null,null,null,null,null,null,null,null,null,null,null,null,null,null,null,null,null,null,null,"braniewski","Frombork"]
[null,null,null,null,null,null,null,null,null,null,null,null,null,null,null,null,null,null,null,null,null,null,null,null,null,"braniewski","Lelkowo"]
[null,null,null,null,null,null,null,null,null,null,null,null,null,null,null,null,null,null,null,null,null,null,null,null,null,"braniewski","Pieniężno"]
[null,null,null,null,null,null,null,null,null,null,null,null,null,null,null,null,null,null,null,null,null,null,null,null,null,"braniewski","Płoskinia"]
[null,null,null,null,null,null,null,null,null,null,null,null,null,null,null,null,null,null,null,null,null,null,null,null,null,"braniewski","Wilczęta"]
[null,null,null,null,null,null,null,null,null,null,null,null,null,null,null,null,null,null,null,null,null,null,null,null,null,"działdowski","Działdowo"]
[null,null,null,null,null,null,null,null,null,null,null,null,null,null,null,null,null,null,null,null,null,null,null,null,null,"działdowski","Iłowo-Osada"]
[null,null,null,null,null,null,null,null,null,null,null,null,null,null,null,null,null,null,null,null,null,null,null,null,null,"działdowski","Lidzbark"]
[null,null,null,null,null,null,null,null,null,null,null,null,null,null,null,null,null,null,null,null,null,null,null,null,null,"działdowski","Płośnica"]
[null,null,null,null,null,null,null,null,null,null,null,null,null,null,null,null,null,null,null,null,null,null,null,null,null,"działdowski","Rybno"]
[null,null,null,null,null,null,null,null,null,null,null,null,null,null,null,null,null,null,null,null,null,null,null,null,null,"elbląski","Elbląg"]
[null,null,null,null,null,null,null,null,null,null,null,null,null,null,null,null,null,null,null,null,null,null,null,null,null,"elbląski","Godkowo"]
[null,null,null,null,null,null,null,null,null,null,null,null,null,null,null,null,null,null,null,null,null,null,null,null,null,"elbląski","Gronowo Elbląskie"]
[null,null,null,null,null,null,null,null,null,null,null,null,null,null,null,null,null,null,null,null,null,null,null,null,null,"elbląski","Markusy"]
[null,null,null,null,null,null,null,null,null,null,null,null,null,null,null,null,null,null,null,null,null,null,null,null,null,"elbląski","Milejewo"]
[null,null,null,null,null,null,null,null,null,null,null,null,null,null,null,null,null,null,null,null,null,null,null,null,null,"elbląski","Młynary"]
[null,null,null,null,null,null,null,null,null,null,null,null,null,null,null,null,null,null,null,null,null,null,null,null,null,"elbląski","Pasłęk"]
[null,null,null,null,null,null,null,null,null,null,null,null,null,null,null,null,null,null,null,null,null,null,null,null,null,"elbląski","Rychliki"]
[null,null,null,null,null,null,null,null,null,null,null,null,null,null,null,null,null,null,null,null,null,null,null,null,null,"elbląski","Tolkmicko"]
[null,null,null,null,null,null,null,null,null,null,null,null,null,null,null,null,null,null,null,null,null,null,null,null,null,"iławski","Iława"]
[null,null,null,null,null,null,null,null,null,null,null,null,null,null,null,null,null,null,null,null,null,null,null,null,null,"iławski","Lubawa"]
[null,null,null,null,null,null,null,null,null,null,null,null,null,null,null,null,null,null,null,null,null,null,null,null,null,"iławski","Iława"]
[null,null,null,null,null,null,null,null,null,null,null,null,null,null,null,null,null,null,null,null,null,null,null,null,null,"iławski","Kisielice"]
[null,null,null,null,null,null,null,null,null,null,null,null,null,null,null,null,null,null,null,null,null,null,null,null,null,"iławski","Lubawa"]
[null,null,null,null,null,null,null,null,null,null,null,null,null,null,null,null,null,null,null,null,null,null,null,null,null,"iławski","Susz"]
[null,null,null,null,null,null,null,null,null,null,null,null,null,null,null,null,null,null,null,null,null,null,null,null,null,"iławski","Zalewo"]
[null,null,null,null,null,null,null,null,null,null,null,null,null,null,null,null,null,null,null,null,null,null,null,null,null,"nowomiejski","Nowe Miasto Lubawskie"]
[null,null,null,null,null,null,null,null,null,null,null,null,null,null,null,null,null,null,null,null,null,null,null,null,null,"nowomiejski","Biskupiec"]
[null,null,null,null,null,null,null,null,null,null,null,null,null,null,null,null,null,null,null,null,null,null,null,null,null,"nowomiejski","Grodziczno"]
[null,null,null,null,null,null,null,null,null,null,null,null,null,null,null,null,null,null,null,null,null,null,null,null,null,"nowomiejski","Kurzętnik"]
[null,null,null,null,null,null,null,null,null,null,null,null,null,null,null,null,null,null,null,null,null,null,null,null,null,"ostródzki","Ostróda"]
[null,null,null,null,null,null,null,null,null,null,null,null,null,null,null,null,null,null,null,null,null,null,null,null,null,"ostródzki","Dąbrówno"]
[null,null,null,null,null,null,null,null,null,null,null,null,null,null,null,null,null,null,null,null,null,null,null,null,null,"ostródzki","Grunwald"]
[null,null,null,null,null,null,null,null,null,null,null,null,null,null,null,null,null,null,null,null,null,null,null,null,null,"ostródzki","Łukta"]
[null,null,null,null,null,null,null,null,null,null,null,null,null,null,null,null,null,null,null,null,null,null,null,null,null,"ostródzki","Małdyty"]
[null,null,null,null,null,null,null,null,null,null,null,null,null,null,null,null,null,null,null,null,null,null,null,null,null,"ostródzki","Miłomłyn"]
[null,null,null,null,null,null,null,null,null,null,null,null,null,null,null,null,null,null,null,null,null,null,null,null,null,"ostródzki","Morąg"]
[null,null,null,null,null,null,null,null,null,null,null,null,null,null,null,null,null,null,null,null,null,null,null,null,null,"ostródzki","Ostróda"]
[null,null,null,null,null,null,null,null,null,null,null,null,null,null,null,null,null,null,null,null,null,null,null,null,null,"Elbląg","Elbląg"]
[null,null,null,null,null,null,null,null,null,null,null,null,null,null,null,null,null,null,null,null,null,null,null,null,null,"ełcki","Ełk"]
[null,null,null,null,null,null,null,null,null,null,null,null,null,null,null,null,null,null,null,null,null,null,null,null,null,"ełcki","Kalinowo"]
[null,null,null,null,null,null,null,null,null,null,null,null,null,null,null,null,null,null,null,null,null,null,null,null,null,"ełcki","Prostki"]
[null,null,null,null,null,null,null,null,null,null,null,null,null,null,null,null,null,null,null,null,null,null,null,null,null,"ełcki","Stare Juchy"]
[null,null,null,null,null,null,null,null,null,null,null,null,null,null,null,null,null,null,null,null,null,null,null,null,null,"giżycki","Giżycko"]
[null,null,null,null,null,null,null,null,null,null,null,null,null,null,null,null,null,null,null,null,null,null,null,null,null,"giżycki","Kruklanki"]
[null,null,null,null,null,null,null,null,null,null,null,null,null,null,null,null,null,null,null,null,null,null,null,null,null,"giżycki","Miłki"]
[null,null,null,null,null,null,null,null,null,null,null,null,null,null,null,null,null,null,null,null,null,null,null,null,null,"giżycki","Ryn"]
[null,null,null,null,null,null,null,null,null,null,null,null,null,null,null,null,null,null,null,null,null,null,null,null,null,"giżycki","Wydminy"]
[null,null,null,null,null,null,null,null,null,null,null,null,null,null,null,null,null,null,null,null,null,null,null,null,null,"olecki","Kowale Oleckie"]
[null,null,null,null,null,null,null,null,null,null,null,null,null,null,null,null,null,null,null,null,null,null,null,null,null,"olecki","Olecko"]
[null,null,null,null,null,null,null,null,null,null,null,null,null,null,null,null,null,null,null,null,null,null,null,null,null,"olecki","Świętajno"]
[null,null,null,null,null,null,null,null,null,null,null,null,null,null,null,null,null,null,null,null,null,null,null,null,null,"olecki","Wieliczki"]
[null,null,null,null,null,null,null,null,null,null,null,null,null,null,null,null,null,null,null,null,null,null,null,null,null,"piski","Biała Piska"]
[null,null,null,null,null,null,null,null,null,null,null,null,null,null,null,null,null,null,null,null,null,null,null,null,null,"piski","Orzysz"]
[null,null,null,null,null,null,null,null,null,null,null,null,null,null,null,null,null,null,null,null,null,null,null,null,null,"piski","Pisz"]
[null,null,null,null,null,null,null,null,null,null,null,null,null,null,null,null,null,null,null,null,null,null,null,null,null,"piski","Ruciane-Nida"]
[null,null,null,null,null,null,null,null,null,null,null,null,null,null,null,null,null,null,null,null,null,null,null,null,null,"gołdapski","Banie Mazurskie"]
[null,null,null,null,null,null,null,null,null,null,null,null,null,null,null,null,null,null,null,null,null,null,null,null,null,"gołdapski","Dubeninki"]
[null,null,null,null,null,null,null,null,null,null,null,null,null,null,null,null,null,null,null,null,null,null,null,null,null,"gołdapski","Gołdap"]
[null,null,null,null,null,null,null,null,null,null,null,null,null,null,null,null,null,null,null,null,null,null,null,null,null,"węgorzewski","Budry"]
[null,null,null,null,null,null,null,null,null,null,null,null,null,null,null,null,null,null,null,null,null,null,null,null,null,"węgorzewski","Pozezdrze"]
[null,null,null,null,null,null,null,null,null,null,null,null,null,null,null,null,null,null,null,null,null,null,null,null,null,"węgorzewski","Węgorzewo"]
[null,null,null,null,null,null,null,null,null,null,null,null,null,null,null,null,null,null,null,null,null,null,null,null,null,"bartoszycki","Bartoszyce"]
[null,null,null,null,null,null,null,null,null,null,null,null,null,null,null,null,null,null,null,null,null,null,null,null,null,"bartoszycki","Górowo Iławeckie"]
[null,null,null,null,null,null,null,null,null,null,null,null,null,null,null,null,null,null,null,null,null,null,null,null,null,"bartoszycki","Bartoszyce"]
[null,null,null,null,null,null,null,null,null,null,null,null,null,null,null,null,null,null,null,null,null,null,null,null,null,"bartoszycki","Bisztynek"]
[null,null,null,null,null,null,null,null,null,null,null,null,null,null,null,null,null,null,null,null,null,null,null,null,null,"bartoszycki","Górowo Iławeckie"]
[null,null,null,null,null,null,null,null,null,null,null,null,null,null,null,null,null,null,null,null,null,null,null,null,null,"bartoszycki","Sępopol"]
[null,null,null,null,null,null,null,null,null,null,null,null,null,null,null,null,null,null,null,null,null,null,null,null,null,"kętrzyński","Kętrzyn"]
[null,null,null,null,null,null,null,null,null,null,null,null,null,null,null,null,null,null,null,null,null,null,null,null,null,"kętrzyński","Barciany"]
[null,null,null,null,null,null,null,null,null,null,null,null,null,null,null,null,null,null,null,null,null,null,null,null,null,"kętrzyński","Korsze"]
[null,null,null,null,null,null,null,null,null,null,null,null,null,null,null,null,null,null,null,null,null,null,null,null,null,"kętrzyński","Reszel"]
[null,null,null,null,null,null,null,null,null,null,null,null,null,null,null,null,null,null,null,null,null,null,null,null,null,"kętrzyński","Srokowo"]
[null,null,null,null,null,null,null,null,null,null,null,null,null,null,null,null,null,null,null,null,null,null,null,null,null,"lidzbarski","Kiwity"]
[null,null,null,null,null,null,null,null,null,null,null,null,null,null,null,null,null,null,null,null,null,null,null,null,null,"lidzbarski","Lidzbark Warmiński"]
[null,null,null,null,null,null,null,null,null,null,null,null,null,null,null,null,null,null,null,null,null,null,null,null,null,"lidzbarski","Lubomino"]
[null,null,null,null,null,null,null,null,null,null,null,null,null,null,null,null,null,null,null,null,null,null,null,null,null,"lidzbarski","Orneta"]
[null,null,null,null,null,null,null,null,null,null,null,null,null,null,null,null,null,null,null,null,null,null,null,null,null,"mrągowski","Mikołajki"]
[null,null,null,null,null,null,null,null,null,null,null,null,null,null,null,null,null,null,null,null,null,null,null,null,null,"mrągowski","Mrągowo"]
[null,null,null,null,null,null,null,null,null,null,null,null,null,null,null,null,null,null,null,null,null,null,null,null,null,"mrągowski","Piecki"]
[null,null,null,null,null,null,null,null,null,null,null,null,null,null,null,null,null,null,null,null,null,null,null,null,null,"mrągowski","Sorkwity"]
[null,null,null,null,null,null,null,null,null,null,null,null,null,null,null,null,null,null,null,null,null,null,null,null,null,"nidzicki","Janowiec Kościelny"]
[null,null,null,null,null,null,null,null,null,null,null,null,null,null,null,null,null,null,null,null,null,null,null,null,null,"nidzicki","Janowo"]
[null,null,null,null,null,null,null,null,null,null,null,null,null,null,null,null,null,null,null,null,null,null,null,null,null,"nidzicki","Kozłowo"]
[null,null,null,null,null,null,null,null,null,null,null,null,null,null,null,null,null,null,null,null,null,null,null,null,null,"nidzicki","Nidzica"]
[null,null,null,null,null,null,null,null,null,null,null,null,null,null,null,null,null,null,null,null,null,null,null,null,null,"olsztyński","Barczewo"]
[null,null,null,null,null,null,null,null,null,null,null,null,null,null,null,null,null,null,null,null,null,null,null,null,null,"olsztyński","Biskupiec"]
[null,null,null,null,null,null,null,null,null,null,null,null,null,null,null,null,null,null,null,null,null,null,null,null,null,"olsztyński","Dobre Miasto"]
[null,null,null,null,null,null,null,null,null,null,null,null,null,null,null,null,null,null,null,null,null,null,null,null,null,"olsztyński","Dywity"]
[null,null,null,null,null,null,null,null,null,null,null,null,null,null,null,null,null,null,null,null,null,null,null,null,null,"olsztyński","Gietrzwałd"]
[null,null,null,null,null,null,null,null,null,null,null,null,null,null,null,null,null,null,null,null,null,null,null,null,null,"olsztyński","Jeziorany"]
[null,null,null,null,null,null,null,null,null,null,null,null,null,null,null,null,null,null,null,null,null,null,null,null,null,"olsztyński","Jonkowo"]
[null,null,null,null,null,null,null,null,null,null,null,null,null,null,null,null,null,null,null,null,null,null,null,null,null,"olsztyński","Kolno"]
[null,null,null,null,null,null,null,null,null,null,null,null,null,null,null,null,null,null,null,null,null,null,null,null,null,"olsztyński","Olsztynek"]
[null,null,null,null,null,null,null,null,null,null,null,null,null,null,null,null,null,null,null,null,null,null,null,null,null,"olsztyński","Purda"]
[null,null,null,null,null,null,null,null,null,null,null,null,null,null,null,null,null,null,null,null,null,null,null,null,null,"olsztyński","Stawiguda"]
[null,null,null,null,null,null,null,null,null,null,null,null,null,null,null,null,null,null,null,null,null,null,null,null,null,"olsztyński","Świątki"]
[null,null,null,null,null,null,null,null,null,null,null,null,null,null,null,null,null,null,null,null,null,null,null,null,null,"szczycieński","Szczytno"]
[null,null,null,null,null,null,null,null,null,null,null,null,null,null,null,null,null,null,null,null,null,null,null,null,null,"szczycieński","Dźwierzuty"]
[null,null,null,null,null,null,null,null,null,null,null,null,null,null,null,null,null,null,null,null,null,null,null,null,null,"szczycieński","Jedwabno"]
[null,null,null,null,null,null,null,null,null,null,null,null,null,null,null,null,null,null,null,null,null,null,null,null,null,"szczycieński","Pasym"]
[null,null,null,null,null,null,null,null,null,null,null,null,null,null,null,null,null,null,null,null,null,null,null,null,null,"szczycieński","Rozogi"]
[null,null,null,null,null,null,null,null,null,null,null,null,null,null,null,null,null,null,null,null,null,null,null,null,null,"szczycieński","Szczytno"]
[null,null,null,null,null,null,null,null,null,null,null,null,null,null,null,null,null,null,null,null,null,null,null,null,null,"szczycieński","Świętajno"]
[null,null,null,null,null,null,null,null,null,null,null,null,null,null,null,null,null,null,null,null,null,null,null,null,null,"szczycieński","Wielbark"]
[null,null,null,null,null,null,null,null,null,null,null,null,null,null,null,null,null,null,null,null,null,null,null,null,null,"Olsztyn","Olsztyn"]
[null,null,null,null,null,null,null,null,null,null,null,null,null,null,null,null,null,null,null,null,null,null,null,null,null,"łódzki wschodni","Andrespol"]
[null,null,null,null,null,null,null,null,null,null,null,null,null,null,null,null,null,null,null,null,null,null,null,null,null,"łódzki wschodni","Brójce"]
[null,null,null,null,null,null,null,null,null,null,null,null,null,null,null,null,null,null,null,null,null,null,null,null,null,"łódzki wschodni","Koluszki"]
[null,null,null,null,null,null,null,null,null,null,null,null,null,null,null,null,null,null,null,null,null,null,null,null,null,"łódzki wschodni","Nowosolna"]
[null,null,null,null,null,null,null,null,null,null,null,null,null,null,null,null,null,null,null,null,null,null,null,null,null,"łódzki wschodni","Rzgów"]
[null,null,null,null,null,null,null,null,null,null,null,null,null,null,null,null,null,null,null,null,null,null,null,null,null,"łódzki wschodni","Tuszyn"]
[null,null,null,null,null,null,null,null,null,null,null,null,null,null,null,null,null,null,null,null,null,null,null,null,null,"pabianicki","Konstantynów Łódzki"]
[null,null,null,null,null,null,null,null,null,null,null,null,null,null,null,null,null,null,null,null,null,null,null,null,null,"pabianicki","Pabianice"]
[null,null,null,null,null,null,null,null,null,null,null,null,null,null,null,null,null,null,null,null,null,null,null,null,null,"pabianicki","Dłutów"]
[null,null,null,null,null,null,null,null,null,null,null,null,null,null,null,null,null,null,null,null,null,null,null,null,null,"pabianicki","Dobroń"]
[null,null,null,null,null,null,null,null,null,null,null,null,null,null,null,null,null,null,null,null,null,null,null,null,null,"pabianicki","Ksawerów"]
[null,null,null,null,null,null,null,null,null,null,null,null,null,null,null,null,null,null,null,null,null,null,null,null,null,"pabianicki","Lutomiersk"]
[null,null,null,null,null,null,null,null,null,null,null,null,null,null,null,null,null,null,null,null,null,null,null,null,null,"pabianicki","Pabianice"]
[null,null,null,null,null,null,null,null,null,null,null,null,null,null,null,null,null,null,null,null,null,null,null,null,null,"zgierski","Ozorków"]
[null,null,null,null,null,null,null,null,null,null,null,null,null,null,null,null,null,null,null,null,null,null,null,null,null,"zgierski","Zgierz"]
[null,null,null,null,null,null,null,null,null,null,null,null,null,null,null,null,null,null,null,null,null,null,null,null,null,"zgierski","Aleksandrów Łódzki"]
[null,null,null,null,null,null,null,null,null,null,null,null,null,null,null,null,null,null,null,null,null,null,null,null,null,"zgierski","Głowno"]
[null,null,null,null,null,null,null,null,null,null,null,null,null,null,null,null,null,null,null,null,null,null,null,null,null,"zgierski","Ozorków"]
[null,null,null,null,null,null,null,null,null,null,null,null,null,null,null,null,null,null,null,null,null,null,null,null,null,"zgierski","Parzęczew"]
[null,null,null,null,null,null,null,null,null,null,null,null,null,null,null,null,null,null,null,null,null,null,null,null,null,"zgierski","Stryków"]
[null,null,null,null,null,null,null,null,null,null,null,null,null,null,null,null,null,null,null,null,null,null,null,null,null,"brzeziński","Brzeziny"]
[null,null,null,null,null,null,null,null,null,null,null,null,null,null,null,null,null,null,null,null,null,null,null,null,null,"brzeziński","Dmosin"]
[null,null,null,null,null,null,null,null,null,null,null,null,null,null,null,null,null,null,null,null,null,null,null,null,null,"brzeziński","Jeżów"]
[null,null,null,null,null,null,null,null,null,null,null,null,null,null,null,null,null,null,null,null,null,null,null,null,null,"brzeziński","Rogów"]
[null,null,null,null,null,null,null,null,null,null,null,null,null,null,null,null,null,null,null,null,null,null,null,null,null,"Łódź","Łódź"]
[null,null,null,null,null,null,null,null,null,null,null,null,null,null,null,null,null,null,null,null,null,null,null,null,null,"Łódź","Łódź-Bałuty"]
[null,null,null,null,null,null,null,null,null,null,null,null,null,null,null,null,null,null,null,null,null,null,null,null,null,"Łódź","Łódź-Górna"]
[null,null,null,null,null,null,null,null,null,null,null,null,null,null,null,null,null,null,null,null,null,null,null,null,null,"Łódź","Łódź-Polesie"]
[null,null,null,null,null,null,null,null,null,null,null,null,null,null,null,null,null,null,null,null,null,null,null,null,null,"Łódź","Łódź-Śródmieście"]
[null,null,null,null,null,null,null,null,null,null,null,null,null,null,null,null,null,null,null,null,null,null,null,null,null,"Łódź","Łódź-Widzew"]
[null,null,null,null,null,null,null,null,null,null,null,null,null,null,null,null,null,null,null,null,null,null,null,null,null,"bełchatowski","Bełchatów"]
[null,null,null,null,null,null,null,null,null,null,null,null,null,null,null,null,null,null,null,null,null,null,null,null,null,"bełchatowski","Drużbice"]
[null,null,null,null,null,null,null,null,null,null,null,null,null,null,null,null,null,null,null,null,null,null,null,null,null,"bełchatowski","Kleszczów"]
[null,null,null,null,null,null,null,null,null,null,null,null,null,null,null,null,null,null,null,null,null,null,null,null,null,"bełchatowski","Kluki"]
[null,null,null,null,null,null,null,null,null,null,null,null,null,null,null,null,null,null,null,null,null,null,null,null,null,"bełchatowski","Rusiec"]
[null,null,null,null,null,null,null,null,null,null,null,null,null,null,null,null,null,null,null,null,null,null,null,null,null,"bełchatowski","Szczerców"]
[null,null,null,null,null,null,null,null,null,null,null,null,null,null,null,null,null,null,null,null,null,null,null,null,null,"bełchatowski","Zelów"]
[null,null,null,null,null,null,null,null,null,null,null,null,null,null,null,null,null,null,null,null,null,null,null,null,null,"opoczyński","Białaczów"]
[null,null,null,null,null,null,null,null,null,null,null,null,null,null,null,null,null,null,null,null,null,null,null,null,null,"opoczyński","Drzewica"]
[null,null,null,null,null,null,null,null,null,null,null,null,null,null,null,null,null,null,null,null,null,null,null,null,null,"opoczyński","Mniszków"]
[null,null,null,null,null,null,null,null,null,null,null,null,null,null,null,null,null,null,null,null,null,null,null,null,null,"opoczyński","Opoczno"]
[null,null,null,null,null,null,null,null,null,null,null,null,null,null,null,null,null,null,null,null,null,null,null,null,null,"opoczyński","Paradyż"]
[null,null,null,null,null,null,null,null,null,null,null,null,null,null,null,null,null,null,null,null,null,null,null,null,null,"opoczyński","Poświętne"]
[null,null,null,null,null,null,null,null,null,null,null,null,null,null,null,null,null,null,null,null,null,null,null,null,null,"opoczyński","Sławno"]
[null,null,null,null,null,null,null,null,null,null,null,null,null,null,null,null,null,null,null,null,null,null,null,null,null,"opoczyński","Żarnów"]
[null,null,null,null,null,null,null,null,null,null,null,null,null,null,null,null,null,null,null,null,null,null,null,null,null,"piotrkowski","Aleksandrów"]
[null,null,null,null,null,null,null,null,null,null,null,null,null,null,null,null,null,null,null,null,null,null,null,null,null,"piotrkowski","Czarnocin"]
[null,null,null,null,null,null,null,null,null,null,null,null,null,null,null,null,null,null,null,null,null,null,null,null,null,"piotrkowski","Gorzkowice"]
[null,null,null,null,null,null,null,null,null,null,null,null,null,null,null,null,null,null,null,null,null,null,null,null,null,"piotrkowski","Grabica"]
[null,null,null,null,null,null,null,null,null,null,null,null,null,null,null,null,null,null,null,null,null,null,null,null,null,"piotrkowski","Łęki Szlacheckie"]
[null,null,null,null,null,null,null,null,null,null,null,null,null,null,null,null,null,null,null,null,null,null,null,null,null,"piotrkowski","Moszczenica"]
[null,null,null,null,null,null,null,null,null,null,null,null,null,null,null,null,null,null,null,null,null,null,null,null,null,"piotrkowski","Ręczno"]
[null,null,null,null,null,null,null,null,null,null,null,null,null,null,null,null,null,null,null,null,null,null,null,null,null,"piotrkowski","Rozprza"]
[null,null,null,null,null,null,null,null,null,null,null,null,null,null,null,null,null,null,null,null,null,null,null,null,null,"piotrkowski","Sulejów"]
[null,null,null,null,null,null,null,null,null,null,null,null,null,null,null,null,null,null,null,null,null,null,null,null,null,"piotrkowski","Wola Krzysztoporska"]
[null,null,null,null,null,null,null,null,null,null,null,null,null,null,null,null,null,null,null,null,null,null,null,null,null,"piotrkowski","Wolbórz"]
[null,null,null,null,null,null,null,null,null,null,null,null,null,null,null,null,null,null,null,null,null,null,null,null,null,"radomszczański","Radomsko"]
[null,null,null,null,null,null,null,null,null,null,null,null,null,null,null,null,null,null,null,null,null,null,null,null,null,"radomszczański","Dobryszyce"]
[null,null,null,null,null,null,null,null,null,null,null,null,null,null,null,null,null,null,null,null,null,null,null,null,null,"radomszczański","Gidle"]
[null,null,null,null,null,null,null,null,null,null,null,null,null,null,null,null,null,null,null,null,null,null,null,null,null,"radomszczański","Gomunice"]
[null,null,null,null,null,null,null,null,null,null,null,null,null,null,null,null,null,null,null,null,null,null,null,null,null,"radomszczański","Kamieńsk"]
[null,null,null,null,null,null,null,null,null,null,null,null,null,null,null,null,null,null,null,null,null,null,null,null,null,"radomszczański","Kobiele Wielkie"]
[null,null,null,null,null,null,null,null,null,null,null,null,null,null,null,null,null,null,null,null,null,null,null,null,null,"radomszczański","Kodrąb"]
[null,null,null,null,null,null,null,null,null,null,null,null,null,null,null,null,null,null,null,null,null,null,null,null,null,"radomszczański","Lgota Wielka"]
[null,null,null,null,null,null,null,null,null,null,null,null,null,null,null,null,null,null,null,null,null,null,null,null,null,"radomszczański","Ładzice"]
[null,null,null,null,null,null,null,null,null,null,null,null,null,null,null,null,null,null,null,null,null,null,null,null,null,"radomszczański","Masłowice"]
[null,null,null,null,null,null,null,null,null,null,null,null,null,null,null,null,null,null,null,null,null,null,null,null,null,"radomszczański","Przedbórz"]
[null,null,null,null,null,null,null,null,null,null,null,null,null,null,null,null,null,null,null,null,null,null,null,null,null,"radomszczański","Radomsko"]
[null,null,null,null,null,null,null,null,null,null,null,null,null,null,null,null,null,null,null,null,null,null,null,null,null,"radomszczański","Wielgomłyny"]
[null,null,null,null,null,null,null,null,null,null,null,null,null,null,null,null,null,null,null,null,null,null,null,null,null,"radomszczański","Żytno"]
[null,null,null,null,null,null,null,null,null,null,null,null,null,null,null,null,null,null,null,null,null,null,null,null,null,"tomaszowski","Tomaszów Mazowiecki"]
[null,null,null,null,null,null,null,null,null,null,null,null,null,null,null,null,null,null,null,null,null,null,null,null,null,"tomaszowski","Będków"]
[null,null,null,null,null,null,null,null,null,null,null,null,null,null,null,null,null,null,null,null,null,null,null,null,null,"tomaszowski","Budziszewice"]
[null,null,null,null,null,null,null,null,null,null,null,null,null,null,null,null,null,null,null,null,null,null,null,null,null,"tomaszowski","Czerniewice"]
[null,null,null,null,null,null,null,null,null,null,null,null,null,null,null,null,null,null,null,null,null,null,null,null,null,"tomaszowski","Inowłódz"]
[null,null,null,null,null,null,null,null,null,null,null,null,null,null,null,null,null,null,null,null,null,null,null,null,null,"tomaszowski","Lubochnia"]
[null,null,null,null,null,null,null,null,null,null,null,null,null,null,null,null,null,null,null,null,null,null,null,null,null,"tomaszowski","Rokiciny"]
[null,null,null,null,null,null,null,null,null,null,null,null,null,null,null,null,null,null,null,null,null,null,null,null,null,"tomaszowski","Rzeczyca"]
[null,null,null,null,null,null,null,null,null,null,null,null,null,null,null,null,null,null,null,null,null,null,null,null,null,"tomaszowski","Tomaszów Mazowiecki"]
[null,null,null,null,null,null,null,null,null,null,null,null,null,null,null,null,null,null,null,null,null,null,null,null,null,"tomaszowski","Ujazd"]
[null,null,null,null,null,null,null,null,null,null,null,null,null,null,null,null,null,null,null,null,null,null,null,null,null,"tomaszowski","Żelechlinek"]
[null,null,null,null,null,null,null,null,null,null,null,null,null,null,null,null,null,null,null,null,null,null,null,null,null,"Piotrków Trybunalski","Piotrków Trybunalski"]
[null,null,null,null,null,null,null,null,null,null,null,null,null,null,null,null,null,null,null,null,null,null,null,null,null,"łaski","Buczek"]
[null,null,null,null,null,null,null,null,null,null,null,null,null,null,null,null,null,null,null,null,null,null,null,null,null,"łaski","Łask"]
[null,null,null,null,null,null,null,null,null,null,null,null,null,null,null,null,null,null,null,null,null,null,null,null,null,"łaski","Sędziejowice"]
[null,null,null,null,null,null,null,null,null,null,null,null,null,null,null,null,null,null,null,null,null,null,null,null,null,"łaski","Widawa"]
[null,null,null,null,null,null,null,null,null,null,null,null,null,null,null,null,null,null,null,null,null,null,null,null,null,"łaski","Wodzierady"]
[null,null,null,null,null,null,null,null,null,null,null,null,null,null,null,null,null,null,null,null,null,null,null,null,null,"pajęczański","Działoszyn"]
[null,null,null,null,null,null,null,null,null,null,null,null,null,null,null,null,null,null,null,null,null,null,null,null,null,"pajęczański","Kiełczygłów"]
[null,null,null,null,null,null,null,null,null,null,null,null,null,null,null,null,null,null,null,null,null,null,null,null,null,"pajęczański","Nowa Brzeźnica"]
[null,null,null,null,null,null,null,null,null,null,null,null,null,null,null,null,null,null,null,null,null,null,null,null,null,"pajęczański","Pajęczno"]
[null,null,null,null,null,null,null,null,null,null,null,null,null,null,null,null,null,null,null,null,null,null,null,null,null,"pajęczański","Rząśnia"]
[null,null,null,null,null,null,null,null,null,null,null,null,null,null,null,null,null,null,null,null,null,null,null,null,null,"pajęczański","Siemkowice"]
[null,null,null,null,null,null,null,null,null,null,null,null,null,null,null,null,null,null,null,null,null,null,null,null,null,"pajęczański","Strzelce Wielkie"]
[null,null,null,null,null,null,null,null,null,null,null,null,null,null,null,null,null,null,null,null,null,null,null,null,null,"pajęczański","Sulmierzyce"]
[null,null,null,null,null,null,null,null,null,null,null,null,null,null,null,null,null,null,null,null,null,null,null,null,null,"poddębicki","Dalików"]
[null,null,null,null,null,null,null,null,null,null,null,null,null,null,null,null,null,null,null,null,null,null,null,null,null,"poddębicki","Pęczniew"]
[null,null,null,null,null,null,null,null,null,null,null,null,null,null,null,null,null,null,null,null,null,null,null,null,null,"poddębicki","Poddębice"]
[null,null,null,null,null,null,null,null,null,null,null,null,null,null,null,null,null,null,null,null,null,null,null,null,null,"poddębicki","Uniejów"]
[null,null,null,null,null,null,null,null,null,null,null,null,null,null,null,null,null,null,null,null,null,null,null,null,null,"poddębicki","Wartkowice"]
[null,null,null,null,null,null,null,null,null,null,null,null,null,null,null,null,null,null,null,null,null,null,null,null,null,"poddębicki","Zadzim"]
[null,null,null,null,null,null,null,null,null,null,null,null,null,null,null,null,null,null,null,null,null,null,null,null,null,"sieradzki","Sieradz"]
[null,null,null,null,null,null,null,null,null,null,null,null,null,null,null,null,null,null,null,null,null,null,null,null,null,"sieradzki","Błaszki"]
[null,null,null,null,null,null,null,null,null,null,null,null,null,null,null,null,null,null,null,null,null,null,null,null,null,"sieradzki","Brąszewice"]
[null,null,null,null,null,null,null,null,null,null,null,null,null,null,null,null,null,null,null,null,null,null,null,null,null,"sieradzki","Brzeźnio"]
[null,null,null,null,null,null,null,null,null,null,null,null,null,null,null,null,null,null,null,null,null,null,null,null,null,"sieradzki","Burzenin"]
[null,null,null,null,null,null,null,null,null,null,null,null,null,null,null,null,null,null,null,null,null,null,null,null,null,"sieradzki","Goszczanów"]
[null,null,null,null,null,null,null,null,null,null,null,null,null,null,null,null,null,null,null,null,null,null,null,null,null,"sieradzki","Klonowa"]
[null,null,null,null,null,null,null,null,null,null,null,null,null,null,null,null,null,null,null,null,null,null,null,null,null,"sieradzki","Sieradz"]
[null,null,null,null,null,null,null,null,null,null,null,null,null,null,null,null,null,null,null,null,null,null,null,null,null,"sieradzki","Warta"]
[null,null,null,null,null,null,null,null,null,null,null,null,null,null,null,null,null,null,null,null,null,null,null,null,null,"sieradzki","Wróblew"]
[null,null,null,null,null,null,null,null,null,null,null,null,null,null,null,null,null,null,null,null,null,null,null,null,null,"sieradzki","Złoczew"]
[null,null,null,null,null,null,null,null,null,null,null,null,null,null,null,null,null,null,null,null,null,null,null,null,null,"wieluński","Biała"]
[null,null,null,null,null,null,null,null,null,null,null,null,null,null,null,null,null,null,null,null,null,null,null,null,null,"wieluński","Czarnożyły"]
[null,null,null,null,null,null,null,null,null,null,null,null,null,null,null,null,null,null,null,null,null,null,null,null,null,"wieluński","Konopnica"]
[null,null,null,null,null,null,null,null,null,null,null,null,null,null,null,null,null,null,null,null,null,null,null,null,null,"wieluński","Mokrsko"]
[null,null,null,null,null,null,null,null,null,null,null,null,null,null,null,null,null,null,null,null,null,null,null,null,null,"wieluński","Osjaków"]
[null,null,null,null,null,null,null,null,null,null,null,null,null,null,null,null,null,null,null,null,null,null,null,null,null,"wieluński","Ostrówek"]
[null,null,null,null,null,null,null,null,null,null,null,null,null,null,null,null,null,null,null,null,null,null,null,null,null,"wieluński","Pątnów"]
[null,null,null,null,null,null,null,null,null,null,null,null,null,null,null,null,null,null,null,null,null,null,null,null,null,"wieluński","Skomlin"]
[null,null,null,null,null,null,null,null,null,null,null,null,null,null,null,null,null,null,null,null,null,null,null,null,null,"wieluński","Wieluń"]
[null,null,null,null,null,null,null,null,null,null,null,null,null,null,null,null,null,null,null,null,null,null,null,null,null,"wieluński","Wierzchlas"]
[null,null,null,null,null,null,null,null,null,null,null,null,null,null,null,null,null,null,null,null,null,null,null,null,null,"wieruszowski","Bolesławiec"]
[null,null,null,null,null,null,null,null,null,null,null,null,null,null,null,null,null,null,null,null,null,null,null,null,null,"wieruszowski","Czastary"]
[null,null,null,null,null,null,null,null,null,null,null,null,null,null,null,null,null,null,null,null,null,null,null,null,null,"wieruszowski","Galewice"]
[null,null,null,null,null,null,null,null,null,null,null,null,null,null,null,null,null,null,null,null,null,null,null,null,null,"wieruszowski","Lututów"]
[null,null,null,null,null,null,null,null,null,null,null,null,null,null,null,null,null,null,null,null,null,null,null,null,null,"wieruszowski","Łubnice"]
[null,null,null,null,null,null,null,null,null,null,null,null,null,null,null,null,null,null,null,null,null,null,null,null,null,"wieruszowski","Sokolniki"]
[null,null,null,null,null,null,null,null,null,null,null,null,null,null,null,null,null,null,null,null,null,null,null,null,null,"wieruszowski","Wieruszów"]
[null,null,null,null,null,null,null,null,null,null,null,null,null,null,null,null,null,null,null,null,null,null,null,null,null,"zduńskowolski","Zduńska Wola"]
[null,null,null,null,null,null,null,null,null,null,null,null,null,null,null,null,null,null,null,null,null,null,null,null,null,"zduńskowolski","Szadek"]
[null,null,null,null,null,null,null,null,null,null,null,null,null,null,null,null,null,null,null,null,null,null,null,null,null,"zduńskowolski","Zapolice"]
[null,null,null,null,null,null,null,null,null,null,null,null,null,null,null,null,null,null,null,null,null,null,null,null,null,"zduńskowolski","Zduńska Wola"]
[null,null,null,null,null,null,null,null,null,null,null,null,null,null,null,null,null,null,null,null,null,null,null,null,null,"kutnowski","Bedlno"]
[null,null,null,null,null,null,null,null,null,null,null,null,null,null,null,null,null,null,null,null,null,null,null,null,null,"kutnowski","Dąbrowice"]
[null,null,null,null,null,null,null,null,null,null,null,null,null,null,null,null,null,null,null,null,null,null,null,null,null,"kutnowski","Krośniewice"]
[null,null,null,null,null,null,null,null,null,null,null,null,null,null,null,null,null,null,null,null,null,null,null,null,null,"kutnowski","Krzyżanów"]
[null,null,null,null,null,null,null,null,null,null,null,null,null,null,null,null,null,null,null,null,null,null,null,null,null,"kutnowski","Kutno"]
[null,null,null,null,null,null,null,null,null,null,null,null,null,null,null,null,null,null,null,null,null,null,null,null,null,"kutnowski","Łanięta"]
[null,null,null,null,null,null,null,null,null,null,null,null,null,null,null,null,null,null,null,null,null,null,null,null,null,"kutnowski","Nowe Ostrowy"]
[null,null,null,null,null,null,null,null,null,null,null,null,null,null,null,null,null,null,null,null,null,null,null,null,null,"kutnowski","Oporów"]
[null,null,null,null,null,null,null,null,null,null,null,null,null,null,null,null,null,null,null,null,null,null,null,null,null,"kutnowski","Strzelce"]
[null,null,null,null,null,null,null,null,null,null,null,null,null,null,null,null,null,null,null,null,null,null,null,null,null,"kutnowski","Żychlin"]
[null,null,null,null,null,null,null,null,null,null,null,null,null,null,null,null,null,null,null,null,null,null,null,null,null,"łęczycki","Łęczyca"]
[null,null,null,null,null,null,null,null,null,null,null,null,null,null,null,null,null,null,null,null,null,null,null,null,null,"łęczycki","Daszyna"]
[null,null,null,null,null,null,null,null,null,null,null,null,null,null,null,null,null,null,null,null,null,null,null,null,null,"łęczycki","Góra Świętej Małgorzaty"]
[null,null,null,null,null,null,null,null,null,null,null,null,null,null,null,null,null,null,null,null,null,null,null,null,null,"łęczycki","Grabów"]
[null,null,null,null,null,null,null,null,null,null,null,null,null,null,null,null,null,null,null,null,null,null,null,null,null,"łęczycki","Łęczyca"]
[null,null,null,null,null,null,null,null,null,null,null,null,null,null,null,null,null,null,null,null,null,null,null,null,null,"łęczycki","Piątek"]
[null,null,null,null,null,null,null,null,null,null,null,null,null,null,null,null,null,null,null,null,null,null,null,null,null,"łęczycki","Piątek"]
[null,null,null,null,null,null,null,null,null,null,null,null,null,null,null,null,null,null,null,null,null,null,null,null,null,"łęczycki","Piątek"]
[null,null,null,null,null,null,null,null,null,null,null,null,null,null,null,null,null,null,null,null,null,null,null,null,null,"łęczycki","Świnice Warckie"]
[null,null,null,null,null,null,null,null,null,null,null,null,null,null,null,null,null,null,null,null,null,null,null,null,null,"łęczycki","Witonia"]
[null,null,null,null,null,null,null,null,null,null,null,null,null,null,null,null,null,null,null,null,null,null,null,null,null,"łowicki","Łowicz"]
[null,null,null,null,null,null,null,null,null,null,null,null,null,null,null,null,null,null,null,null,null,null,null,null,null,"łowicki","Bielawy"]
[null,null,null,null,null,null,null,null,null,null,null,null,null,null,null,null,null,null,null,null,null,null,null,null,null,"łowicki","Chąśno"]
[null,null,null,null,null,null,null,null,null,null,null,null,null,null,null,null,null,null,null,null,null,null,null,null,null,"łowicki","Domaniewice"]
[null,null,null,null,null,null,null,null,null,null,null,null,null,null,null,null,null,null,null,null,null,null,null,null,null,"łowicki","Kiernozia"]
[null,null,null,null,null,null,null,null,null,null,null,null,null,null,null,null,null,null,null,null,null,null,null,null,null,"łowicki","Kocierzew Południowy"]
[null,null,null,null,null,null,null,null,null,null,null,null,null,null,null,null,null,null,null,null,null,null,null,null,null,"łowicki","Łowicz"]
[null,null,null,null,null,null,null,null,null,null,null,null,null,null,null,null,null,null,null,null,null,null,null,null,null,"łowicki","Łyszkowice"]
[null,null,null,null,null,null,null,null,null,null,null,null,null,null,null,null,null,null,null,null,null,null,null,null,null,"łowicki","Nieborów"]
[null,null,null,null,null,null,null,null,null,null,null,null,null,null,null,null,null,null,null,null,null,null,null,null,null,"łowicki","Zduny"]
[null,null,null,null,null,null,null,null,null,null,null,null,null,null,null,null,null,null,null,null,null,null,null,null,null,"rawski","Rawa Mazowiecka"]
[null,null,null,null,null,null,null,null,null,null,null,null,null,null,null,null,null,null,null,null,null,null,null,null,null,"rawski","Biała Rawska"]
[null,null,null,null,null,null,null,null,null,null,null,null,null,null,null,null,null,null,null,null,null,null,null,null,null,"rawski","Cielądz"]
[null,null,null,null,null,null,null,null,null,null,null,null,null,null,null,null,null,null,null,null,null,null,null,null,null,"rawski","Regnów"]
[null,null,null,null,null,null,null,null,null,null,null,null,null,null,null,null,null,null,null,null,null,null,null,null,null,"rawski","Sadkowice"]
[null,null,null,null,null,null,null,null,null,null,null,null,null,null,null,null,null,null,null,null,null,null,null,null,null,"skierniewicki","Bolimów"]
[null,null,null,null,null,null,null,null,null,null,null,null,null,null,null,null,null,null,null,null,null,null,null,null,null,"skierniewicki","Głuchów"]
[null,null,null,null,null,null,null,null,null,null,null,null,null,null,null,null,null,null,null,null,null,null,null,null,null,"skierniewicki","Godzianów"]
[null,null,null,null,null,null,null,null,null,null,null,null,null,null,null,null,null,null,null,null,null,null,null,null,null,"skierniewicki","Kowiesy"]
[null,null,null,null,null,null,null,null,null,null,null,null,null,null,null,null,null,null,null,null,null,null,null,null,null,"skierniewicki","Lipce Reymontowskie"]
[null,null,null,null,null,null,null,null,null,null,null,null,null,null,null,null,null,null,null,null,null,null,null,null,null,"skierniewicki","Maków"]
[null,null,null,null,null,null,null,null,null,null,null,null,null,null,null,null,null,null,null,null,null,null,null,null,null,"skierniewicki","Nowy Kawęczyn"]
[null,null,null,null,null,null,null,null,null,null,null,null,null,null,null,null,null,null,null,null,null,null,null,null,null,"skierniewicki","Skierniewice"]
[null,null,null,null,null,null,null,null,null,null,null,null,null,null,null,null,null,null,null,null,null,null,null,null,null,"skierniewicki","Słupia"]
[null,null,null,null,null,null,null,null,null,null,null,null,null,null,null,null,null,null,null,null,null,null,null,null,null,"kielecki","Bieliny"]
[null,null,null,null,null,null,null,null,null,null,null,null,null,null,null,null,null,null,null,null,null,null,null,null,null,"kielecki","Bodzentyn"]
[null,null,null,null,null,null,null,null,null,null,null,null,null,null,null,null,null,null,null,null,null,null,null,null,null,"kielecki","Chęciny"]
[null,null,null,null,null,null,null,null,null,null,null,null,null,null,null,null,null,null,null,null,null,null,null,null,null,"kielecki","Chmielnik"]
[null,null,null,null,null,null,null,null,null,null,null,null,null,null,null,null,null,null,null,null,null,null,null,null,null,"kielecki","Daleszyce"]
[null,null,null,null,null,null,null,null,null,null,null,null,null,null,null,null,null,null,null,null,null,null,null,null,null,"kielecki","Górno"]
[null,null,null,null,null,null,null,null,null,null,null,null,null,null,null,null,null,null,null,null,null,null,null,null,null,"kielecki","Łagów"]
[null,null,null,null,null,null,null,null,null,null,null,null,null,null,null,null,null,null,null,null,null,null,null,null,null,"kielecki","Łopuszno"]
[null,null,null,null,null,null,null,null,null,null,null,null,null,null,null,null,null,null,null,null,null,null,null,null,null,"kielecki","Masłów"]
[null,null,null,null,null,null,null,null,null,null,null,null,null,null,null,null,null,null,null,null,null,null,null,null,null,"kielecki","Miedziana Góra"]
[null,null,null,null,null,null,null,null,null,null,null,null,null,null,null,null,null,null,null,null,null,null,null,null,null,"kielecki","Mniów"]
[null,null,null,null,null,null,null,null,null,null,null,null,null,null,null,null,null,null,null,null,null,null,null,null,null,"kielecki","Morawica"]
[null,null,null,null,null,null,null,null,null,null,null,null,null,null,null,null,null,null,null,null,null,null,null,null,null,"kielecki","Nowa Słupia"]
[null,null,null,null,null,null,null,null,null,null,null,null,null,null,null,null,null,null,null,null,null,null,null,null,null,"kielecki","Piekoszów"]
[null,null,null,null,null,null,null,null,null,null,null,null,null,null,null,null,null,null,null,null,null,null,null,null,null,"kielecki","Pierzchnica"]
[null,null,null,null,null,null,null,null,null,null,null,null,null,null,null,null,null,null,null,null,null,null,null,null,null,"kielecki","Raków"]
[null,null,null,null,null,null,null,null,null,null,null,null,null,null,null,null,null,null,null,null,null,null,null,null,null,"kielecki","Nowiny"]
[null,null,null,null,null,null,null,null,null,null,null,null,null,null,null,null,null,null,null,null,null,null,null,null,null,"kielecki","Strawczyn"]
[null,null,null,null,null,null,null,null,null,null,null,null,null,null,null,null,null,null,null,null,null,null,null,null,null,"kielecki","Zagnańsk"]
[null,null,null,null,null,null,null,null,null,null,null,null,null,null,null,null,null,null,null,null,null,null,null,null,null,"konecki","Fałków"]
[null,null,null,null,null,null,null,null,null,null,null,null,null,null,null,null,null,null,null,null,null,null,null,null,null,"konecki","Gowarczów"]
[null,null,null,null,null,null,null,null,null,null,null,null,null,null,null,null,null,null,null,null,null,null,null,null,null,"konecki","Końskie"]
[null,null,null,null,null,null,null,null,null,null,null,null,null,null,null,null,null,null,null,null,null,null,null,null,null,"konecki","Radoszyce"]
[null,null,null,null,null,null,null,null,null,null,null,null,null,null,null,null,null,null,null,null,null,null,null,null,null,"konecki","Ruda Maleniecka"]
[null,null,null,null,null,null,null,null,null,null,null,null,null,null,null,null,null,null,null,null,null,null,null,null,null,"konecki","Słupia Konecka"]
[null,null,null,null,null,null,null,null,null,null,null,null,null,null,null,null,null,null,null,null,null,null,null,null,null,"konecki","Smyków"]
[null,null,null,null,null,null,null,null,null,null,null,null,null,null,null,null,null,null,null,null,null,null,null,null,null,"konecki","Stąporków"]
[null,null,null,null,null,null,null,null,null,null,null,null,null,null,null,null,null,null,null,null,null,null,null,null,null,"ostrowiecki","Ostrowiec Świętokrzyski"]
[null,null,null,null,null,null,null,null,null,null,null,null,null,null,null,null,null,null,null,null,null,null,null,null,null,"ostrowiecki","Bałtów"]
[null,null,null,null,null,null,null,null,null,null,null,null,null,null,null,null,null,null,null,null,null,null,null,null,null,"ostrowiecki","Bodzechów"]
[null,null,null,null,null,null,null,null,null,null,null,null,null,null,null,null,null,null,null,null,null,null,null,null,null,"ostrowiecki","Ćmielów"]
[null,null,null,null,null,null,null,null,null,null,null,null,null,null,null,null,null,null,null,null,null,null,null,null,null,"ostrowiecki","Kunów"]
[null,null,null,null,null,null,null,null,null,null,null,null,null,null,null,null,null,null,null,null,null,null,null,null,null,"ostrowiecki","Waśniów"]
[null,null,null,null,null,null,null,null,null,null,null,null,null,null,null,null,null,null,null,null,null,null,null,null,null,"skarżyski","Skarżysko-Kamienna"]
[null,null,null,null,null,null,null,null,null,null,null,null,null,null,null,null,null,null,null,null,null,null,null,null,null,"skarżyski","Bliżyn"]
[null,null,null,null,null,null,null,null,null,null,null,null,null,null,null,null,null,null,null,null,null,null,null,null,null,"skarżyski","Łączna"]
[null,null,null,null,null,null,null,null,null,null,null,null,null,null,null,null,null,null,null,null,null,null,null,null,null,"skarżyski","Skarżysko Kościelne"]
[null,null,null,null,null,null,null,null,null,null,null,null,null,null,null,null,null,null,null,null,null,null,null,null,null,"skarżyski","Suchedniów"]
[null,null,null,null,null,null,null,null,null,null,null,null,null,null,null,null,null,null,null,null,null,null,null,null,null,"starachowicki","Starachowice"]
[null,null,null,null,null,null,null,null,null,null,null,null,null,null,null,null,null,null,null,null,null,null,null,null,null,"starachowicki","Brody"]
[null,null,null,null,null,null,null,null,null,null,null,null,null,null,null,null,null,null,null,null,null,null,null,null,null,"starachowicki","Mirzec"]
[null,null,null,null,null,null,null,null,null,null,null,null,null,null,null,null,null,null,null,null,null,null,null,null,null,"starachowicki","Pawłów"]
[null,null,null,null,null,null,null,null,null,null,null,null,null,null,null,null,null,null,null,null,null,null,null,null,null,"starachowicki","Wąchock"]
[null,null,null,null,null,null,null,null,null,null,null,null,null,null,null,null,null,null,null,null,null,null,null,null,null,"Kielce","Kielce"]
[null,null,null,null,null,null,null,null,null,null,null,null,null,null,null,null,null,null,null,null,null,null,null,null,null,"buski","Busko-Zdrój"]
[null,null,null,null,null,null,null,null,null,null,null,null,null,null,null,null,null,null,null,null,null,null,null,null,null,"buski","Gnojno"]
[null,null,null,null,null,null,null,null,null,null,null,null,null,null,null,null,null,null,null,null,null,null,null,null,null,"buski","Nowy Korczyn"]
[null,null,null,null,null,null,null,null,null,null,null,null,null,null,null,null,null,null,null,null,null,null,null,null,null,"buski","Pacanów"]
[null,null,null,null,null,null,null,null,null,null,null,null,null,null,null,null,null,null,null,null,null,null,null,null,null,"buski","Solec-Zdrój"]
[null,null,null,null,null,null,null,null,null,null,null,null,null,null,null,null,null,null,null,null,null,null,null,null,null,"buski","Stopnica"]
[null,null,null,null,null,null,null,null,null,null,null,null,null,null,null,null,null,null,null,null,null,null,null,null,null,"buski","Tuczępy"]
[null,null,null,null,null,null,null,null,null,null,null,null,null,null,null,null,null,null,null,null,null,null,null,null,null,"buski","Wiślica"]
[null,null,null,null,null,null,null,null,null,null,null,null,null,null,null,null,null,null,null,null,null,null,null,null,null,"jędrzejowski","Imielno"]
[null,null,null,null,null,null,null,null,null,null,null,null,null,null,null,null,null,null,null,null,null,null,null,null,null,"jędrzejowski","Jędrzejów"]
[null,null,null,null,null,null,null,null,null,null,null,null,null,null,null,null,null,null,null,null,null,null,null,null,null,"jędrzejowski","Małogoszcz"]
[null,null,null,null,null,null,null,null,null,null,null,null,null,null,null,null,null,null,null,null,null,null,null,null,null,"jędrzejowski","Nagłowice"]
[null,null,null,null,null,null,null,null,null,null,null,null,null,null,null,null,null,null,null,null,null,null,null,null,null,"jędrzejowski","Oksa"]
[null,null,null,null,null,null,null,null,null,null,null,null,null,null,null,null,null,null,null,null,null,null,null,null,null,"jędrzejowski","Sędziszów"]
[null,null,null,null,null,null,null,null,null,null,null,null,null,null,null,null,null,null,null,null,null,null,null,null,null,"jędrzejowski","Słupia"]
[null,null,null,null,null,null,null,null,null,null,null,null,null,null,null,null,null,null,null,null,null,null,null,null,null,"jędrzejowski","Sobków"]
[null,null,null,null,null,null,null,null,null,null,null,null,null,null,null,null,null,null,null,null,null,null,null,null,null,"jędrzejowski","Wodzisław"]
[null,null,null,null,null,null,null,null,null,null,null,null,null,null,null,null,null,null,null,null,null,null,null,null,null,"kazimierski","Bejsce"]
[null,null,null,null,null,null,null,null,null,null,null,null,null,null,null,null,null,null,null,null,null,null,null,null,null,"kazimierski","Czarnocin"]
[null,null,null,null,null,null,null,null,null,null,null,null,null,null,null,null,null,null,null,null,null,null,null,null,null,"kazimierski","Kazimierza Wielka"]
[null,null,null,null,null,null,null,null,null,null,null,null,null,null,null,null,null,null,null,null,null,null,null,null,null,"kazimierski","Opatowiec"]
[null,null,null,null,null,null,null,null,null,null,null,null,null,null,null,null,null,null,null,null,null,null,null,null,null,"kazimierski","Skalbmierz"]
[null,null,null,null,null,null,null,null,null,null,null,null,null,null,null,null,null,null,null,null,null,null,null,null,null,"opatowski","Baćkowice"]
[null,null,null,null,null,null,null,null,null,null,null,null,null,null,null,null,null,null,null,null,null,null,null,null,null,"opatowski","Iwaniska"]
[null,null,null,null,null,null,null,null,null,null,null,null,null,null,null,null,null,null,null,null,null,null,null,null,null,"opatowski","Lipnik"]
[null,null,null,null,null,null,null,null,null,null,null,null,null,null,null,null,null,null,null,null,null,null,null,null,null,"opatowski","Opatów"]
[null,null,null,null,null,null,null,null,null,null,null,null,null,null,null,null,null,null,null,null,null,null,null,null,null,"opatowski","Ożarów"]
[null,null,null,null,null,null,null,null,null,null,null,null,null,null,null,null,null,null,null,null,null,null,null,null,null,"opatowski","Sadowie"]
[null,null,null,null,null,null,null,null,null,null,null,null,null,null,null,null,null,null,null,null,null,null,null,null,null,"opatowski","Tarłów"]
[null,null,null,null,null,null,null,null,null,null,null,null,null,null,null,null,null,null,null,null,null,null,null,null,null,"opatowski","Wojciechowice"]
[null,null,null,null,null,null,null,null,null,null,null,null,null,null,null,null,null,null,null,null,null,null,null,null,null,"pińczowski","Działoszyce"]
[null,null,null,null,null,null,null,null,null,null,null,null,null,null,null,null,null,null,null,null,null,null,null,null,null,"pińczowski","Kije"]
[null,null,null,null,null,null,null,null,null,null,null,null,null,null,null,null,null,null,null,null,null,null,null,null,null,"pińczowski","Michałów"]
[null,null,null,null,null,null,null,null,null,null,null,null,null,null,null,null,null,null,null,null,null,null,null,null,null,"pińczowski","Pińczów"]
[null,null,null,null,null,null,null,null,null,null,null,null,null,null,null,null,null,null,null,null,null,null,null,null,null,"pińczowski","Złota"]
[null,null,null,null,null,null,null,null,null,null,null,null,null,null,null,null,null,null,null,null,null,null,null,null,null,"sandomierski","Sandomierz"]
[null,null,null,null,null,null,null,null,null,null,null,null,null,null,null,null,null,null,null,null,null,null,null,null,null,"sandomierski","Dwikozy"]
[null,null,null,null,null,null,null,null,null,null,null,null,null,null,null,null,null,null,null,null,null,null,null,null,null,"sandomierski","Klimontów"]
[null,null,null,null,null,null,null,null,null,null,null,null,null,null,null,null,null,null,null,null,null,null,null,null,null,"sandomierski","Koprzywnica"]
[null,null,null,null,null,null,null,null,null,null,null,null,null,null,null,null,null,null,null,null,null,null,null,null,null,"sandomierski","Łoniów"]
[null,null,null,null,null,null,null,null,null,null,null,null,null,null,null,null,null,null,null,null,null,null,null,null,null,"sandomierski","Obrazów"]
[null,null,null,null,null,null,null,null,null,null,null,null,null,null,null,null,null,null,null,null,null,null,null,null,null,"sandomierski","Samborzec"]
[null,null,null,null,null,null,null,null,null,null,null,null,null,null,null,null,null,null,null,null,null,null,null,null,null,"sandomierski","Wilczyce"]
[null,null,null,null,null,null,null,null,null,null,null,null,null,null,null,null,null,null,null,null,null,null,null,null,null,"sandomierski","Zawichost"]
[null,null,null,null,null,null,null,null,null,null,null,null,null,null,null,null,null,null,null,null,null,null,null,null,null,"staszowski","Bogoria"]
[null,null,null,null,null,null,null,null,null,null,null,null,null,null,null,null,null,null,null,null,null,null,null,null,null,"staszowski","Łubnice"]
[null,null,null,null,null,null,null,null,null,null,null,null,null,null,null,null,null,null,null,null,null,null,null,null,null,"staszowski","Oleśnica"]
[null,null,null,null,null,null,null,null,null,null,null,null,null,null,null,null,null,null,null,null,null,null,null,null,null,"staszowski","Osiek"]
[null,null,null,null,null,null,null,null,null,null,null,null,null,null,null,null,null,null,null,null,null,null,null,null,null,"staszowski","Połaniec"]
[null,null,null,null,null,null,null,null,null,null,null,null,null,null,null,null,null,null,null,null,null,null,null,null,null,"staszowski","Rytwiany"]
[null,null,null,null,null,null,null,null,null,null,null,null,null,null,null,null,null,null,null,null,null,null,null,null,null,"staszowski","Staszów"]
[null,null,null,null,null,null,null,null,null,null,null,null,null,null,null,null,null,null,null,null,null,null,null,null,null,"staszowski","Szydłów"]
[null,null,null,null,null,null,null,null,null,null,null,null,null,null,null,null,null,null,null,null,null,null,null,null,null,"włoszczowski","Kluczewsko"]
[null,null,null,null,null,null,null,null,null,null,null,null,null,null,null,null,null,null,null,null,null,null,null,null,null,"włoszczowski","Krasocin"]
[null,null,null,null,null,null,null,null,null,null,null,null,null,null,null,null,null,null,null,null,null,null,null,null,null,"włoszczowski","Moskorzew"]
[null,null,null,null,null,null,null,null,null,null,null,null,null,null,null,null,null,null,null,null,null,null,null,null,null,"włoszczowski","Radków"]
[null,null,null,null,null,null,null,null,null,null,null,null,null,null,null,null,null,null,null,null,null,null,null,null,null,"włoszczowski","Secemin"]
[null,null,null,null,null,null,null,null,null,null,null,null,null,null,null,null,null,null,null,null,null,null,null,null,null,"włoszczowski","Włoszczowa"]
[null,null,null,null,null,null,null,null,null,null,null,null,null,null,null,null,null,null,null,null,null,null,null,null,null,"bialski","Terespol"]
[null,null,null,null,null,null,null,null,null,null,null,null,null,null,null,null,null,null,null,null,null,null,null,null,null,"bialski","Biała Podlaska"]
[null,null,null,null,null,null,null,null,null,null,null,null,null,null,null,null,null,null,null,null,null,null,null,null,null,"bialski","Drelów"]
[null,null,null,null,null,null,null,null,null,null,null,null,null,null,null,null,null,null,null,null,null,null,null,null,null,"bialski","Janów Podlaski"]
[null,null,null,null,null,null,null,null,null,null,null,null,null,null,null,null,null,null,null,null,null,null,null,null,null,"bialski","Kodeń"]
[null,null,null,null,null,null,null,null,null,null,null,null,null,null,null,null,null,null,null,null,null,null,null,null,null,"bialski","Konstantynów"]
[null,null,null,null,null,null,null,null,null,null,null,null,null,null,null,null,null,null,null,null,null,null,null,null,null,"bialski","Leśna Podlaska"]
[null,null,null,null,null,null,null,null,null,null,null,null,null,null,null,null,null,null,null,null,null,null,null,null,null,"bialski","Łomazy"]
[null,null,null,null,null,null,null,null,null,null,null,null,null,null,null,null,null,null,null,null,null,null,null,null,null,"bialski","Międzyrzec Podlaski"]
[null,null,null,null,null,null,null,null,null,null,null,null,null,null,null,null,null,null,null,null,null,null,null,null,null,"bialski","Piszczac"]
[null,null,null,null,null,null,null,null,null,null,null,null,null,null,null,null,null,null,null,null,null,null,null,null,null,"bialski","Rokitno"]
[null,null,null,null,null,null,null,null,null,null,null,null,null,null,null,null,null,null,null,null,null,null,null,null,null,"bialski","Rossosz"]
[null,null,null,null,null,null,null,null,null,null,null,null,null,null,null,null,null,null,null,null,null,null,null,null,null,"bialski","Sławatycze"]
[null,null,null,null,null,null,null,null,null,null,null,null,null,null,null,null,null,null,null,null,null,null,null,null,null,"bialski","Sosnówka"]
[null,null,null,null,null,null,null,null,null,null,null,null,null,null,null,null,null,null,null,null,null,null,null,null,null,"bialski","Terespol"]
[null,null,null,null,null,null,null,null,null,null,null,null,null,null,null,null,null,null,null,null,null,null,null,null,null,"bialski","Tuczna"]
[null,null,null,null,null,null,null,null,null,null,null,null,null,null,null,null,null,null,null,null,null,null,null,null,null,"bialski","Wisznice"]
[null,null,null,null,null,null,null,null,null,null,null,null,null,null,null,null,null,null,null,null,null,null,null,null,null,"bialski","Zalesie"]
[null,null,null,null,null,null,null,null,null,null,null,null,null,null,null,null,null,null,null,null,null,null,null,null,null,"parczewski","Dębowa Kłoda"]
[null,null,null,null,null,null,null,null,null,null,null,null,null,null,null,null,null,null,null,null,null,null,null,null,null,"parczewski","Jabłoń"]
[null,null,null,null,null,null,null,null,null,null,null,null,null,null,null,null,null,null,null,null,null,null,null,null,null,"parczewski","Milanów"]
[null,null,null,null,null,null,null,null,null,null,null,null,null,null,null,null,null,null,null,null,null,null,null,null,null,"parczewski","Parczew"]
[null,null,null,null,null,null,null,null,null,null,null,null,null,null,null,null,null,null,null,null,null,null,null,null,null,"parczewski","Podedwórze"]
[null,null,null,null,null,null,null,null,null,null,null,null,null,null,null,null,null,null,null,null,null,null,null,null,null,"parczewski","Siemień"]
[null,null,null,null,null,null,null,null,null,null,null,null,null,null,null,null,null,null,null,null,null,null,null,null,null,"parczewski","Sosnowica"]
[null,null,null,null,null,null,null,null,null,null,null,null,null,null,null,null,null,null,null,null,null,null,null,null,null,"radzyński","Radzyń Podlaski"]
[null,null,null,null,null,null,null,null,null,null,null,null,null,null,null,null,null,null,null,null,null,null,null,null,null,"radzyński","Borki"]
[null,null,null,null,null,null,null,null,null,null,null,null,null,null,null,null,null,null,null,null,null,null,null,null,null,"radzyński","Czemierniki"]
[null,null,null,null,null,null,null,null,null,null,null,null,null,null,null,null,null,null,null,null,null,null,null,null,null,"radzyński","Kąkolewnica"]
[null,null,null,null,null,null,null,null,null,null,null,null,null,null,null,null,null,null,null,null,null,null,null,null,null,"radzyński","Komarówka Podlaska"]
[null,null,null,null,null,null,null,null,null,null,null,null,null,null,null,null,null,null,null,null,null,null,null,null,null,"radzyński","Radzyń Podlaski"]
[null,null,null,null,null,null,null,null,null,null,null,null,null,null,null,null,null,null,null,null,null,null,null,null,null,"radzyński","Ulan-Majorat"]
[null,null,null,null,null,null,null,null,null,null,null,null,null,null,null,null,null,null,null,null,null,null,null,null,null,"radzyński","Wohyń"]
[null,null,null,null,null,null,null,null,null,null,null,null,null,null,null,null,null,null,null,null,null,null,null,null,null,"włodawski","Włodawa"]
[null,null,null,null,null,null,null,null,null,null,null,null,null,null,null,null,null,null,null,null,null,null,null,null,null,"włodawski","Hanna"]
[null,null,null,null,null,null,null,null,null,null,null,null,null,null,null,null,null,null,null,null,null,null,null,null,null,"włodawski","Hańsk"]
[null,null,null,null,null,null,null,null,null,null,null,null,null,null,null,null,null,null,null,null,null,null,null,null,null,"włodawski","Stary Brus"]
[null,null,null,null,null,null,null,null,null,null,null,null,null,null,null,null,null,null,null,null,null,null,null,null,null,"włodawski","Urszulin"]
[null,null,null,null,null,null,null,null,null,null,null,null,null,null,null,null,null,null,null,null,null,null,null,null,null,"włodawski","Włodawa"]
[null,null,null,null,null,null,null,null,null,null,null,null,null,null,null,null,null,null,null,null,null,null,null,null,null,"włodawski","Wola Uhruska"]
[null,null,null,null,null,null,null,null,null,null,null,null,null,null,null,null,null,null,null,null,null,null,null,null,null,"włodawski","Wyryki"]
[null,null,null,null,null,null,null,null,null,null,null,null,null,null,null,null,null,null,null,null,null,null,null,null,null,"Biała Podlaska","Biała Podlaska"]
[null,null,null,null,null,null,null,null,null,null,null,null,null,null,null,null,null,null,null,null,null,null,null,null,null,"biłgorajski","Aleksandrów"]
[null,null,null,null,null,null,null,null,null,null,null,null,null,null,null,null,null,null,null,null,null,null,null,null,null,"biłgorajski","Biłgoraj"]
[null,null,null,null,null,null,null,null,null,null,null,null,null,null,null,null,null,null,null,null,null,null,null,null,null,"biłgorajski","Biszcza"]
[null,null,null,null,null,null,null,null,null,null,null,null,null,null,null,null,null,null,null,null,null,null,null,null,null,"biłgorajski","Frampol"]
[null,null,null,null,null,null,null,null,null,null,null,null,null,null,null,null,null,null,null,null,null,null,null,null,null,"biłgorajski","Goraj"]
[null,null,null,null,null,null,null,null,null,null,null,null,null,null,null,null,null,null,null,null,null,null,null,null,null,"biłgorajski","Józefów"]
[null,null,null,null,null,null,null,null,null,null,null,null,null,null,null,null,null,null,null,null,null,null,null,null,null,"biłgorajski","Księżpol"]
[null,null,null,null,null,null,null,null,null,null,null,null,null,null,null,null,null,null,null,null,null,null,null,null,null,"biłgorajski","Łukowa"]
[null,null,null,null,null,null,null,null,null,null,null,null,null,null,null,null,null,null,null,null,null,null,null,null,null,"biłgorajski","Obsza"]
[null,null,null,null,null,null,null,null,null,null,null,null,null,null,null,null,null,null,null,null,null,null,null,null,null,"biłgorajski","Potok Górny"]
[null,null,null,null,null,null,null,null,null,null,null,null,null,null,null,null,null,null,null,null,null,null,null,null,null,"biłgorajski","Tarnogród"]
[null,null,null,null,null,null,null,null,null,null,null,null,null,null,null,null,null,null,null,null,null,null,null,null,null,"biłgorajski","Tereszpol"]
[null,null,null,null,null,null,null,null,null,null,null,null,null,null,null,null,null,null,null,null,null,null,null,null,null,"biłgorajski","Turobin"]
[null,null,null,null,null,null,null,null,null,null,null,null,null,null,null,null,null,null,null,null,null,null,null,null,null,"chełmski","Rejowiec Fabryczny"]
[null,null,null,null,null,null,null,null,null,null,null,null,null,null,null,null,null,null,null,null,null,null,null,null,null,"chełmski","Białopole"]
[null,null,null,null,null,null,null,null,null,null,null,null,null,null,null,null,null,null,null,null,null,null,null,null,null,"chełmski","Chełm"]
[null,null,null,null,null,null,null,null,null,null,null,null,null,null,null,null,null,null,null,null,null,null,null,null,null,"chełmski","Dorohusk"]
[null,null,null,null,null,null,null,null,null,null,null,null,null,null,null,null,null,null,null,null,null,null,null,null,null,"chełmski","Dubienka"]
[null,null,null,null,null,null,null,null,null,null,null,null,null,null,null,null,null,null,null,null,null,null,null,null,null,"chełmski","Kamień"]
[null,null,null,null,null,null,null,null,null,null,null,null,null,null,null,null,null,null,null,null,null,null,null,null,null,"chełmski","Leśniowice"]
[null,null,null,null,null,null,null,null,null,null,null,null,null,null,null,null,null,null,null,null,null,null,null,null,null,"chełmski","Rejowiec Fabryczny"]
[null,null,null,null,null,null,null,null,null,null,null,null,null,null,null,null,null,null,null,null,null,null,null,null,null,"chełmski","Ruda-Huta"]
[null,null,null,null,null,null,null,null,null,null,null,null,null,null,null,null,null,null,null,null,null,null,null,null,null,"chełmski","Sawin"]
[null,null,null,null,null,null,null,null,null,null,null,null,null,null,null,null,null,null,null,null,null,null,null,null,null,"chełmski","Siedliszcze"]
[null,null,null,null,null,null,null,null,null,null,null,null,null,null,null,null,null,null,null,null,null,null,null,null,null,"chełmski","Wierzbica"]
[null,null,null,null,null,null,null,null,null,null,null,null,null,null,null,null,null,null,null,null,null,null,null,null,null,"chełmski","Wojsławice"]
[null,null,null,null,null,null,null,null,null,null,null,null,null,null,null,null,null,null,null,null,null,null,null,null,null,"chełmski","Żmudź"]
[null,null,null,null,null,null,null,null,null,null,null,null,null,null,null,null,null,null,null,null,null,null,null,null,null,"chełmski","Rejowiec"]
[null,null,null,null,null,null,null,null,null,null,null,null,null,null,null,null,null,null,null,null,null,null,null,null,null,"hrubieszowski","Dołhobyczów"]
[null,null,null,null,null,null,null,null,null,null,null,null,null,null,null,null,null,null,null,null,null,null,null,null,null,"hrubieszowski","Horodło"]
[null,null,null,null,null,null,null,null,null,null,null,null,null,null,null,null,null,null,null,null,null,null,null,null,null,"hrubieszowski","Hrubieszów"]
[null,null,null,null,null,null,null,null,null,null,null,null,null,null,null,null,null,null,null,null,null,null,null,null,null,"hrubieszowski","Mircze"]
[null,null,null,null,null,null,null,null,null,null,null,null,null,null,null,null,null,null,null,null,null,null,null,null,null,"hrubieszowski","Trzeszczany"]
[null,null,null,null,null,null,null,null,null,null,null,null,null,null,null,null,null,null,null,null,null,null,null,null,null,"hrubieszowski","Uchanie"]
[null,null,null,null,null,null,null,null,null,null,null,null,null,null,null,null,null,null,null,null,null,null,null,null,null,"hrubieszowski","Werbkowice"]
[null,null,null,null,null,null,null,null,null,null,null,null,null,null,null,null,null,null,null,null,null,null,null,null,null,"krasnostawski","Krasnystaw"]
[null,null,null,null,null,null,null,null,null,null,null,null,null,null,null,null,null,null,null,null,null,null,null,null,null,"krasnostawski","Fajsławice"]
[null,null,null,null,null,null,null,null,null,null,null,null,null,null,null,null,null,null,null,null,null,null,null,null,null,"krasnostawski","Gorzków"]
[null,null,null,null,null,null,null,null,null,null,null,null,null,null,null,null,null,null,null,null,null,null,null,null,null,"krasnostawski","Izbica"]
[null,null,null,null,null,null,null,null,null,null,null,null,null,null,null,null,null,null,null,null,null,null,null,null,null,"krasnostawski","Krasnystaw"]
[null,null,null,null,null,null,null,null,null,null,null,null,null,null,null,null,null,null,null,null,null,null,null,null,null,"krasnostawski","Kraśniczyn"]
[null,null,null,null,null,null,null,null,null,null,null,null,null,null,null,null,null,null,null,null,null,null,null,null,null,"krasnostawski","Łopiennik Górny"]
[null,null,null,null,null,null,null,null,null,null,null,null,null,null,null,null,null,null,null,null,null,null,null,null,null,"krasnostawski","Rudnik"]
[null,null,null,null,null,null,null,null,null,null,null,null,null,null,null,null,null,null,null,null,null,null,null,null,null,"krasnostawski","Siennica Różana"]
[null,null,null,null,null,null,null,null,null,null,null,null,null,null,null,null,null,null,null,null,null,null,null,null,null,"krasnostawski","Żółkiewka"]
[null,null,null,null,null,null,null,null,null,null,null,null,null,null,null,null,null,null,null,null,null,null,null,null,null,"tomaszowski","Tomaszów Lubelski"]
[null,null,null,null,null,null,null,null,null,null,null,null,null,null,null,null,null,null,null,null,null,null,null,null,null,"tomaszowski","Bełżec"]
[null,null,null,null,null,null,null,null,null,null,null,null,null,null,null,null,null,null,null,null,null,null,null,null,null,"tomaszowski","Jarczów"]
[null,null,null,null,null,null,null,null,null,null,null,null,null,null,null,null,null,null,null,null,null,null,null,null,null,"tomaszowski","Krynice"]
[null,null,null,null,null,null,null,null,null,null,null,null,null,null,null,null,null,null,null,null,null,null,null,null,null,"tomaszowski","Lubycza Królewska"]
[null,null,null,null,null,null,null,null,null,null,null,null,null,null,null,null,null,null,null,null,null,null,null,null,null,"tomaszowski","Łaszczów"]
[null,null,null,null,null,null,null,null,null,null,null,null,null,null,null,null,null,null,null,null,null,null,null,null,null,"tomaszowski","Rachanie"]
[null,null,null,null,null,null,null,null,null,null,null,null,null,null,null,null,null,null,null,null,null,null,null,null,null,"tomaszowski","Susiec"]
[null,null,null,null,null,null,null,null,null,null,null,null,null,null,null,null,null,null,null,null,null,null,null,null,null,"tomaszowski","Tarnawatka"]
[null,null,null,null,null,null,null,null,null,null,null,null,null,null,null,null,null,null,null,null,null,null,null,null,null,"tomaszowski","Telatyn"]
[null,null,null,null,null,null,null,null,null,null,null,null,null,null,null,null,null,null,null,null,null,null,null,null,null,"tomaszowski","Tomaszów Lubelski"]
[null,null,null,null,null,null,null,null,null,null,null,null,null,null,null,null,null,null,null,null,null,null,null,null,null,"tomaszowski","Tyszowce"]
[null,null,null,null,null,null,null,null,null,null,null,null,null,null,null,null,null,null,null,null,null,null,null,null,null,"tomaszowski","Ulhówek"]
[null,null,null,null,null,null,null,null,null,null,null,null,null,null,null,null,null,null,null,null,null,null,null,null,null,"zamojski","Adamów"]
[null,null,null,null,null,null,null,null,null,null,null,null,null,null,null,null,null,null,null,null,null,null,null,null,null,"zamojski","Grabowiec"]
[null,null,null,null,null,null,null,null,null,null,null,null,null,null,null,null,null,null,null,null,null,null,null,null,null,"zamojski","Komarów-Osada"]
[null,null,null,null,null,null,null,null,null,null,null,null,null,null,null,null,null,null,null,null,null,null,null,null,null,"zamojski","Krasnobród"]
[null,null,null,null,null,null,null,null,null,null,null,null,null,null,null,null,null,null,null,null,null,null,null,null,null,"zamojski","Łabunie"]
[null,null,null,null,null,null,null,null,null,null,null,null,null,null,null,null,null,null,null,null,null,null,null,null,null,"zamojski","Miączyn"]
[null,null,null,null,null,null,null,null,null,null,null,null,null,null,null,null,null,null,null,null,null,null,null,null,null,"zamojski","Nielisz"]
[null,null,null,null,null,null,null,null,null,null,null,null,null,null,null,null,null,null,null,null,null,null,null,null,null,"zamojski","Radecznica"]
[null,null,null,null,null,null,null,null,null,null,null,null,null,null,null,null,null,null,null,null,null,null,null,null,null,"zamojski","Sitno"]
[null,null,null,null,null,null,null,null,null,null,null,null,null,null,null,null,null,null,null,null,null,null,null,null,null,"zamojski","Skierbieszów"]
[null,null,null,null,null,null,null,null,null,null,null,null,null,null,null,null,null,null,null,null,null,null,null,null,null,"zamojski","Stary Zamość"]
[null,null,null,null,null,null,null,null,null,null,null,null,null,null,null,null,null,null,null,null,null,null,null,null,null,"zamojski","Sułów"]
[null,null,null,null,null,null,null,null,null,null,null,null,null,null,null,null,null,null,null,null,null,null,null,null,null,"zamojski","Szczebrzeszyn"]
[null,null,null,null,null,null,null,null,null,null,null,null,null,null,null,null,null,null,null,null,null,null,null,null,null,"zamojski","Zamość"]
[null,null,null,null,null,null,null,null,null,null,null,null,null,null,null,null,null,null,null,null,null,null,null,null,null,"zamojski","Zwierzyniec"]
[null,null,null,null,null,null,null,null,null,null,null,null,null,null,null,null,null,null,null,null,null,null,null,null,null,"Chełm","Chełm"]
[null,null,null,null,null,null,null,null,null,null,null,null,null,null,null,null,null,null,null,null,null,null,null,null,null,"Zamość","Zamość"]
[null,null,null,null,null,null,null,null,null,null,null,null,null,null,null,null,null,null,null,null,null,null,null,null,null,"lubartowski","Lubartów"]
[null,null,null,null,null,null,null,null,null,null,null,null,null,null,null,null,null,null,null,null,null,null,null,null,null,"lubartowski","Abramów"]
[null,null,null,null,null,null,null,null,null,null,null,null,null,null,null,null,null,null,null,null,null,null,null,null,null,"lubartowski","Firlej"]
[null,null,null,null,null,null,null,null,null,null,null,null,null,null,null,null,null,null,null,null,null,null,null,null,null,"lubartowski","Jeziorzany"]
[null,null,null,null,null,null,null,null,null,null,null,null,null,null,null,null,null,null,null,null,null,null,null,null,null,"lubartowski","Kamionka"]
[null,null,null,null,null,null,null,null,null,null,null,null,null,null,null,null,null,null,null,null,null,null,null,null,null,"lubartowski","Kock"]
[null,null,null,null,null,null,null,null,null,null,null,null,null,null,null,null,null,null,null,null,null,null,null,null,null,"lubartowski","Lubartów"]
[null,null,null,null,null,null,null,null,null,null,null,null,null,null,null,null,null,null,null,null,null,null,null,null,null,"lubartowski","Michów"]
[null,null,null,null,null,null,null,null,null,null,null,null,null,null,null,null,null,null,null,null,null,null,null,null,null,"lubartowski","Niedźwiada"]
[null,null,null,null,null,null,null,null,null,null,null,null,null,null,null,null,null,null,null,null,null,null,null,null,null,"lubartowski","Ostrów Lubelski"]
[null,null,null,null,null,null,null,null,null,null,null,null,null,null,null,null,null,null,null,null,null,null,null,null,null,"lubartowski","Ostrówek"]
[null,null,null,null,null,null,null,null,null,null,null,null,null,null,null,null,null,null,null,null,null,null,null,null,null,"lubartowski","Serniki"]
[null,null,null,null,null,null,null,null,null,null,null,null,null,null,null,null,null,null,null,null,null,null,null,null,null,"lubartowski","Uścimów"]
[null,null,null,null,null,null,null,null,null,null,null,null,null,null,null,null,null,null,null,null,null,null,null,null,null,"lubelski","Bełżyce"]
[null,null,null,null,null,null,null,null,null,null,null,null,null,null,null,null,null,null,null,null,null,null,null,null,null,"lubelski","Borzechów"]
[null,null,null,null,null,null,null,null,null,null,null,null,null,null,null,null,null,null,null,null,null,null,null,null,null,"lubelski","Bychawa"]
[null,null,null,null,null,null,null,null,null,null,null,null,null,null,null,null,null,null,null,null,null,null,null,null,null,"lubelski","Garbów"]
[null,null,null,null,null,null,null,null,null,null,null,null,null,null,null,null,null,null,null,null,null,null,null,null,null,"lubelski","Głusk"]
[null,null,null,null,null,null,null,null,null,null,null,null,null,null,null,null,null,null,null,null,null,null,null,null,null,"lubelski","Jabłonna"]
[null,null,null,null,null,null,null,null,null,null,null,null,null,null,null,null,null,null,null,null,null,null,null,null,null,"lubelski","Jastków"]
[null,null,null,null,null,null,null,null,null,null,null,null,null,null,null,null,null,null,null,null,null,null,null,null,null,"lubelski","Konopnica"]
[null,null,null,null,null,null,null,null,null,null,null,null,null,null,null,null,null,null,null,null,null,null,null,null,null,"lubelski","Krzczonów"]
[null,null,null,null,null,null,null,null,null,null,null,null,null,null,null,null,null,null,null,null,null,null,null,null,null,"lubelski","Niedrzwica Duża"]
[null,null,null,null,null,null,null,null,null,null,null,null,null,null,null,null,null,null,null,null,null,null,null,null,null,"lubelski","Niemce"]
[null,null,null,null,null,null,null,null,null,null,null,null,null,null,null,null,null,null,null,null,null,null,null,null,null,"lubelski","Strzyżewice"]
[null,null,null,null,null,null,null,null,null,null,null,null,null,null,null,null,null,null,null,null,null,null,null,null,null,"lubelski","Wojciechów"]
[null,null,null,null,null,null,null,null,null,null,null,null,null,null,null,null,null,null,null,null,null,null,null,null,null,"lubelski","Wólka"]
[null,null,null,null,null,null,null,null,null,null,null,null,null,null,null,null,null,null,null,null,null,null,null,null,null,"lubelski","Wysokie"]
[null,null,null,null,null,null,null,null,null,null,null,null,null,null,null,null,null,null,null,null,null,null,null,null,null,"lubelski","Zakrzew"]
[null,null,null,null,null,null,null,null,null,null,null,null,null,null,null,null,null,null,null,null,null,null,null,null,null,"łęczyński","Cyców"]
[null,null,null,null,null,null,null,null,null,null,null,null,null,null,null,null,null,null,null,null,null,null,null,null,null,"łęczyński","Ludwin"]
[null,null,null,null,null,null,null,null,null,null,null,null,null,null,null,null,null,null,null,null,null,null,null,null,null,"łęczyński","Łęczna"]
[null,null,null,null,null,null,null,null,null,null,null,null,null,null,null,null,null,null,null,null,null,null,null,null,null,"łęczyński","Milejów"]
[null,null,null,null,null,null,null,null,null,null,null,null,null,null,null,null,null,null,null,null,null,null,null,null,null,"łęczyński","Puchaczów"]
[null,null,null,null,null,null,null,null,null,null,null,null,null,null,null,null,null,null,null,null,null,null,null,null,null,"łęczyński","Spiczyn"]
[null,null,null,null,null,null,null,null,null,null,null,null,null,null,null,null,null,null,null,null,null,null,null,null,null,"świdnicki","Świdnik"]
[null,null,null,null,null,null,null,null,null,null,null,null,null,null,null,null,null,null,null,null,null,null,null,null,null,"świdnicki","Mełgiew"]
[null,null,null,null,null,null,null,null,null,null,null,null,null,null,null,null,null,null,null,null,null,null,null,null,null,"świdnicki","Piaski"]
[null,null,null,null,null,null,null,null,null,null,null,null,null,null,null,null,null,null,null,null,null,null,null,null,null,"świdnicki","Rybczewice"]
[null,null,null,null,null,null,null,null,null,null,null,null,null,null,null,null,null,null,null,null,null,null,null,null,null,"świdnicki","Trawniki"]
[null,null,null,null,null,null,null,null,null,null,null,null,null,null,null,null,null,null,null,null,null,null,null,null,null,"Lublin","Lublin"]
[null,null,null,null,null,null,null,null,null,null,null,null,null,null,null,null,null,null,null,null,null,null,null,null,null,"janowski","Batorz"]
[null,null,null,null,null,null,null,null,null,null,null,null,null,null,null,null,null,null,null,null,null,null,null,null,null,"janowski","Chrzanów"]
[null,null,null,null,null,null,null,null,null,null,null,null,null,null,null,null,null,null,null,null,null,null,null,null,null,"janowski","Dzwola"]
[null,null,null,null,null,null,null,null,null,null,null,null,null,null,null,null,null,null,null,null,null,null,null,null,null,"janowski","Godziszów"]
[null,null,null,null,null,null,null,null,null,null,null,null,null,null,null,null,null,null,null,null,null,null,null,null,null,"janowski","Janów Lubelski"]
[null,null,null,null,null,null,null,null,null,null,null,null,null,null,null,null,null,null,null,null,null,null,null,null,null,"janowski","Modliborzyce"]
[null,null,null,null,null,null,null,null,null,null,null,null,null,null,null,null,null,null,null,null,null,null,null,null,null,"janowski","Potok Wielki"]
[null,null,null,null,null,null,null,null,null,null,null,null,null,null,null,null,null,null,null,null,null,null,null,null,null,"kraśnicki","Kraśnik"]
[null,null,null,null,null,null,null,null,null,null,null,null,null,null,null,null,null,null,null,null,null,null,null,null,null,"kraśnicki","Annopol"]
[null,null,null,null,null,null,null,null,null,null,null,null,null,null,null,null,null,null,null,null,null,null,null,null,null,"kraśnicki","Dzierzkowice"]
[null,null,null,null,null,null,null,null,null,null,null,null,null,null,null,null,null,null,null,null,null,null,null,null,null,"kraśnicki","Gościeradów"]
[null,null,null,null,null,null,null,null,null,null,null,null,null,null,null,null,null,null,null,null,null,null,null,null,null,"kraśnicki","Kraśnik"]
[null,null,null,null,null,null,null,null,null,null,null,null,null,null,null,null,null,null,null,null,null,null,null,null,null,"kraśnicki","Szastarka"]
[null,null,null,null,null,null,null,null,null,null,null,null,null,null,null,null,null,null,null,null,null,null,null,null,null,"kraśnicki","Trzydnik Duży"]
[null,null,null,null,null,null,null,null,null,null,null,null,null,null,null,null,null,null,null,null,null,null,null,null,null,"kraśnicki","Urzędów"]
[null,null,null,null,null,null,null,null,null,null,null,null,null,null,null,null,null,null,null,null,null,null,null,null,null,"kraśnicki","Wilkołaz"]
[null,null,null,null,null,null,null,null,null,null,null,null,null,null,null,null,null,null,null,null,null,null,null,null,null,"kraśnicki","Zakrzówek"]
[null,null,null,null,null,null,null,null,null,null,null,null,null,null,null,null,null,null,null,null,null,null,null,null,null,"łukowski","Stoczek Łukowski"]
[null,null,null,null,null,null,null,null,null,null,null,null,null,null,null,null,null,null,null,null,null,null,null,null,null,"łukowski","Adamów"]
[null,null,null,null,null,null,null,null,null,null,null,null,null,null,null,null,null,null,null,null,null,null,null,null,null,"łukowski","Krzywda"]
[null,null,null,null,null,null,null,null,null,null,null,null,null,null,null,null,null,null,null,null,null,null,null,null,null,"łukowski","Łuków"]
[null,null,null,null,null,null,null,null,null,null,null,null,null,null,null,null,null,null,null,null,null,null,null,null,null,"łukowski","Serokomla"]
[null,null,null,null,null,null,null,null,null,null,null,null,null,null,null,null,null,null,null,null,null,null,null,null,null,"łukowski","Stanin"]
[null,null,null,null,null,null,null,null,null,null,null,null,null,null,null,null,null,null,null,null,null,null,null,null,null,"łukowski","Stoczek Łukowski"]
[null,null,null,null,null,null,null,null,null,null,null,null,null,null,null,null,null,null,null,null,null,null,null,null,null,"łukowski","Trzebieszów"]
[null,null,null,null,null,null,null,null,null,null,null,null,null,null,null,null,null,null,null,null,null,null,null,null,null,"łukowski","Wojcieszków"]
[null,null,null,null,null,null,null,null,null,null,null,null,null,null,null,null,null,null,null,null,null,null,null,null,null,"łukowski","Wola Mysłowska"]
[null,null,null,null,null,null,null,null,null,null,null,null,null,null,null,null,null,null,null,null,null,null,null,null,null,"opolski","Chodel"]
[null,null,null,null,null,null,null,null,null,null,null,null,null,null,null,null,null,null,null,null,null,null,null,null,null,"opolski","Józefów nad Wisłą"]
[null,null,null,null,null,null,null,null,null,null,null,null,null,null,null,null,null,null,null,null,null,null,null,null,null,"opolski","Karczmiska"]
[null,null,null,null,null,null,null,null,null,null,null,null,null,null,null,null,null,null,null,null,null,null,null,null,null,"opolski","Łaziska"]
[null,null,null,null,null,null,null,null,null,null,null,null,null,null,null,null,null,null,null,null,null,null,null,null,null,"opolski","Opole Lubelskie"]
[null,null,null,null,null,null,null,null,null,null,null,null,null,null,null,null,null,null,null,null,null,null,null,null,null,"opolski","Poniatowa"]
[null,null,null,null,null,null,null,null,null,null,null,null,null,null,null,null,null,null,null,null,null,null,null,null,null,"opolski","Wilków"]
[null,null,null,null,null,null,null,null,null,null,null,null,null,null,null,null,null,null,null,null,null,null,null,null,null,"puławski","Puławy"]
[null,null,null,null,null,null,null,null,null,null,null,null,null,null,null,null,null,null,null,null,null,null,null,null,null,"puławski","Baranów"]
[null,null,null,null,null,null,null,null,null,null,null,null,null,null,null,null,null,null,null,null,null,null,null,null,null,"puławski","Janowiec"]
[null,null,null,null,null,null,null,null,null,null,null,null,null,null,null,null,null,null,null,null,null,null,null,null,null,"puławski","Kazimierz Dolny"]
[null,null,null,null,null,null,null,null,null,null,null,null,null,null,null,null,null,null,null,null,null,null,null,null,null,"puławski","Końskowola"]
[null,null,null,null,null,null,null,null,null,null,null,null,null,null,null,null,null,null,null,null,null,null,null,null,null,"puławski","Kurów"]
[null,null,null,null,null,null,null,null,null,null,null,null,null,null,null,null,null,null,null,null,null,null,null,null,null,"puławski","Markuszów"]
[null,null,null,null,null,null,null,null,null,null,null,null,null,null,null,null,null,null,null,null,null,null,null,null,null,"puławski","Nałęczów"]
[null,null,null,null,null,null,null,null,null,null,null,null,null,null,null,null,null,null,null,null,null,null,null,null,null,"puławski","Puławy"]
[null,null,null,null,null,null,null,null,null,null,null,null,null,null,null,null,null,null,null,null,null,null,null,null,null,"puławski","Wąwolnica"]
[null,null,null,null,null,null,null,null,null,null,null,null,null,null,null,null,null,null,null,null,null,null,null,null,null,"puławski","Żyrzyn"]
[null,null,null,null,null,null,null,null,null,null,null,null,null,null,null,null,null,null,null,null,null,null,null,null,null,"rycki","Dęblin"]
[null,null,null,null,null,null,null,null,null,null,null,null,null,null,null,null,null,null,null,null,null,null,null,null,null,"rycki","Kłoczew"]
[null,null,null,null,null,null,null,null,null,null,null,null,null,null,null,null,null,null,null,null,null,null,null,null,null,"rycki","Nowodwór"]
[null,null,null,null,null,null,null,null,null,null,null,null,null,null,null,null,null,null,null,null,null,null,null,null,null,"rycki","Ryki"]
[null,null,null,null,null,null,null,null,null,null,null,null,null,null,null,null,null,null,null,null,null,null,null,null,null,"rycki","Stężyca"]
[null,null,null,null,null,null,null,null,null,null,null,null,null,null,null,null,null,null,null,null,null,null,null,null,null,"rycki","Ułęż"]
[null,null,null,null,null,null,null,null,null,null,null,null,null,null,null,null,null,null,null,null,null,null,null,null,null,"bieszczadzki","Czarna"]
[null,null,null,null,null,null,null,null,null,null,null,null,null,null,null,null,null,null,null,null,null,null,null,null,null,"bieszczadzki","Lutowiska"]
[null,null,null,null,null,null,null,null,null,null,null,null,null,null,null,null,null,null,null,null,null,null,null,null,null,"bieszczadzki","Ustrzyki Dolne"]
[null,null,null,null,null,null,null,null,null,null,null,null,null,null,null,null,null,null,null,null,null,null,null,null,null,"brzozowski","Brzozów"]
[null,null,null,null,null,null,null,null,null,null,null,null,null,null,null,null,null,null,null,null,null,null,null,null,null,"brzozowski","Domaradz"]
[null,null,null,null,null,null,null,null,null,null,null,null,null,null,null,null,null,null,null,null,null,null,null,null,null,"brzozowski","Dydnia"]
[null,null,null,null,null,null,null,null,null,null,null,null,null,null,null,null,null,null,null,null,null,null,null,null,null,"brzozowski","Haczów"]
[null,null,null,null,null,null,null,null,null,null,null,null,null,null,null,null,null,null,null,null,null,null,null,null,null,"brzozowski","Jasienica Rosielna"]
[null,null,null,null,null,null,null,null,null,null,null,null,null,null,null,null,null,null,null,null,null,null,null,null,null,"brzozowski","Nozdrzec"]
[null,null,null,null,null,null,null,null,null,null,null,null,null,null,null,null,null,null,null,null,null,null,null,null,null,"jasielski","Jasło"]
[null,null,null,null,null,null,null,null,null,null,null,null,null,null,null,null,null,null,null,null,null,null,null,null,null,"jasielski","Brzyska"]
[null,null,null,null,null,null,null,null,null,null,null,null,null,null,null,null,null,null,null,null,null,null,null,null,null,"jasielski","Dębowiec"]
[null,null,null,null,null,null,null,null,null,null,null,null,null,null,null,null,null,null,null,null,null,null,null,null,null,"jasielski","Jasło"]
[null,null,null,null,null,null,null,null,null,null,null,null,null,null,null,null,null,null,null,null,null,null,null,null,null,"jasielski","Kołaczyce"]
[null,null,null,null,null,null,null,null,null,null,null,null,null,null,null,null,null,null,null,null,null,null,null,null,null,"jasielski","Krempna"]
[null,null,null,null,null,null,null,null,null,null,null,null,null,null,null,null,null,null,null,null,null,null,null,null,null,"jasielski","Nowy Żmigród"]
[null,null,null,null,null,null,null,null,null,null,null,null,null,null,null,null,null,null,null,null,null,null,null,null,null,"jasielski","Osiek Jasielski"]
[null,null,null,null,null,null,null,null,null,null,null,null,null,null,null,null,null,null,null,null,null,null,null,null,null,"jasielski","Skołyszyn"]
[null,null,null,null,null,null,null,null,null,null,null,null,null,null,null,null,null,null,null,null,null,null,null,null,null,"jasielski","Tarnowiec"]
[null,null,null,null,null,null,null,null,null,null,null,null,null,null,null,null,null,null,null,null,null,null,null,null,null,"krośnieński","Chorkówka"]
[null,null,null,null,null,null,null,null,null,null,null,null,null,null,null,null,null,null,null,null,null,null,null,null,null,"krośnieński","Dukla"]
[null,null,null,null,null,null,null,null,null,null,null,null,null,null,null,null,null,null,null,null,null,null,null,null,null,"krośnieński","Iwonicz-Zdrój"]
[null,null,null,null,null,null,null,null,null,null,null,null,null,null,null,null,null,null,null,null,null,null,null,null,null,"krośnieński","Jedlicze"]
[null,null,null,null,null,null,null,null,null,null,null,null,null,null,null,null,null,null,null,null,null,null,null,null,null,"krośnieński","Korczyna"]
[null,null,null,null,null,null,null,null,null,null,null,null,null,null,null,null,null,null,null,null,null,null,null,null,null,"krośnieński","Krościenko Wyżne"]
[null,null,null,null,null,null,null,null,null,null,null,null,null,null,null,null,null,null,null,null,null,null,null,null,null,"krośnieński","Miejsce Piastowe"]
[null,null,null,null,null,null,null,null,null,null,null,null,null,null,null,null,null,null,null,null,null,null,null,null,null,"krośnieński","Rymanów"]
[null,null,null,null,null,null,null,null,null,null,null,null,null,null,null,null,null,null,null,null,null,null,null,null,null,"krośnieński","Wojaszówka"]
[null,null,null,null,null,null,null,null,null,null,null,null,null,null,null,null,null,null,null,null,null,null,null,null,null,"krośnieński","Jaśliska"]
[null,null,null,null,null,null,null,null,null,null,null,null,null,null,null,null,null,null,null,null,null,null,null,null,null,"sanocki","Sanok"]
[null,null,null,null,null,null,null,null,null,null,null,null,null,null,null,null,null,null,null,null,null,null,null,null,null,"sanocki","Besko"]
[null,null,null,null,null,null,null,null,null,null,null,null,null,null,null,null,null,null,null,null,null,null,null,null,null,"sanocki","Bukowsko"]
[null,null,null,null,null,null,null,null,null,null,null,null,null,null,null,null,null,null,null,null,null,null,null,null,null,"sanocki","Komańcza"]
[null,null,null,null,null,null,null,null,null,null,null,null,null,null,null,null,null,null,null,null,null,null,null,null,null,"sanocki","Sanok"]
[null,null,null,null,null,null,null,null,null,null,null,null,null,null,null,null,null,null,null,null,null,null,null,null,null,"sanocki","Tyrawa Wołoska"]
[null,null,null,null,null,null,null,null,null,null,null,null,null,null,null,null,null,null,null,null,null,null,null,null,null,"sanocki","Zagórz"]
[null,null,null,null,null,null,null,null,null,null,null,null,null,null,null,null,null,null,null,null,null,null,null,null,null,"sanocki","Zarszyn"]
[null,null,null,null,null,null,null,null,null,null,null,null,null,null,null,null,null,null,null,null,null,null,null,null,null,"leski","Baligród"]
[null,null,null,null,null,null,null,null,null,null,null,null,null,null,null,null,null,null,null,null,null,null,null,null,null,"leski","Cisna"]
[null,null,null,null,null,null,null,null,null,null,null,null,null,null,null,null,null,null,null,null,null,null,null,null,null,"leski","Lesko"]
[null,null,null,null,null,null,null,null,null,null,null,null,null,null,null,null,null,null,null,null,null,null,null,null,null,"leski","Olszanica"]
[null,null,null,null,null,null,null,null,null,null,null,null,null,null,null,null,null,null,null,null,null,null,null,null,null,"leski","Solina"]
[null,null,null,null,null,null,null,null,null,null,null,null,null,null,null,null,null,null,null,null,null,null,null,null,null,"Krosno","Krosno"]
[null,null,null,null,null,null,null,null,null,null,null,null,null,null,null,null,null,null,null,null,null,null,null,null,null,"jarosławski","Jarosław"]
[null,null,null,null,null,null,null,null,null,null,null,null,null,null,null,null,null,null,null,null,null,null,null,null,null,"jarosławski","Radymno"]
[null,null,null,null,null,null,null,null,null,null,null,null,null,null,null,null,null,null,null,null,null,null,null,null,null,"jarosławski","Chłopice"]
[null,null,null,null,null,null,null,null,null,null,null,null,null,null,null,null,null,null,null,null,null,null,null,null,null,"jarosławski","Jarosław"]
[null,null,null,null,null,null,null,null,null,null,null,null,null,null,null,null,null,null,null,null,null,null,null,null,null,"jarosławski","Laszki"]
[null,null,null,null,null,null,null,null,null,null,null,null,null,null,null,null,null,null,null,null,null,null,null,null,null,"jarosławski","Pawłosiów"]
[null,null,null,null,null,null,null,null,null,null,null,null,null,null,null,null,null,null,null,null,null,null,null,null,null,"jarosławski","Pruchnik"]
[null,null,null,null,null,null,null,null,null,null,null,null,null,null,null,null,null,null,null,null,null,null,null,null,null,"jarosławski","Radymno"]
[null,null,null,null,null,null,null,null,null,null,null,null,null,null,null,null,null,null,null,null,null,null,null,null,null,"jarosławski","Rokietnica"]
[null,null,null,null,null,null,null,null,null,null,null,null,null,null,null,null,null,null,null,null,null,null,null,null,null,"jarosławski","Roźwienica"]
[null,null,null,null,null,null,null,null,null,null,null,null,null,null,null,null,null,null,null,null,null,null,null,null,null,"jarosławski","Wiązownica"]
[null,null,null,null,null,null,null,null,null,null,null,null,null,null,null,null,null,null,null,null,null,null,null,null,null,"lubaczowski","Lubaczów"]
[null,null,null,null,null,null,null,null,null,null,null,null,null,null,null,null,null,null,null,null,null,null,null,null,null,"lubaczowski","Cieszanów"]
[null,null,null,null,null,null,null,null,null,null,null,null,null,null,null,null,null,null,null,null,null,null,null,null,null,"lubaczowski","Horyniec-Zdrój"]
[null,null,null,null,null,null,null,null,null,null,null,null,null,null,null,null,null,null,null,null,null,null,null,null,null,"lubaczowski","Lubaczów"]
[null,null,null,null,null,null,null,null,null,null,null,null,null,null,null,null,null,null,null,null,null,null,null,null,null,"lubaczowski","Narol"]
[null,null,null,null,null,null,null,null,null,null,null,null,null,null,null,null,null,null,null,null,null,null,null,null,null,"lubaczowski","Oleszyce"]
[null,null,null,null,null,null,null,null,null,null,null,null,null,null,null,null,null,null,null,null,null,null,null,null,null,"lubaczowski","Stary Dzików"]
[null,null,null,null,null,null,null,null,null,null,null,null,null,null,null,null,null,null,null,null,null,null,null,null,null,"lubaczowski","Wielkie Oczy"]
[null,null,null,null,null,null,null,null,null,null,null,null,null,null,null,null,null,null,null,null,null,null,null,null,null,"przemyski","Bircza"]
[null,null,null,null,null,null,null,null,null,null,null,null,null,null,null,null,null,null,null,null,null,null,null,null,null,"przemyski","Dubiecko"]
[null,null,null,null,null,null,null,null,null,null,null,null,null,null,null,null,null,null,null,null,null,null,null,null,null,"przemyski","Fredropol"]
[null,null,null,null,null,null,null,null,null,null,null,null,null,null,null,null,null,null,null,null,null,null,null,null,null,"przemyski","Krasiczyn"]
[null,null,null,null,null,null,null,null,null,null,null,null,null,null,null,null,null,null,null,null,null,null,null,null,null,"przemyski","Krzywcza"]
[null,null,null,null,null,null,null,null,null,null,null,null,null,null,null,null,null,null,null,null,null,null,null,null,null,"przemyski","Medyka"]
[null,null,null,null,null,null,null,null,null,null,null,null,null,null,null,null,null,null,null,null,null,null,null,null,null,"przemyski","Orły"]
[null,null,null,null,null,null,null,null,null,null,null,null,null,null,null,null,null,null,null,null,null,null,null,null,null,"przemyski","Przemyśl"]
[null,null,null,null,null,null,null,null,null,null,null,null,null,null,null,null,null,null,null,null,null,null,null,null,null,"przemyski","Stubno"]
[null,null,null,null,null,null,null,null,null,null,null,null,null,null,null,null,null,null,null,null,null,null,null,null,null,"przemyski","Żurawica"]
[null,null,null,null,null,null,null,null,null,null,null,null,null,null,null,null,null,null,null,null,null,null,null,null,null,"przeworski","Przeworsk"]
[null,null,null,null,null,null,null,null,null,null,null,null,null,null,null,null,null,null,null,null,null,null,null,null,null,"przeworski","Adamówka"]
[null,null,null,null,null,null,null,null,null,null,null,null,null,null,null,null,null,null,null,null,null,null,null,null,null,"przeworski","Gać"]
[null,null,null,null,null,null,null,null,null,null,null,null,null,null,null,null,null,null,null,null,null,null,null,null,null,"przeworski","Jawornik Polski"]
[null,null,null,null,null,null,null,null,null,null,null,null,null,null,null,null,null,null,null,null,null,null,null,null,null,"przeworski","Kańczuga"]
[null,null,null,null,null,null,null,null,null,null,null,null,null,null,null,null,null,null,null,null,null,null,null,null,null,"przeworski","Przeworsk"]
[null,null,null,null,null,null,null,null,null,null,null,null,null,null,null,null,null,null,null,null,null,null,null,null,null,"przeworski","Sieniawa"]
[null,null,null,null,null,null,null,null,null,null,null,null,null,null,null,null,null,null,null,null,null,null,null,null,null,"przeworski","Tryńcza"]
[null,null,null,null,null,null,null,null,null,null,null,null,null,null,null,null,null,null,null,null,null,null,null,null,null,"przeworski","Zarzecze"]
[null,null,null,null,null,null,null,null,null,null,null,null,null,null,null,null,null,null,null,null,null,null,null,null,null,"Przemyśl","Przemyśl"]
[null,null,null,null,null,null,null,null,null,null,null,null,null,null,null,null,null,null,null,null,null,null,null,null,null,"kolbuszowski","Cmolas"]
[null,null,null,null,null,null,null,null,null,null,null,null,null,null,null,null,null,null,null,null,null,null,null,null,null,"kolbuszowski","Kolbuszowa"]
[null,null,null,null,null,null,null,null,null,null,null,null,null,null,null,null,null,null,null,null,null,null,null,null,null,"kolbuszowski","Majdan Królewski"]
[null,null,null,null,null,null,null,null,null,null,null,null,null,null,null,null,null,null,null,null,null,null,null,null,null,"kolbuszowski","Niwiska"]
[null,null,null,null,null,null,null,null,null,null,null,null,null,null,null,null,null,null,null,null,null,null,null,null,null,"kolbuszowski","Raniżów"]
[null,null,null,null,null,null,null,null,null,null,null,null,null,null,null,null,null,null,null,null,null,null,null,null,null,"kolbuszowski","Dzikowiec"]
[null,null,null,null,null,null,null,null,null,null,null,null,null,null,null,null,null,null,null,null,null,null,null,null,null,"łańcucki","Łańcut"]
[null,null,null,null,null,null,null,null,null,null,null,null,null,null,null,null,null,null,null,null,null,null,null,null,null,"łańcucki","Białobrzegi"]
[null,null,null,null,null,null,null,null,null,null,null,null,null,null,null,null,null,null,null,null,null,null,null,null,null,"łańcucki","Czarna"]
[null,null,null,null,null,null,null,null,null,null,null,null,null,null,null,null,null,null,null,null,null,null,null,null,null,"łańcucki","Łańcut"]
[null,null,null,null,null,null,null,null,null,null,null,null,null,null,null,null,null,null,null,null,null,null,null,null,null,"łańcucki","Markowa"]
[null,null,null,null,null,null,null,null,null,null,null,null,null,null,null,null,null,null,null,null,null,null,null,null,null,"łańcucki","Rakszawa"]
[null,null,null,null,null,null,null,null,null,null,null,null,null,null,null,null,null,null,null,null,null,null,null,null,null,"łańcucki","Żołynia"]
[null,null,null,null,null,null,null,null,null,null,null,null,null,null,null,null,null,null,null,null,null,null,null,null,null,"ropczycko-sędziszowski","Iwierzyce"]
[null,null,null,null,null,null,null,null,null,null,null,null,null,null,null,null,null,null,null,null,null,null,null,null,null,"ropczycko-sędziszowski","Ostrów"]
[null,null,null,null,null,null,null,null,null,null,null,null,null,null,null,null,null,null,null,null,null,null,null,null,null,"ropczycko-sędziszowski","Ropczyce"]
[null,null,null,null,null,null,null,null,null,null,null,null,null,null,null,null,null,null,null,null,null,null,null,null,null,"ropczycko-sędziszowski","Sędziszów Małopolski"]
[null,null,null,null,null,null,null,null,null,null,null,null,null,null,null,null,null,null,null,null,null,null,null,null,null,"ropczycko-sędziszowski","Wielopole Skrzyńskie"]
[null,null,null,null,null,null,null,null,null,null,null,null,null,null,null,null,null,null,null,null,null,null,null,null,null,"rzeszowski","Dynów"]
[null,null,null,null,null,null,null,null,null,null,null,null,null,null,null,null,null,null,null,null,null,null,null,null,null,"rzeszowski","Błażowa"]
[null,null,null,null,null,null,null,null,null,null,null,null,null,null,null,null,null,null,null,null,null,null,null,null,null,"rzeszowski","Boguchwała"]
[null,null,null,null,null,null,null,null,null,null,null,null,null,null,null,null,null,null,null,null,null,null,null,null,null,"rzeszowski","Chmielnik"]
[null,null,null,null,null,null,null,null,null,null,null,null,null,null,null,null,null,null,null,null,null,null,null,null,null,"rzeszowski","Dynów"]
[null,null,null,null,null,null,null,null,null,null,null,null,null,null,null,null,null,null,null,null,null,null,null,null,null,"rzeszowski","Głogów Małopolski"]
[null,null,null,null,null,null,null,null,null,null,null,null,null,null,null,null,null,null,null,null,null,null,null,null,null,"rzeszowski","Hyżne"]
[null,null,null,null,null,null,null,null,null,null,null,null,null,null,null,null,null,null,null,null,null,null,null,null,null,"rzeszowski","Kamień"]
[null,null,null,null,null,null,null,null,null,null,null,null,null,null,null,null,null,null,null,null,null,null,null,null,null,"rzeszowski","Krasne"]
[null,null,null,null,null,null,null,null,null,null,null,null,null,null,null,null,null,null,null,null,null,null,null,null,null,"rzeszowski","Lubenia"]
[null,null,null,null,null,null,null,null,null,null,null,null,null,null,null,null,null,null,null,null,null,null,null,null,null,"rzeszowski","Sokołów Małopolski"]
[null,null,null,null,null,null,null,null,null,null,null,null,null,null,null,null,null,null,null,null,null,null,null,null,null,"rzeszowski","Świlcza"]
[null,null,null,null,null,null,null,null,null,null,null,null,null,null,null,null,null,null,null,null,null,null,null,null,null,"rzeszowski","Trzebownisko"]
[null,null,null,null,null,null,null,null,null,null,null,null,null,null,null,null,null,null,null,null,null,null,null,null,null,"rzeszowski","Tyczyn"]
[null,null,null,null,null,null,null,null,null,null,null,null,null,null,null,null,null,null,null,null,null,null,null,null,null,"strzyżowski","Czudec"]
[null,null,null,null,null,null,null,null,null,null,null,null,null,null,null,null,null,null,null,null,null,null,null,null,null,"strzyżowski","Frysztak"]
[null,null,null,null,null,null,null,null,null,null,null,null,null,null,null,null,null,null,null,null,null,null,null,null,null,"strzyżowski","Niebylec"]
[null,null,null,null,null,null,null,null,null,null,null,null,null,null,null,null,null,null,null,null,null,null,null,null,null,"strzyżowski","Strzyżów"]
[null,null,null,null,null,null,null,null,null,null,null,null,null,null,null,null,null,null,null,null,null,null,null,null,null,"strzyżowski","Wiśniowa"]
[null,null,null,null,null,null,null,null,null,null,null,null,null,null,null,null,null,null,null,null,null,null,null,null,null,"Rzeszów","Rzeszów"]
[null,null,null,null,null,null,null,null,null,null,null,null,null,null,null,null,null,null,null,null,null,null,null,null,null,"dębicki","Dębica"]
[null,null,null,null,null,null,null,null,null,null,null,null,null,null,null,null,null,null,null,null,null,null,null,null,null,"dębicki","Brzostek"]
[null,null,null,null,null,null,null,null,null,null,null,null,null,null,null,null,null,null,null,null,null,null,null,null,null,"dębicki","Czarna"]
[null,null,null,null,null,null,null,null,null,null,null,null,null,null,null,null,null,null,null,null,null,null,null,null,null,"dębicki","Dębica"]
[null,null,null,null,null,null,null,null,null,null,null,null,null,null,null,null,null,null,null,null,null,null,null,null,null,"dębicki","Jodłowa"]
[null,null,null,null,null,null,null,null,null,null,null,null,null,null,null,null,null,null,null,null,null,null,null,null,null,"dębicki","Pilzno"]
[null,null,null,null,null,null,null,null,null,null,null,null,null,null,null,null,null,null,null,null,null,null,null,null,null,"dębicki","Żyraków"]
[null,null,null,null,null,null,null,null,null,null,null,null,null,null,null,null,null,null,null,null,null,null,null,null,null,"leżajski","Leżajsk"]
[null,null,null,null,null,null,null,null,null,null,null,null,null,null,null,null,null,null,null,null,null,null,null,null,null,"leżajski","Grodzisko Dolne"]
[null,null,null,null,null,null,null,null,null,null,null,null,null,null,null,null,null,null,null,null,null,null,null,null,null,"leżajski","Kuryłówka"]
[null,null,null,null,null,null,null,null,null,null,null,null,null,null,null,null,null,null,null,null,null,null,null,null,null,"leżajski","Leżajsk"]
[null,null,null,null,null,null,null,null,null,null,null,null,null,null,null,null,null,null,null,null,null,null,null,null,null,"leżajski","Nowa Sarzyna"]
[null,null,null,null,null,null,null,null,null,null,null,null,null,null,null,null,null,null,null,null,null,null,null,null,null,"mielecki","Mielec"]
[null,null,null,null,null,null,null,null,null,null,null,null,null,null,null,null,null,null,null,null,null,null,null,null,null,"mielecki","Borowa"]
[null,null,null,null,null,null,null,null,null,null,null,null,null,null,null,null,null,null,null,null,null,null,null,null,null,"mielecki","Czermin"]
[null,null,null,null,null,null,null,null,null,null,null,null,null,null,null,null,null,null,null,null,null,null,null,null,null,"mielecki","Gawłuszowice"]
[null,null,null,null,null,null,null,null,null,null,null,null,null,null,null,null,null,null,null,null,null,null,null,null,null,"mielecki","Mielec"]
[null,null,null,null,null,null,null,null,null,null,null,null,null,null,null,null,null,null,null,null,null,null,null,null,null,"mielecki","Padew Narodowa"]
[null,null,null,null,null,null,null,null,null,null,null,null,null,null,null,null,null,null,null,null,null,null,null,null,null,"mielecki","Przecław"]
[null,null,null,null,null,null,null,null,null,null,null,null,null,null,null,null,null,null,null,null,null,null,null,null,null,"mielecki","Radomyśl Wielki"]
[null,null,null,null,null,null,null,null,null,null,null,null,null,null,null,null,null,null,null,null,null,null,null,null,null,"mielecki","Tuszów Narodowy"]
[null,null,null,null,null,null,null,null,null,null,null,null,null,null,null,null,null,null,null,null,null,null,null,null,null,"mielecki","Wadowice Górne"]
[null,null,null,null,null,null,null,null,null,null,null,null,null,null,null,null,null,null,null,null,null,null,null,null,null,"niżański","Harasiuki"]
[null,null,null,null,null,null,null,null,null,null,null,null,null,null,null,null,null,null,null,null,null,null,null,null,null,"niżański","Jarocin"]
[null,null,null,null,null,null,null,null,null,null,null,null,null,null,null,null,null,null,null,null,null,null,null,null,null,"niżański","Jeżowe"]
[null,null,null,null,null,null,null,null,null,null,null,null,null,null,null,null,null,null,null,null,null,null,null,null,null,"niżański","Krzeszów"]
[null,null,null,null,null,null,null,null,null,null,null,null,null,null,null,null,null,null,null,null,null,null,null,null,null,"niżański","Nisko"]
[null,null,null,null,null,null,null,null,null,null,null,null,null,null,null,null,null,null,null,null,null,null,null,null,null,"niżański","Rudnik nad Sanem"]
[null,null,null,null,null,null,null,null,null,null,null,null,null,null,null,null,null,null,null,null,null,null,null,null,null,"niżański","Ulanów"]
[null,null,null,null,null,null,null,null,null,null,null,null,null,null,null,null,null,null,null,null,null,null,null,null,null,"stalowowolski","Stalowa Wola"]
[null,null,null,null,null,null,null,null,null,null,null,null,null,null,null,null,null,null,null,null,null,null,null,null,null,"stalowowolski","Bojanów"]
[null,null,null,null,null,null,null,null,null,null,null,null,null,null,null,null,null,null,null,null,null,null,null,null,null,"stalowowolski","Pysznica"]
[null,null,null,null,null,null,null,null,null,null,null,null,null,null,null,null,null,null,null,null,null,null,null,null,null,"stalowowolski","Radomyśl nad Sanem"]
[null,null,null,null,null,null,null,null,null,null,null,null,null,null,null,null,null,null,null,null,null,null,null,null,null,"stalowowolski","Zaklików"]
[null,null,null,null,null,null,null,null,null,null,null,null,null,null,null,null,null,null,null,null,null,null,null,null,null,"stalowowolski","Zaleszany"]
[null,null,null,null,null,null,null,null,null,null,null,null,null,null,null,null,null,null,null,null,null,null,null,null,null,"tarnobrzeski","Baranów Sandomierski"]
[null,null,null,null,null,null,null,null,null,null,null,null,null,null,null,null,null,null,null,null,null,null,null,null,null,"tarnobrzeski","Gorzyce"]
[null,null,null,null,null,null,null,null,null,null,null,null,null,null,null,null,null,null,null,null,null,null,null,null,null,"tarnobrzeski","Grębów"]
[null,null,null,null,null,null,null,null,null,null,null,null,null,null,null,null,null,null,null,null,null,null,null,null,null,"tarnobrzeski","Nowa Dęba"]
[null,null,null,null,null,null,null,null,null,null,null,null,null,null,null,null,null,null,null,null,null,null,null,null,null,"Tarnobrzeg","Tarnobrzeg"]
[null,null,null,null,null,null,null,null,null,null,null,null,null,null,null,null,null,null,null,null,null,null,null,null,null,"białostocki","Choroszcz"]
[null,null,null,null,null,null,null,null,null,null,null,null,null,null,null,null,null,null,null,null,null,null,null,null,null,"białostocki","Czarna Białostocka"]
[null,null,null,null,null,null,null,null,null,null,null,null,null,null,null,null,null,null,null,null,null,null,null,null,null,"białostocki","Dobrzyniewo Duże"]
[null,null,null,null,null,null,null,null,null,null,null,null,null,null,null,null,null,null,null,null,null,null,null,null,null,"białostocki","Gródek"]
[null,null,null,null,null,null,null,null,null,null,null,null,null,null,null,null,null,null,null,null,null,null,null,null,null,"białostocki","Juchnowiec Kościelny"]
[null,null,null,null,null,null,null,null,null,null,null,null,null,null,null,null,null,null,null,null,null,null,null,null,null,"białostocki","Łapy"]
[null,null,null,null,null,null,null,null,null,null,null,null,null,null,null,null,null,null,null,null,null,null,null,null,null,"białostocki","Michałowo"]
[null,null,null,null,null,null,null,null,null,null,null,null,null,null,null,null,null,null,null,null,null,null,null,null,null,"białostocki","Poświętne"]
[null,null,null,null,null,null,null,null,null,null,null,null,null,null,null,null,null,null,null,null,null,null,null,null,null,"białostocki","Supraśl"]
[null,null,null,null,null,null,null,null,null,null,null,null,null,null,null,null,null,null,null,null,null,null,null,null,null,"białostocki","Suraż"]
[null,null,null,null,null,null,null,null,null,null,null,null,null,null,null,null,null,null,null,null,null,null,null,null,null,"białostocki","Turośń Kościelna"]
[null,null,null,null,null,null,null,null,null,null,null,null,null,null,null,null,null,null,null,null,null,null,null,null,null,"białostocki","Tykocin"]
[null,null,null,null,null,null,null,null,null,null,null,null,null,null,null,null,null,null,null,null,null,null,null,null,null,"białostocki","Wasilków"]
[null,null,null,null,null,null,null,null,null,null,null,null,null,null,null,null,null,null,null,null,null,null,null,null,null,"białostocki","Zabłudów"]
[null,null,null,null,null,null,null,null,null,null,null,null,null,null,null,null,null,null,null,null,null,null,null,null,null,"białostocki","Zawady"]
[null,null,null,null,null,null,null,null,null,null,null,null,null,null,null,null,null,null,null,null,null,null,null,null,null,"sokólski","Dąbrowa Białostocka"]
[null,null,null,null,null,null,null,null,null,null,null,null,null,null,null,null,null,null,null,null,null,null,null,null,null,"sokólski","Janów"]
[null,null,null,null,null,null,null,null,null,null,null,null,null,null,null,null,null,null,null,null,null,null,null,null,null,"sokólski","Korycin"]
[null,null,null,null,null,null,null,null,null,null,null,null,null,null,null,null,null,null,null,null,null,null,null,null,null,"sokólski","Krynki"]
[null,null,null,null,null,null,null,null,null,null,null,null,null,null,null,null,null,null,null,null,null,null,null,null,null,"sokólski","Kuźnica"]
[null,null,null,null,null,null,null,null,null,null,null,null,null,null,null,null,null,null,null,null,null,null,null,null,null,"sokólski","Nowy Dwór"]
[null,null,null,null,null,null,null,null,null,null,null,null,null,null,null,null,null,null,null,null,null,null,null,null,null,"sokólski","Sidra"]
[null,null,null,null,null,null,null,null,null,null,null,null,null,null,null,null,null,null,null,null,null,null,null,null,null,"sokólski","Sokółka"]
[null,null,null,null,null,null,null,null,null,null,null,null,null,null,null,null,null,null,null,null,null,null,null,null,null,"sokólski","Suchowola"]
[null,null,null,null,null,null,null,null,null,null,null,null,null,null,null,null,null,null,null,null,null,null,null,null,null,"sokólski","Szudziałowo"]
[null,null,null,null,null,null,null,null,null,null,null,null,null,null,null,null,null,null,null,null,null,null,null,null,null,"Białystok","Białystok"]
[null,null,null,null,null,null,null,null,null,null,null,null,null,null,null,null,null,null,null,null,null,null,null,null,null,"bielski","Brańsk"]
[null,null,null,null,null,null,null,null,null,null,null,null,null,null,null,null,null,null,null,null,null,null,null,null,null,"bielski","Bielsk Podlaski"]
[null,null,null,null,null,null,null,null,null,null,null,null,null,null,null,null,null,null,null,null,null,null,null,null,null,"bielski","Boćki"]
[null,null,null,null,null,null,null,null,null,null,null,null,null,null,null,null,null,null,null,null,null,null,null,null,null,"bielski","Brańsk"]
[null,null,null,null,null,null,null,null,null,null,null,null,null,null,null,null,null,null,null,null,null,null,null,null,null,"bielski","Orla"]
[null,null,null,null,null,null,null,null,null,null,null,null,null,null,null,null,null,null,null,null,null,null,null,null,null,"bielski","Rudka"]
[null,null,null,null,null,null,null,null,null,null,null,null,null,null,null,null,null,null,null,null,null,null,null,null,null,"bielski","Wyszki"]
[null,null,null,null,null,null,null,null,null,null,null,null,null,null,null,null,null,null,null,null,null,null,null,null,null,"hajnowski","Hajnówka"]
[null,null,null,null,null,null,null,null,null,null,null,null,null,null,null,null,null,null,null,null,null,null,null,null,null,"hajnowski","Białowieża"]
[null,null,null,null,null,null,null,null,null,null,null,null,null,null,null,null,null,null,null,null,null,null,null,null,null,"hajnowski","Czeremcha"]
[null,null,null,null,null,null,null,null,null,null,null,null,null,null,null,null,null,null,null,null,null,null,null,null,null,"hajnowski","Czyże"]
[null,null,null,null,null,null,null,null,null,null,null,null,null,null,null,null,null,null,null,null,null,null,null,null,null,"hajnowski","Dubicze Cerkiewne"]
[null,null,null,null,null,null,null,null,null,null,null,null,null,null,null,null,null,null,null,null,null,null,null,null,null,"hajnowski","Hajnówka"]
[null,null,null,null,null,null,null,null,null,null,null,null,null,null,null,null,null,null,null,null,null,null,null,null,null,"hajnowski","Kleszczele"]
[null,null,null,null,null,null,null,null,null,null,null,null,null,null,null,null,null,null,null,null,null,null,null,null,null,"hajnowski","Narew"]
[null,null,null,null,null,null,null,null,null,null,null,null,null,null,null,null,null,null,null,null,null,null,null,null,null,"hajnowski","Narewka"]
[null,null,null,null,null,null,null,null,null,null,null,null,null,null,null,null,null,null,null,null,null,null,null,null,null,"kolneński","Kolno"]
[null,null,null,null,null,null,null,null,null,null,null,null,null,null,null,null,null,null,null,null,null,null,null,null,null,"kolneński","Grabowo"]
[null,null,null,null,null,null,null,null,null,null,null,null,null,null,null,null,null,null,null,null,null,null,null,null,null,"kolneński","Kolno"]
[null,null,null,null,null,null,null,null,null,null,null,null,null,null,null,null,null,null,null,null,null,null,null,null,null,"kolneński","Mały Płock"]
[null,null,null,null,null,null,null,null,null,null,null,null,null,null,null,null,null,null,null,null,null,null,null,null,null,"kolneński","Stawiski"]
[null,null,null,null,null,null,null,null,null,null,null,null,null,null,null,null,null,null,null,null,null,null,null,null,null,"kolneński","Turośl"]
[null,null,null,null,null,null,null,null,null,null,null,null,null,null,null,null,null,null,null,null,null,null,null,null,null,"łomżyński","Jedwabne"]
[null,null,null,null,null,null,null,null,null,null,null,null,null,null,null,null,null,null,null,null,null,null,null,null,null,"łomżyński","Łomża"]
[null,null,null,null,null,null,null,null,null,null,null,null,null,null,null,null,null,null,null,null,null,null,null,null,null,"łomżyński","Miastkowo"]
[null,null,null,null,null,null,null,null,null,null,null,null,null,null,null,null,null,null,null,null,null,null,null,null,null,"łomżyński","Nowogród"]
[null,null,null,null,null,null,null,null,null,null,null,null,null,null,null,null,null,null,null,null,null,null,null,null,null,"łomżyński","Piątnica"]
[null,null,null,null,null,null,null,null,null,null,null,null,null,null,null,null,null,null,null,null,null,null,null,null,null,"łomżyński","Przytuły"]
[null,null,null,null,null,null,null,null,null,null,null,null,null,null,null,null,null,null,null,null,null,null,null,null,null,"łomżyński","Śniadowo"]
[null,null,null,null,null,null,null,null,null,null,null,null,null,null,null,null,null,null,null,null,null,null,null,null,null,"łomżyński","Wizna"]
[null,null,null,null,null,null,null,null,null,null,null,null,null,null,null,null,null,null,null,null,null,null,null,null,null,"łomżyński","Zbójna"]
[null,null,null,null,null,null,null,null,null,null,null,null,null,null,null,null,null,null,null,null,null,null,null,null,null,"siemiatycki","Siemiatycze"]
[null,null,null,null,null,null,null,null,null,null,null,null,null,null,null,null,null,null,null,null,null,null,null,null,null,"siemiatycki","Drohiczyn"]
[null,null,null,null,null,null,null,null,null,null,null,null,null,null,null,null,null,null,null,null,null,null,null,null,null,"siemiatycki","Dziadkowice"]
[null,null,null,null,null,null,null,null,null,null,null,null,null,null,null,null,null,null,null,null,null,null,null,null,null,"siemiatycki","Grodzisk"]
[null,null,null,null,null,null,null,null,null,null,null,null,null,null,null,null,null,null,null,null,null,null,null,null,null,"siemiatycki","Mielnik"]
[null,null,null,null,null,null,null,null,null,null,null,null,null,null,null,null,null,null,null,null,null,null,null,null,null,"siemiatycki","Milejczyce"]
[null,null,null,null,null,null,null,null,null,null,null,null,null,null,null,null,null,null,null,null,null,null,null,null,null,"siemiatycki","Nurzec-Stacja"]
[null,null,null,null,null,null,null,null,null,null,null,null,null,null,null,null,null,null,null,null,null,null,null,null,null,"siemiatycki","Perlejewo"]
[null,null,null,null,null,null,null,null,null,null,null,null,null,null,null,null,null,null,null,null,null,null,null,null,null,"siemiatycki","Siemiatycze"]
[null,null,null,null,null,null,null,null,null,null,null,null,null,null,null,null,null,null,null,null,null,null,null,null,null,"wysokomazowiecki","Ciechanowiec"]
[null,null,null,null,null,null,null,null,null,null,null,null,null,null,null,null,null,null,null,null,null,null,null,null,null,"wysokomazowiecki","Czyżew"]
[null,null,null,null,null,null,null,null,null,null,null,null,null,null,null,null,null,null,null,null,null,null,null,null,null,"wysokomazowiecki","Klukowo"]
[null,null,null,null,null,null,null,null,null,null,null,null,null,null,null,null,null,null,null,null,null,null,null,null,null,"wysokomazowiecki","Kobylin-Borzymy"]
[null,null,null,null,null,null,null,null,null,null,null,null,null,null,null,null,null,null,null,null,null,null,null,null,null,"wysokomazowiecki","Kulesze Kościelne"]
[null,null,null,null,null,null,null,null,null,null,null,null,null,null,null,null,null,null,null,null,null,null,null,null,null,"wysokomazowiecki","Nowe Piekuty"]
[null,null,null,null,null,null,null,null,null,null,null,null,null,null,null,null,null,null,null,null,null,null,null,null,null,"wysokomazowiecki","Sokoły"]
[null,null,null,null,null,null,null,null,null,null,null,null,null,null,null,null,null,null,null,null,null,null,null,null,null,"wysokomazowiecki","Szepietowo"]
[null,null,null,null,null,null,null,null,null,null,null,null,null,null,null,null,null,null,null,null,null,null,null,null,null,"wysokomazowiecki","Wysokie Mazowieckie"]
[null,null,null,null,null,null,null,null,null,null,null,null,null,null,null,null,null,null,null,null,null,null,null,null,null,"zambrowski","Zambrów"]
[null,null,null,null,null,null,null,null,null,null,null,null,null,null,null,null,null,null,null,null,null,null,null,null,null,"zambrowski","Kołaki Kościelne"]
[null,null,null,null,null,null,null,null,null,null,null,null,null,null,null,null,null,null,null,null,null,null,null,null,null,"zambrowski","Rutki"]
[null,null,null,null,null,null,null,null,null,null,null,null,null,null,null,null,null,null,null,null,null,null,null,null,null,"zambrowski","Szumowo"]
[null,null,null,null,null,null,null,null,null,null,null,null,null,null,null,null,null,null,null,null,null,null,null,null,null,"zambrowski","Zambrów"]
[null,null,null,null,null,null,null,null,null,null,null,null,null,null,null,null,null,null,null,null,null,null,null,null,null,"Łomża","Łomża"]
[null,null,null,null,null,null,null,null,null,null,null,null,null,null,null,null,null,null,null,null,null,null,null,null,null,"augustowski","Augustów"]
[null,null,null,null,null,null,null,null,null,null,null,null,null,null,null,null,null,null,null,null,null,null,null,null,null,"augustowski","Bargłów Kościelny"]
[null,null,null,null,null,null,null,null,null,null,null,null,null,null,null,null,null,null,null,null,null,null,null,null,null,"augustowski","Lipsk"]
[null,null,null,null,null,null,null,null,null,null,null,null,null,null,null,null,null,null,null,null,null,null,null,null,null,"augustowski","Nowinka"]
[null,null,null,null,null,null,null,null,null,null,null,null,null,null,null,null,null,null,null,null,null,null,null,null,null,"augustowski","Płaska"]
[null,null,null,null,null,null,null,null,null,null,null,null,null,null,null,null,null,null,null,null,null,null,null,null,null,"augustowski","Sztabin"]
[null,null,null,null,null,null,null,null,null,null,null,null,null,null,null,null,null,null,null,null,null,null,null,null,null,"grajewski","Grajewo"]
[null,null,null,null,null,null,null,null,null,null,null,null,null,null,null,null,null,null,null,null,null,null,null,null,null,"grajewski","Radziłów"]
[null,null,null,null,null,null,null,null,null,null,null,null,null,null,null,null,null,null,null,null,null,null,null,null,null,"grajewski","Rajgród"]
[null,null,null,null,null,null,null,null,null,null,null,null,null,null,null,null,null,null,null,null,null,null,null,null,null,"grajewski","Szczuczyn"]
[null,null,null,null,null,null,null,null,null,null,null,null,null,null,null,null,null,null,null,null,null,null,null,null,null,"grajewski","Wąsosz"]
[null,null,null,null,null,null,null,null,null,null,null,null,null,null,null,null,null,null,null,null,null,null,null,null,null,"moniecki","Goniądz"]
[null,null,null,null,null,null,null,null,null,null,null,null,null,null,null,null,null,null,null,null,null,null,null,null,null,"moniecki","Jasionówka"]
[null,null,null,null,null,null,null,null,null,null,null,null,null,null,null,null,null,null,null,null,null,null,null,null,null,"moniecki","Jaświły"]
[null,null,null,null,null,null,null,null,null,null,null,null,null,null,null,null,null,null,null,null,null,null,null,null,null,"moniecki","Knyszyn"]
[null,null,null,null,null,null,null,null,null,null,null,null,null,null,null,null,null,null,null,null,null,null,null,null,null,"moniecki","Krypno"]
[null,null,null,null,null,null,null,null,null,null,null,null,null,null,null,null,null,null,null,null,null,null,null,null,null,"moniecki","Mońki"]
[null,null,null,null,null,null,null,null,null,null,null,null,null,null,null,null,null,null,null,null,null,null,null,null,null,"moniecki","Trzcianne"]
[null,null,null,null,null,null,null,null,null,null,null,null,null,null,null,null,null,null,null,null,null,null,null,null,null,"sejneński","Sejny"]
[null,null,null,null,null,null,null,null,null,null,null,null,null,null,null,null,null,null,null,null,null,null,null,null,null,"sejneński","Giby"]
[null,null,null,null,null,null,null,null,null,null,null,null,null,null,null,null,null,null,null,null,null,null,null,null,null,"sejneński","Krasnopol"]
[null,null,null,null,null,null,null,null,null,null,null,null,null,null,null,null,null,null,null,null,null,null,null,null,null,"sejneński","Puńsk"]
[null,null,null,null,null,null,null,null,null,null,null,null,null,null,null,null,null,null,null,null,null,null,null,null,null,"sejneński","Sejny"]
[null,null,null,null,null,null,null,null,null,null,null,null,null,null,null,null,null,null,null,null,null,null,null,null,null,"suwalski","Bakałarzewo"]
[null,null,null,null,null,null,null,null,null,null,null,null,null,null,null,null,null,null,null,null,null,null,null,null,null,"suwalski","Filipów"]
[null,null,null,null,null,null,null,null,null,null,null,null,null,null,null,null,null,null,null,null,null,null,null,null,null,"suwalski","Jeleniewo"]
[null,null,null,null,null,null,null,null,null,null,null,null,null,null,null,null,null,null,null,null,null,null,null,null,null,"suwalski","Przerośl"]
[null,null,null,null,null,null,null,null,null,null,null,null,null,null,null,null,null,null,null,null,null,null,null,null,null,"suwalski","Raczki"]
[null,null,null,null,null,null,null,null,null,null,null,null,null,null,null,null,null,null,null,null,null,null,null,null,null,"suwalski","Rutka-Tartak"]
[null,null,null,null,null,null,null,null,null,null,null,null,null,null,null,null,null,null,null,null,null,null,null,null,null,"suwalski","Suwałki"]
[null,null,null,null,null,null,null,null,null,null,null,null,null,null,null,null,null,null,null,null,null,null,null,null,null,"suwalski","Szypliszki"]
[null,null,null,null,null,null,null,null,null,null,null,null,null,null,null,null,null,null,null,null,null,null,null,null,null,"suwalski","Wiżajny"]
[null,null,null,null,null,null,null,null,null,null,null,null,null,null,null,null,null,null,null,null,null,null,null,null,null,"Suwałki","Suwałki"]
[null,null,null,null,null,null,null,null,null,null,null,null,null,null,null,null,null,null,null,null,null,null,null,null,null,"Warszawa","Warszawa"]
[null,null,null,null,null,null,null,null,null,null,null,null,null,null,null,null,null,null,null,null,null,null,null,null,null,"Warszawa","Bemowo"]
[null,null,null,null,null,null,null,null,null,null,null,null,null,null,null,null,null,null,null,null,null,null,null,null,null,"Warszawa","Białołęka"]
[null,null,null,null,null,null,null,null,null,null,null,null,null,null,null,null,null,null,null,null,null,null,null,null,null,"Warszawa","Bielany"]
[null,null,null,null,null,null,null,null,null,null,null,null,null,null,null,null,null,null,null,null,null,null,null,null,null,"Warszawa","Mokotów"]
[null,null,null,null,null,null,null,null,null,null,null,null,null,null,null,null,null,null,null,null,null,null,null,null,null,"Warszawa","Ochota"]
[null,null,null,null,null,null,null,null,null,null,null,null,null,null,null,null,null,null,null,null,null,null,null,null,null,"Warszawa","Praga-Południe"]
[null,null,null,null,null,null,null,null,null,null,null,null,null,null,null,null,null,null,null,null,null,null,null,null,null,"Warszawa","Praga-Północ"]
[null,null,null,null,null,null,null,null,null,null,null,null,null,null,null,null,null,null,null,null,null,null,null,null,null,"Warszawa","Rembertów"]
[null,null,null,null,null,null,null,null,null,null,null,null,null,null,null,null,null,null,null,null,null,null,null,null,null,"Warszawa","Śródmieście"]
[null,null,null,null,null,null,null,null,null,null,null,null,null,null,null,null,null,null,null,null,null,null,null,null,null,"Warszawa","Targówek"]
[null,null,null,null,null,null,null,null,null,null,null,null,null,null,null,null,null,null,null,null,null,null,null,null,null,"Warszawa","Ursus"]
[null,null,null,null,null,null,null,null,null,null,null,null,null,null,null,null,null,null,null,null,null,null,null,null,null,"Warszawa","Ursynów"]
[null,null,null,null,null,null,null,null,null,null,null,null,null,null,null,null,null,null,null,null,null,null,null,null,null,"Warszawa","Wawer"]
[null,null,null,null,null,null,null,null,null,null,null,null,null,null,null,null,null,null,null,null,null,null,null,null,null,"Warszawa","Wesoła"]
[null,null,null,null,null,null,null,null,null,null,null,null,null,null,null,null,null,null,null,null,null,null,null,null,null,"Warszawa","Wilanów"]
[null,null,null,null,null,null,null,null,null,null,null,null,null,null,null,null,null,null,null,null,null,null,null,null,null,"Warszawa","Włochy"]
[null,null,null,null,null,null,null,null,null,null,null,null,null,null,null,null,null,null,null,null,null,null,null,null,null,"Warszawa","Wola"]
[null,null,null,null,null,null,null,null,null,null,null,null,null,null,null,null,null,null,null,null,null,null,null,null,null,"Warszawa","Żoliborz"]
[null,null,null,null,null,null,null,null,null,null,null,null,null,null,null,null,null,null,null,null,null,null,null,null,null,"legionowski","Legionowo"]
[null,null,null,null,null,null,null,null,null,null,null,null,null,null,null,null,null,null,null,null,null,null,null,null,null,"legionowski","Jabłonna"]
[null,null,null,null,null,null,null,null,null,null,null,null,null,null,null,null,null,null,null,null,null,null,null,null,null,"legionowski","Nieporęt"]
[null,null,null,null,null,null,null,null,null,null,null,null,null,null,null,null,null,null,null,null,null,null,null,null,null,"legionowski","Serock"]
[null,null,null,null,null,null,null,null,null,null,null,null,null,null,null,null,null,null,null,null,null,null,null,null,null,"legionowski","Wieliszew"]
[null,null,null,null,null,null,null,null,null,null,null,null,null,null,null,null,null,null,null,null,null,null,null,null,null,"miński","Mińsk Mazowiecki"]
[null,null,null,null,null,null,null,null,null,null,null,null,null,null,null,null,null,null,null,null,null,null,null,null,null,"miński","Cegłów"]
[null,null,null,null,null,null,null,null,null,null,null,null,null,null,null,null,null,null,null,null,null,null,null,null,null,"miński","Dębe Wielkie"]
[null,null,null,null,null,null,null,null,null,null,null,null,null,null,null,null,null,null,null,null,null,null,null,null,null,"miński","Dobre"]
[null,null,null,null,null,null,null,null,null,null,null,null,null,null,null,null,null,null,null,null,null,null,null,null,null,"miński","Halinów"]
[null,null,null,null,null,null,null,null,null,null,null,null,null,null,null,null,null,null,null,null,null,null,null,null,null,"miński","Jakubów"]
[null,null,null,null,null,null,null,null,null,null,null,null,null,null,null,null,null,null,null,null,null,null,null,null,null,"miński","Kałuszyn"]
[null,null,null,null,null,null,null,null,null,null,null,null,null,null,null,null,null,null,null,null,null,null,null,null,null,"miński","Latowicz"]
[null,null,null,null,null,null,null,null,null,null,null,null,null,null,null,null,null,null,null,null,null,null,null,null,null,"miński","Mińsk Mazowiecki"]
[null,null,null,null,null,null,null,null,null,null,null,null,null,null,null,null,null,null,null,null,null,null,null,null,null,"miński","Mrozy"]
[null,null,null,null,null,null,null,null,null,null,null,null,null,null,null,null,null,null,null,null,null,null,null,null,null,"miński","Siennica"]
[null,null,null,null,null,null,null,null,null,null,null,null,null,null,null,null,null,null,null,null,null,null,null,null,null,"miński","Stanisławów"]
[null,null,null,null,null,null,null,null,null,null,null,null,null,null,null,null,null,null,null,null,null,null,null,null,null,"miński","Sulejówek"]
[null,null,null,null,null,null,null,null,null,null,null,null,null,null,null,null,null,null,null,null,null,null,null,null,null,"otwocki","Józefów"]
[null,null,null,null,null,null,null,null,null,null,null,null,null,null,null,null,null,null,null,null,null,null,null,null,null,"otwocki","Otwock"]
[null,null,null,null,null,null,null,null,null,null,null,null,null,null,null,null,null,null,null,null,null,null,null,null,null,"otwocki","Celestynów"]
[null,null,null,null,null,null,null,null,null,null,null,null,null,null,null,null,null,null,null,null,null,null,null,null,null,"otwocki","Karczew"]
[null,null,null,null,null,null,null,null,null,null,null,null,null,null,null,null,null,null,null,null,null,null,null,null,null,"otwocki","Kołbiel"]
[null,null,null,null,null,null,null,null,null,null,null,null,null,null,null,null,null,null,null,null,null,null,null,null,null,"otwocki","Osieck"]
[null,null,null,null,null,null,null,null,null,null,null,null,null,null,null,null,null,null,null,null,null,null,null,null,null,"otwocki","Sobienie-Jeziory"]
[null,null,null,null,null,null,null,null,null,null,null,null,null,null,null,null,null,null,null,null,null,null,null,null,null,"otwocki","Wiązowna"]
[null,null,null,null,null,null,null,null,null,null,null,null,null,null,null,null,null,null,null,null,null,null,null,null,null,"wołomiński","Kobyłka"]
[null,null,null,null,null,null,null,null,null,null,null,null,null,null,null,null,null,null,null,null,null,null,null,null,null,"wołomiński","Marki"]
[null,null,null,null,null,null,null,null,null,null,null,null,null,null,null,null,null,null,null,null,null,null,null,null,null,"wołomiński","Ząbki"]
[null,null,null,null,null,null,null,null,null,null,null,null,null,null,null,null,null,null,null,null,null,null,null,null,null,"wołomiński","Zielonka"]
[null,null,null,null,null,null,null,null,null,null,null,null,null,null,null,null,null,null,null,null,null,null,null,null,null,"wołomiński","Dąbrówka"]
[null,null,null,null,null,null,null,null,null,null,null,null,null,null,null,null,null,null,null,null,null,null,null,null,null,"wołomiński","Jadów"]
[null,null,null,null,null,null,null,null,null,null,null,null,null,null,null,null,null,null,null,null,null,null,null,null,null,"wołomiński","Klembów"]
[null,null,null,null,null,null,null,null,null,null,null,null,null,null,null,null,null,null,null,null,null,null,null,null,null,"wołomiński","Poświętne"]
[null,null,null,null,null,null,null,null,null,null,null,null,null,null,null,null,null,null,null,null,null,null,null,null,null,"wołomiński","Radzymin"]
[null,null,null,null,null,null,null,null,null,null,null,null,null,null,null,null,null,null,null,null,null,null,null,null,null,"wołomiński","Strachówka"]
[null,null,null,null,null,null,null,null,null,null,null,null,null,null,null,null,null,null,null,null,null,null,null,null,null,"wołomiński","Tłuszcz"]
[null,null,null,null,null,null,null,null,null,null,null,null,null,null,null,null,null,null,null,null,null,null,null,null,null,"wołomiński","Wołomin"]
[null,null,null,null,null,null,null,null,null,null,null,null,null,null,null,null,null,null,null,null,null,null,null,null,null,"grodziski","Milanówek"]
[null,null,null,null,null,null,null,null,null,null,null,null,null,null,null,null,null,null,null,null,null,null,null,null,null,"grodziski","Podkowa Leśna"]
[null,null,null,null,null,null,null,null,null,null,null,null,null,null,null,null,null,null,null,null,null,null,null,null,null,"grodziski","Baranów"]
[null,null,null,null,null,null,null,null,null,null,null,null,null,null,null,null,null,null,null,null,null,null,null,null,null,"grodziski","Grodzisk Mazowiecki"]
[null,null,null,null,null,null,null,null,null,null,null,null,null,null,null,null,null,null,null,null,null,null,null,null,null,"grodziski","Jaktorów"]
[null,null,null,null,null,null,null,null,null,null,null,null,null,null,null,null,null,null,null,null,null,null,null,null,null,"grodziski","Żabia Wola"]
[null,null,null,null,null,null,null,null,null,null,null,null,null,null,null,null,null,null,null,null,null,null,null,null,null,"nowodworski","Nowy Dwór Mazowiecki"]
[null,null,null,null,null,null,null,null,null,null,null,null,null,null,null,null,null,null,null,null,null,null,null,null,null,"nowodworski","Czosnów"]
[null,null,null,null,null,null,null,null,null,null,null,null,null,null,null,null,null,null,null,null,null,null,null,null,null,"nowodworski","Leoncin"]
[null,null,null,null,null,null,null,null,null,null,null,null,null,null,null,null,null,null,null,null,null,null,null,null,null,"nowodworski","Nasielsk"]
[null,null,null,null,null,null,null,null,null,null,null,null,null,null,null,null,null,null,null,null,null,null,null,null,null,"nowodworski","Pomiechówek"]
[null,null,null,null,null,null,null,null,null,null,null,null,null,null,null,null,null,null,null,null,null,null,null,null,null,"nowodworski","Zakroczym"]
[null,null,null,null,null,null,null,null,null,null,null,null,null,null,null,null,null,null,null,null,null,null,null,null,null,"piaseczyński","Góra Kalwaria"]
[null,null,null,null,null,null,null,null,null,null,null,null,null,null,null,null,null,null,null,null,null,null,null,null,null,"piaseczyński","Konstancin-Jeziorna"]
[null,null,null,null,null,null,null,null,null,null,null,null,null,null,null,null,null,null,null,null,null,null,null,null,null,"piaseczyński","Lesznowola"]
[null,null,null,null,null,null,null,null,null,null,null,null,null,null,null,null,null,null,null,null,null,null,null,null,null,"piaseczyński","Piaseczno"]
[null,null,null,null,null,null,null,null,null,null,null,null,null,null,null,null,null,null,null,null,null,null,null,null,null,"piaseczyński","Prażmów"]
[null,null,null,null,null,null,null,null,null,null,null,null,null,null,null,null,null,null,null,null,null,null,null,null,null,"piaseczyński","Tarczyn"]
[null,null,null,null,null,null,null,null,null,null,null,null,null,null,null,null,null,null,null,null,null,null,null,null,null,"pruszkowski","Piastów"]
[null,null,null,null,null,null,null,null,null,null,null,null,null,null,null,null,null,null,null,null,null,null,null,null,null,"pruszkowski","Pruszków"]
[null,null,null,null,null,null,null,null,null,null,null,null,null,null,null,null,null,null,null,null,null,null,null,null,null,"pruszkowski","Brwinów"]
[null,null,null,null,null,null,null,null,null,null,null,null,null,null,null,null,null,null,null,null,null,null,null,null,null,"pruszkowski","Michałowice"]
[null,null,null,null,null,null,null,null,null,null,null,null,null,null,null,null,null,null,null,null,null,null,null,null,null,"pruszkowski","Nadarzyn"]
[null,null,null,null,null,null,null,null,null,null,null,null,null,null,null,null,null,null,null,null,null,null,null,null,null,"pruszkowski","Raszyn"]
[null,null,null,null,null,null,null,null,null,null,null,null,null,null,null,null,null,null,null,null,null,null,null,null,null,"warszawski zachodni","Błonie"]
[null,null,null,null,null,null,null,null,null,null,null,null,null,null,null,null,null,null,null,null,null,null,null,null,null,"warszawski zachodni","Izabelin"]
[null,null,null,null,null,null,null,null,null,null,null,null,null,null,null,null,null,null,null,null,null,null,null,null,null,"warszawski zachodni","Kampinos"]
[null,null,null,null,null,null,null,null,null,null,null,null,null,null,null,null,null,null,null,null,null,null,null,null,null,"warszawski zachodni","Leszno"]
[null,null,null,null,null,null,null,null,null,null,null,null,null,null,null,null,null,null,null,null,null,null,null,null,null,"warszawski zachodni","Łomianki"]
[null,null,null,null,null,null,null,null,null,null,null,null,null,null,null,null,null,null,null,null,null,null,null,null,null,"warszawski zachodni","Ożarów Mazowiecki"]
[null,null,null,null,null,null,null,null,null,null,null,null,null,null,null,null,null,null,null,null,null,null,null,null,null,"warszawski zachodni","Stare Babice"]
[null,null,null,null,null,null,null,null,null,null,null,null,null,null,null,null,null,null,null,null,null,null,null,null,null,"ciechanowski","Ciechanów"]
[null,null,null,null,null,null,null,null,null,null,null,null,null,null,null,null,null,null,null,null,null,null,null,null,null,"ciechanowski","Glinojeck"]
[null,null,null,null,null,null,null,null,null,null,null,null,null,null,null,null,null,null,null,null,null,null,null,null,null,"ciechanowski","Gołymin-Ośrodek"]
[null,null,null,null,null,null,null,null,null,null,null,null,null,null,null,null,null,null,null,null,null,null,null,null,null,"ciechanowski","Grudusk"]
[null,null,null,null,null,null,null,null,null,null,null,null,null,null,null,null,null,null,null,null,null,null,null,null,null,"ciechanowski","Ojrzeń"]
[null,null,null,null,null,null,null,null,null,null,null,null,null,null,null,null,null,null,null,null,null,null,null,null,null,"ciechanowski","Opinogóra Górna"]
[null,null,null,null,null,null,null,null,null,null,null,null,null,null,null,null,null,null,null,null,null,null,null,null,null,"ciechanowski","Regimin"]
[null,null,null,null,null,null,null,null,null,null,null,null,null,null,null,null,null,null,null,null,null,null,null,null,null,"ciechanowski","Sońsk"]
[null,null,null,null,null,null,null,null,null,null,null,null,null,null,null,null,null,null,null,null,null,null,null,null,null,"mławski","Mława"]
[null,null,null,null,null,null,null,null,null,null,null,null,null,null,null,null,null,null,null,null,null,null,null,null,null,"mławski","Dzierzgowo"]
[null,null,null,null,null,null,null,null,null,null,null,null,null,null,null,null,null,null,null,null,null,null,null,null,null,"mławski","Lipowiec Kościelny"]
[null,null,null,null,null,null,null,null,null,null,null,null,null,null,null,null,null,null,null,null,null,null,null,null,null,"mławski","Radzanów"]
[null,null,null,null,null,null,null,null,null,null,null,null,null,null,null,null,null,null,null,null,null,null,null,null,null,"mławski","Strzegowo"]
[null,null,null,null,null,null,null,null,null,null,null,null,null,null,null,null,null,null,null,null,null,null,null,null,null,"mławski","Stupsk"]
[null,null,null,null,null,null,null,null,null,null,null,null,null,null,null,null,null,null,null,null,null,null,null,null,null,"mławski","Szreńsk"]
[null,null,null,null,null,null,null,null,null,null,null,null,null,null,null,null,null,null,null,null,null,null,null,null,null,"mławski","Szydłowo"]
[null,null,null,null,null,null,null,null,null,null,null,null,null,null,null,null,null,null,null,null,null,null,null,null,null,"mławski","Wieczfnia Kościelna"]
[null,null,null,null,null,null,null,null,null,null,null,null,null,null,null,null,null,null,null,null,null,null,null,null,null,"mławski","Wiśniewo"]
[null,null,null,null,null,null,null,null,null,null,null,null,null,null,null,null,null,null,null,null,null,null,null,null,null,"płoński","Płońsk"]
[null,null,null,null,null,null,null,null,null,null,null,null,null,null,null,null,null,null,null,null,null,null,null,null,null,"płoński","Raciąż"]
[null,null,null,null,null,null,null,null,null,null,null,null,null,null,null,null,null,null,null,null,null,null,null,null,null,"płoński","Baboszewo"]
[null,null,null,null,null,null,null,null,null,null,null,null,null,null,null,null,null,null,null,null,null,null,null,null,null,"płoński","Czerwińsk nad Wisłą"]
[null,null,null,null,null,null,null,null,null,null,null,null,null,null,null,null,null,null,null,null,null,null,null,null,null,"płoński","Dzierzążnia"]
[null,null,null,null,null,null,null,null,null,null,null,null,null,null,null,null,null,null,null,null,null,null,null,null,null,"płoński","Joniec"]
[null,null,null,null,null,null,null,null,null,null,null,null,null,null,null,null,null,null,null,null,null,null,null,null,null,"płoński","Naruszewo"]
[null,null,null,null,null,null,null,null,null,null,null,null,null,null,null,null,null,null,null,null,null,null,null,null,null,"płoński","Nowe Miasto"]
[null,null,null,null,null,null,null,null,null,null,null,null,null,null,null,null,null,null,null,null,null,null,null,null,null,"płoński","Płońsk"]
[null,null,null,null,null,null,null,null,null,null,null,null,null,null,null,null,null,null,null,null,null,null,null,null,null,"płoński","Raciąż"]
[null,null,null,null,null,null,null,null,null,null,null,null,null,null,null,null,null,null,null,null,null,null,null,null,null,"płoński","Sochocin"]
[null,null,null,null,null,null,null,null,null,null,null,null,null,null,null,null,null,null,null,null,null,null,null,null,null,"płoński","Załuski"]
[null,null,null,null,null,null,null,null,null,null,null,null,null,null,null,null,null,null,null,null,null,null,null,null,null,"pułtuski","Gzy"]
[null,null,null,null,null,null,null,null,null,null,null,null,null,null,null,null,null,null,null,null,null,null,null,null,null,"pułtuski","Obryte"]
[null,null,null,null,null,null,null,null,null,null,null,null,null,null,null,null,null,null,null,null,null,null,null,null,null,"pułtuski","Pokrzywnica"]
[null,null,null,null,null,null,null,null,null,null,null,null,null,null,null,null,null,null,null,null,null,null,null,null,null,"pułtuski","Pułtusk"]
[null,null,null,null,null,null,null,null,null,null,null,null,null,null,null,null,null,null,null,null,null,null,null,null,null,"pułtuski","Świercze"]
[null,null,null,null,null,null,null,null,null,null,null,null,null,null,null,null,null,null,null,null,null,null,null,null,null,"pułtuski","Winnica"]
[null,null,null,null,null,null,null,null,null,null,null,null,null,null,null,null,null,null,null,null,null,null,null,null,null,"pułtuski","Zatory"]
[null,null,null,null,null,null,null,null,null,null,null,null,null,null,null,null,null,null,null,null,null,null,null,null,null,"żuromiński","Bieżuń"]
[null,null,null,null,null,null,null,null,null,null,null,null,null,null,null,null,null,null,null,null,null,null,null,null,null,"żuromiński","Kuczbork-Osada"]
[null,null,null,null,null,null,null,null,null,null,null,null,null,null,null,null,null,null,null,null,null,null,null,null,null,"żuromiński","Lubowidz"]
[null,null,null,null,null,null,null,null,null,null,null,null,null,null,null,null,null,null,null,null,null,null,null,null,null,"żuromiński","Lutocin"]
[null,null,null,null,null,null,null,null,null,null,null,null,null,null,null,null,null,null,null,null,null,null,null,null,null,"żuromiński","Siemiątkowo"]
[null,null,null,null,null,null,null,null,null,null,null,null,null,null,null,null,null,null,null,null,null,null,null,null,null,"żuromiński","Żuromin"]
[null,null,null,null,null,null,null,null,null,null,null,null,null,null,null,null,null,null,null,null,null,null,null,null,null,"makowski","Maków Mazowiecki"]
[null,null,null,null,null,null,null,null,null,null,null,null,null,null,null,null,null,null,null,null,null,null,null,null,null,"makowski","Czerwonka"]
[null,null,null,null,null,null,null,null,null,null,null,null,null,null,null,null,null,null,null,null,null,null,null,null,null,"makowski","Karniewo"]
[null,null,null,null,null,null,null,null,null,null,null,null,null,null,null,null,null,null,null,null,null,null,null,null,null,"makowski","Krasnosielc"]
[null,null,null,null,null,null,null,null,null,null,null,null,null,null,null,null,null,null,null,null,null,null,null,null,null,"makowski","Młynarze"]
[null,null,null,null,null,null,null,null,null,null,null,null,null,null,null,null,null,null,null,null,null,null,null,null,null,"makowski","Płoniawy-Bramura"]
[null,null,null,null,null,null,null,null,null,null,null,null,null,null,null,null,null,null,null,null,null,null,null,null,null,"makowski","Różan"]
[null,null,null,null,null,null,null,null,null,null,null,null,null,null,null,null,null,null,null,null,null,null,null,null,null,"makowski","Rzewnie"]
[null,null,null,null,null,null,null,null,null,null,null,null,null,null,null,null,null,null,null,null,null,null,null,null,null,"makowski","Sypniewo"]
[null,null,null,null,null,null,null,null,null,null,null,null,null,null,null,null,null,null,null,null,null,null,null,null,null,"makowski","Szelków"]
[null,null,null,null,null,null,null,null,null,null,null,null,null,null,null,null,null,null,null,null,null,null,null,null,null,"ostrołęcki","Baranowo"]
[null,null,null,null,null,null,null,null,null,null,null,null,null,null,null,null,null,null,null,null,null,null,null,null,null,"ostrołęcki","Czarnia"]
[null,null,null,null,null,null,null,null,null,null,null,null,null,null,null,null,null,null,null,null,null,null,null,null,null,"ostrołęcki","Czerwin"]
[null,null,null,null,null,null,null,null,null,null,null,null,null,null,null,null,null,null,null,null,null,null,null,null,null,"ostrołęcki","Goworowo"]
[null,null,null,null,null,null,null,null,null,null,null,null,null,null,null,null,null,null,null,null,null,null,null,null,null,"ostrołęcki","Kadzidło"]
[null,null,null,null,null,null,null,null,null,null,null,null,null,null,null,null,null,null,null,null,null,null,null,null,null,"ostrołęcki","Lelis"]
[null,null,null,null,null,null,null,null,null,null,null,null,null,null,null,null,null,null,null,null,null,null,null,null,null,"ostrołęcki","Łyse"]
[null,null,null,null,null,null,null,null,null,null,null,null,null,null,null,null,null,null,null,null,null,null,null,null,null,"ostrołęcki","Myszyniec"]
[null,null,null,null,null,null,null,null,null,null,null,null,null,null,null,null,null,null,null,null,null,null,null,null,null,"ostrołęcki","Olszewo-Borki"]
[null,null,null,null,null,null,null,null,null,null,null,null,null,null,null,null,null,null,null,null,null,null,null,null,null,"ostrołęcki","Rzekuń"]
[null,null,null,null,null,null,null,null,null,null,null,null,null,null,null,null,null,null,null,null,null,null,null,null,null,"ostrołęcki","Troszyn"]
[null,null,null,null,null,null,null,null,null,null,null,null,null,null,null,null,null,null,null,null,null,null,null,null,null,"ostrowski","Ostrów Mazowiecka"]
[null,null,null,null,null,null,null,null,null,null,null,null,null,null,null,null,null,null,null,null,null,null,null,null,null,"ostrowski","Andrzejewo"]
[null,null,null,null,null,null,null,null,null,null,null,null,null,null,null,null,null,null,null,null,null,null,null,null,null,"ostrowski","Boguty-Pianki"]
[null,null,null,null,null,null,null,null,null,null,null,null,null,null,null,null,null,null,null,null,null,null,null,null,null,"ostrowski","Brok"]
[null,null,null,null,null,null,null,null,null,null,null,null,null,null,null,null,null,null,null,null,null,null,null,null,null,"ostrowski","Małkinia Górna"]
[null,null,null,null,null,null,null,null,null,null,null,null,null,null,null,null,null,null,null,null,null,null,null,null,null,"ostrowski","Nur"]
[null,null,null,null,null,null,null,null,null,null,null,null,null,null,null,null,null,null,null,null,null,null,null,null,null,"ostrowski","Ostrów Mazowiecka"]
[null,null,null,null,null,null,null,null,null,null,null,null,null,null,null,null,null,null,null,null,null,null,null,null,null,"ostrowski","Stary Lubotyń"]
[null,null,null,null,null,null,null,null,null,null,null,null,null,null,null,null,null,null,null,null,null,null,null,null,null,"ostrowski","Szulborze Wielkie"]
[null,null,null,null,null,null,null,null,null,null,null,null,null,null,null,null,null,null,null,null,null,null,null,null,null,"ostrowski","Wąsewo"]
[null,null,null,null,null,null,null,null,null,null,null,null,null,null,null,null,null,null,null,null,null,null,null,null,null,"ostrowski","Zaręby Kościelne"]
[null,null,null,null,null,null,null,null,null,null,null,null,null,null,null,null,null,null,null,null,null,null,null,null,null,"przasnyski","Przasnysz"]
[null,null,null,null,null,null,null,null,null,null,null,null,null,null,null,null,null,null,null,null,null,null,null,null,null,"przasnyski","Chorzele"]
[null,null,null,null,null,null,null,null,null,null,null,null,null,null,null,null,null,null,null,null,null,null,null,null,null,"przasnyski","Czernice Borowe"]
[null,null,null,null,null,null,null,null,null,null,null,null,null,null,null,null,null,null,null,null,null,null,null,null,null,"przasnyski","Jednorożec"]
[null,null,null,null,null,null,null,null,null,null,null,null,null,null,null,null,null,null,null,null,null,null,null,null,null,"przasnyski","Krasne"]
[null,null,null,null,null,null,null,null,null,null,null,null,null,null,null,null,null,null,null,null,null,null,null,null,null,"przasnyski","Krzynowłoga Mała"]
[null,null,null,null,null,null,null,null,null,null,null,null,null,null,null,null,null,null,null,null,null,null,null,null,null,"przasnyski","Przasnysz"]
[null,null,null,null,null,null,null,null,null,null,null,null,null,null,null,null,null,null,null,null,null,null,null,null,null,"wyszkowski","Brańszczyk"]
[null,null,null,null,null,null,null,null,null,null,null,null,null,null,null,null,null,null,null,null,null,null,null,null,null,"wyszkowski","Długosiodło"]
[null,null,null,null,null,null,null,null,null,null,null,null,null,null,null,null,null,null,null,null,null,null,null,null,null,"wyszkowski","Rząśnik"]
[null,null,null,null,null,null,null,null,null,null,null,null,null,null,null,null,null,null,null,null,null,null,null,null,null,"wyszkowski","Somianka"]
[null,null,null,null,null,null,null,null,null,null,null,null,null,null,null,null,null,null,null,null,null,null,null,null,null,"wyszkowski","Wyszków"]
[null,null,null,null,null,null,null,null,null,null,null,null,null,null,null,null,null,null,null,null,null,null,null,null,null,"wyszkowski","Zabrodzie"]
[null,null,null,null,null,null,null,null,null,null,null,null,null,null,null,null,null,null,null,null,null,null,null,null,null,"Ostrołęka","Ostrołęka"]
[null,null,null,null,null,null,null,null,null,null,null,null,null,null,null,null,null,null,null,null,null,null,null,null,null,"białobrzeski","Białobrzegi"]
[null,null,null,null,null,null,null,null,null,null,null,null,null,null,null,null,null,null,null,null,null,null,null,null,null,"białobrzeski","Promna"]
[null,null,null,null,null,null,null,null,null,null,null,null,null,null,null,null,null,null,null,null,null,null,null,null,null,"białobrzeski","Radzanów"]
[null,null,null,null,null,null,null,null,null,null,null,null,null,null,null,null,null,null,null,null,null,null,null,null,null,"białobrzeski","Stara Błotnica"]
[null,null,null,null,null,null,null,null,null,null,null,null,null,null,null,null,null,null,null,null,null,null,null,null,null,"białobrzeski","Stromiec"]
[null,null,null,null,null,null,null,null,null,null,null,null,null,null,null,null,null,null,null,null,null,null,null,null,null,"białobrzeski","Wyśmierzyce"]
[null,null,null,null,null,null,null,null,null,null,null,null,null,null,null,null,null,null,null,null,null,null,null,null,null,"kozienicki","Garbatka-Letnisko"]
[null,null,null,null,null,null,null,null,null,null,null,null,null,null,null,null,null,null,null,null,null,null,null,null,null,"kozienicki","Głowaczów"]
[null,null,null,null,null,null,null,null,null,null,null,null,null,null,null,null,null,null,null,null,null,null,null,null,null,"kozienicki","Gniewoszów"]
[null,null,null,null,null,null,null,null,null,null,null,null,null,null,null,null,null,null,null,null,null,null,null,null,null,"kozienicki","Grabów nad Pilicą"]
[null,null,null,null,null,null,null,null,null,null,null,null,null,null,null,null,null,null,null,null,null,null,null,null,null,"kozienicki","Kozienice"]
[null,null,null,null,null,null,null,null,null,null,null,null,null,null,null,null,null,null,null,null,null,null,null,null,null,"kozienicki","Magnuszew"]
[null,null,null,null,null,null,null,null,null,null,null,null,null,null,null,null,null,null,null,null,null,null,null,null,null,"kozienicki","Sieciechów"]
[null,null,null,null,null,null,null,null,null,null,null,null,null,null,null,null,null,null,null,null,null,null,null,null,null,"lipski","Chotcza"]
[null,null,null,null,null,null,null,null,null,null,null,null,null,null,null,null,null,null,null,null,null,null,null,null,null,"lipski","Ciepielów"]
[null,null,null,null,null,null,null,null,null,null,null,null,null,null,null,null,null,null,null,null,null,null,null,null,null,"lipski","Lipsko"]
[null,null,null,null,null,null,null,null,null,null,null,null,null,null,null,null,null,null,null,null,null,null,null,null,null,"lipski","Rzeczniów"]
[null,null,null,null,null,null,null,null,null,null,null,null,null,null,null,null,null,null,null,null,null,null,null,null,null,"lipski","Sienno"]
[null,null,null,null,null,null,null,null,null,null,null,null,null,null,null,null,null,null,null,null,null,null,null,null,null,"lipski","Solec nad Wisłą"]
[null,null,null,null,null,null,null,null,null,null,null,null,null,null,null,null,null,null,null,null,null,null,null,null,null,"przysuski","Borkowice"]
[null,null,null,null,null,null,null,null,null,null,null,null,null,null,null,null,null,null,null,null,null,null,null,null,null,"przysuski","Gielniów"]
[null,null,null,null,null,null,null,null,null,null,null,null,null,null,null,null,null,null,null,null,null,null,null,null,null,"przysuski","Klwów"]
[null,null,null,null,null,null,null,null,null,null,null,null,null,null,null,null,null,null,null,null,null,null,null,null,null,"przysuski","Odrzywół"]
[null,null,null,null,null,null,null,null,null,null,null,null,null,null,null,null,null,null,null,null,null,null,null,null,null,"przysuski","Potworów"]
[null,null,null,null,null,null,null,null,null,null,null,null,null,null,null,null,null,null,null,null,null,null,null,null,null,"przysuski","Przysucha"]
[null,null,null,null,null,null,null,null,null,null,null,null,null,null,null,null,null,null,null,null,null,null,null,null,null,"przysuski","Rusinów"]
[null,null,null,null,null,null,null,null,null,null,null,null,null,null,null,null,null,null,null,null,null,null,null,null,null,"przysuski","Wieniawa"]
[null,null,null,null,null,null,null,null,null,null,null,null,null,null,null,null,null,null,null,null,null,null,null,null,null,"radomski","Pionki"]
[null,null,null,null,null,null,null,null,null,null,null,null,null,null,null,null,null,null,null,null,null,null,null,null,null,"radomski","Gózd"]
[null,null,null,null,null,null,null,null,null,null,null,null,null,null,null,null,null,null,null,null,null,null,null,null,null,"radomski","Iłża"]
[null,null,null,null,null,null,null,null,null,null,null,null,null,null,null,null,null,null,null,null,null,null,null,null,null,"radomski","Jastrzębia"]
[null,null,null,null,null,null,null,null,null,null,null,null,null,null,null,null,null,null,null,null,null,null,null,null,null,"radomski","Jedlińsk"]
[null,null,null,null,null,null,null,null,null,null,null,null,null,null,null,null,null,null,null,null,null,null,null,null,null,"radomski","Jedlnia-Letnisko"]
[null,null,null,null,null,null,null,null,null,null,null,null,null,null,null,null,null,null,null,null,null,null,null,null,null,"radomski","Kowala"]
[null,null,null,null,null,null,null,null,null,null,null,null,null,null,null,null,null,null,null,null,null,null,null,null,null,"radomski","Pionki"]
[null,null,null,null,null,null,null,null,null,null,null,null,null,null,null,null,null,null,null,null,null,null,null,null,null,"radomski","Przytyk"]
[null,null,null,null,null,null,null,null,null,null,null,null,null,null,null,null,null,null,null,null,null,null,null,null,null,"radomski","Skaryszew"]
[null,null,null,null,null,null,null,null,null,null,null,null,null,null,null,null,null,null,null,null,null,null,null,null,null,"radomski","Wierzbica"]
[null,null,null,null,null,null,null,null,null,null,null,null,null,null,null,null,null,null,null,null,null,null,null,null,null,"radomski","Wolanów"]
[null,null,null,null,null,null,null,null,null,null,null,null,null,null,null,null,null,null,null,null,null,null,null,null,null,"radomski","Zakrzew"]
[null,null,null,null,null,null,null,null,null,null,null,null,null,null,null,null,null,null,null,null,null,null,null,null,null,"szydłowiecki","Chlewiska"]
[null,null,null,null,null,null,null,null,null,null,null,null,null,null,null,null,null,null,null,null,null,null,null,null,null,"szydłowiecki","Jastrząb"]
[null,null,null,null,null,null,null,null,null,null,null,null,null,null,null,null,null,null,null,null,null,null,null,null,null,"szydłowiecki","Mirów"]
[null,null,null,null,null,null,null,null,null,null,null,null,null,null,null,null,null,null,null,null,null,null,null,null,null,"szydłowiecki","Orońsko"]
[null,null,null,null,null,null,null,null,null,null,null,null,null,null,null,null,null,null,null,null,null,null,null,null,null,"szydłowiecki","Szydłowiec"]
[null,null,null,null,null,null,null,null,null,null,null,null,null,null,null,null,null,null,null,null,null,null,null,null,null,"zwoleński","Kazanów"]
[null,null,null,null,null,null,null,null,null,null,null,null,null,null,null,null,null,null,null,null,null,null,null,null,null,"zwoleński","Policzna"]
[null,null,null,null,null,null,null,null,null,null,null,null,null,null,null,null,null,null,null,null,null,null,null,null,null,"zwoleński","Przyłęk"]
[null,null,null,null,null,null,null,null,null,null,null,null,null,null,null,null,null,null,null,null,null,null,null,null,null,"zwoleński","Tczów"]
[null,null,null,null,null,null,null,null,null,null,null,null,null,null,null,null,null,null,null,null,null,null,null,null,null,"zwoleński","Zwoleń"]
[null,null,null,null,null,null,null,null,null,null,null,null,null,null,null,null,null,null,null,null,null,null,null,null,null,"Radom","Radom"]
[null,null,null,null,null,null,null,null,null,null,null,null,null,null,null,null,null,null,null,null,null,null,null,null,null,"gostyniński","Gostynin"]
[null,null,null,null,null,null,null,null,null,null,null,null,null,null,null,null,null,null,null,null,null,null,null,null,null,"gostyniński","Pacyna"]
[null,null,null,null,null,null,null,null,null,null,null,null,null,null,null,null,null,null,null,null,null,null,null,null,null,"gostyniński","Sanniki"]
[null,null,null,null,null,null,null,null,null,null,null,null,null,null,null,null,null,null,null,null,null,null,null,null,null,"gostyniński","Szczawin Kościelny"]
[null,null,null,null,null,null,null,null,null,null,null,null,null,null,null,null,null,null,null,null,null,null,null,null,null,"płocki","Bielsk"]
[null,null,null,null,null,null,null,null,null,null,null,null,null,null,null,null,null,null,null,null,null,null,null,null,null,"płocki","Bodzanów"]
[null,null,null,null,null,null,null,null,null,null,null,null,null,null,null,null,null,null,null,null,null,null,null,null,null,"płocki","Brudzeń Duży"]
[null,null,null,null,null,null,null,null,null,null,null,null,null,null,null,null,null,null,null,null,null,null,null,null,null,"płocki","Bulkowo"]
[null,null,null,null,null,null,null,null,null,null,null,null,null,null,null,null,null,null,null,null,null,null,null,null,null,"płocki","Drobin"]
[null,null,null,null,null,null,null,null,null,null,null,null,null,null,null,null,null,null,null,null,null,null,null,null,null,"płocki","Gąbin"]
[null,null,null,null,null,null,null,null,null,null,null,null,null,null,null,null,null,null,null,null,null,null,null,null,null,"płocki","Łąck"]
[null,null,null,null,null,null,null,null,null,null,null,null,null,null,null,null,null,null,null,null,null,null,null,null,null,"płocki","Mała Wieś"]
[null,null,null,null,null,null,null,null,null,null,null,null,null,null,null,null,null,null,null,null,null,null,null,null,null,"płocki","Nowy Duninów"]
[null,null,null,null,null,null,null,null,null,null,null,null,null,null,null,null,null,null,null,null,null,null,null,null,null,"płocki","Radzanowo"]
[null,null,null,null,null,null,null,null,null,null,null,null,null,null,null,null,null,null,null,null,null,null,null,null,null,"płocki","Słubice"]
[null,null,null,null,null,null,null,null,null,null,null,null,null,null,null,null,null,null,null,null,null,null,null,null,null,"płocki","Słupno"]
[null,null,null,null,null,null,null,null,null,null,null,null,null,null,null,null,null,null,null,null,null,null,null,null,null,"płocki","Stara Biała"]
[null,null,null,null,null,null,null,null,null,null,null,null,null,null,null,null,null,null,null,null,null,null,null,null,null,"płocki","Staroźreby"]
[null,null,null,null,null,null,null,null,null,null,null,null,null,null,null,null,null,null,null,null,null,null,null,null,null,"płocki","Wyszogród"]
[null,null,null,null,null,null,null,null,null,null,null,null,null,null,null,null,null,null,null,null,null,null,null,null,null,"sierpecki","Sierpc"]
[null,null,null,null,null,null,null,null,null,null,null,null,null,null,null,null,null,null,null,null,null,null,null,null,null,"sierpecki","Gozdowo"]
[null,null,null,null,null,null,null,null,null,null,null,null,null,null,null,null,null,null,null,null,null,null,null,null,null,"sierpecki","Mochowo"]
[null,null,null,null,null,null,null,null,null,null,null,null,null,null,null,null,null,null,null,null,null,null,null,null,null,"sierpecki","Rościszewo"]
[null,null,null,null,null,null,null,null,null,null,null,null,null,null,null,null,null,null,null,null,null,null,null,null,null,"sierpecki","Sierpc"]
[null,null,null,null,null,null,null,null,null,null,null,null,null,null,null,null,null,null,null,null,null,null,null,null,null,"sierpecki","Szczutowo"]
[null,null,null,null,null,null,null,null,null,null,null,null,null,null,null,null,null,null,null,null,null,null,null,null,null,"sierpecki","Zawidz"]
[null,null,null,null,null,null,null,null,null,null,null,null,null,null,null,null,null,null,null,null,null,null,null,null,null,"Płock","Płock"]
[null,null,null,null,null,null,null,null,null,null,null,null,null,null,null,null,null,null,null,null,null,null,null,null,null,"garwoliński","Garwolin"]
[null,null,null,null,null,null,null,null,null,null,null,null,null,null,null,null,null,null,null,null,null,null,null,null,null,"garwoliński","Łaskarzew"]
[null,null,null,null,null,null,null,null,null,null,null,null,null,null,null,null,null,null,null,null,null,null,null,null,null,"garwoliński","Borowie"]
[null,null,null,null,null,null,null,null,null,null,null,null,null,null,null,null,null,null,null,null,null,null,null,null,null,"garwoliński","Garwolin"]
[null,null,null,null,null,null,null,null,null,null,null,null,null,null,null,null,null,null,null,null,null,null,null,null,null,"garwoliński","Górzno"]
[null,null,null,null,null,null,null,null,null,null,null,null,null,null,null,null,null,null,null,null,null,null,null,null,null,"garwoliński","Łaskarzew"]
[null,null,null,null,null,null,null,null,null,null,null,null,null,null,null,null,null,null,null,null,null,null,null,null,null,"garwoliński","Maciejowice"]
[null,null,null,null,null,null,null,null,null,null,null,null,null,null,null,null,null,null,null,null,null,null,null,null,null,"garwoliński","Miastków Kościelny"]
[null,null,null,null,null,null,null,null,null,null,null,null,null,null,null,null,null,null,null,null,null,null,null,null,null,"garwoliński","Parysów"]
[null,null,null,null,null,null,null,null,null,null,null,null,null,null,null,null,null,null,null,null,null,null,null,null,null,"garwoliński","Pilawa"]
[null,null,null,null,null,null,null,null,null,null,null,null,null,null,null,null,null,null,null,null,null,null,null,null,null,"garwoliński","Sobolew"]
[null,null,null,null,null,null,null,null,null,null,null,null,null,null,null,null,null,null,null,null,null,null,null,null,null,"garwoliński","Trojanów"]
[null,null,null,null,null,null,null,null,null,null,null,null,null,null,null,null,null,null,null,null,null,null,null,null,null,"garwoliński","Wilga"]
[null,null,null,null,null,null,null,null,null,null,null,null,null,null,null,null,null,null,null,null,null,null,null,null,null,"garwoliński","Żelechów"]
[null,null,null,null,null,null,null,null,null,null,null,null,null,null,null,null,null,null,null,null,null,null,null,null,null,"łosicki","Huszlew"]
[null,null,null,null,null,null,null,null,null,null,null,null,null,null,null,null,null,null,null,null,null,null,null,null,null,"łosicki","Łosice"]
[null,null,null,null,null,null,null,null,null,null,null,null,null,null,null,null,null,null,null,null,null,null,null,null,null,"łosicki","Olszanka"]
[null,null,null,null,null,null,null,null,null,null,null,null,null,null,null,null,null,null,null,null,null,null,null,null,null,"łosicki","Platerów"]
[null,null,null,null,null,null,null,null,null,null,null,null,null,null,null,null,null,null,null,null,null,null,null,null,null,"łosicki","Sarnaki"]
[null,null,null,null,null,null,null,null,null,null,null,null,null,null,null,null,null,null,null,null,null,null,null,null,null,"łosicki","Stara Kornica"]
[null,null,null,null,null,null,null,null,null,null,null,null,null,null,null,null,null,null,null,null,null,null,null,null,null,"siedlecki","Domanice"]
[null,null,null,null,null,null,null,null,null,null,null,null,null,null,null,null,null,null,null,null,null,null,null,null,null,"siedlecki","Korczew"]
[null,null,null,null,null,null,null,null,null,null,null,null,null,null,null,null,null,null,null,null,null,null,null,null,null,"siedlecki","Kotuń"]
[null,null,null,null,null,null,null,null,null,null,null,null,null,null,null,null,null,null,null,null,null,null,null,null,null,"siedlecki","Mokobody"]
[null,null,null,null,null,null,null,null,null,null,null,null,null,null,null,null,null,null,null,null,null,null,null,null,null,"siedlecki","Mordy"]
[null,null,null,null,null,null,null,null,null,null,null,null,null,null,null,null,null,null,null,null,null,null,null,null,null,"siedlecki","Paprotnia"]
[null,null,null,null,null,null,null,null,null,null,null,null,null,null,null,null,null,null,null,null,null,null,null,null,null,"siedlecki","Przesmyki"]
[null,null,null,null,null,null,null,null,null,null,null,null,null,null,null,null,null,null,null,null,null,null,null,null,null,"siedlecki","Siedlce"]
[null,null,null,null,null,null,null,null,null,null,null,null,null,null,null,null,null,null,null,null,null,null,null,null,null,"siedlecki","Skórzec"]
[null,null,null,null,null,null,null,null,null,null,null,null,null,null,null,null,null,null,null,null,null,null,null,null,null,"siedlecki","Suchożebry"]
[null,null,null,null,null,null,null,null,null,null,null,null,null,null,null,null,null,null,null,null,null,null,null,null,null,"siedlecki","Wiśniew"]
[null,null,null,null,null,null,null,null,null,null,null,null,null,null,null,null,null,null,null,null,null,null,null,null,null,"siedlecki","Wodynie"]
[null,null,null,null,null,null,null,null,null,null,null,null,null,null,null,null,null,null,null,null,null,null,null,null,null,"siedlecki","Zbuczyn"]
[null,null,null,null,null,null,null,null,null,null,null,null,null,null,null,null,null,null,null,null,null,null,null,null,null,"sokołowski","Sokołów Podlaski"]
[null,null,null,null,null,null,null,null,null,null,null,null,null,null,null,null,null,null,null,null,null,null,null,null,null,"sokołowski","Bielany"]
[null,null,null,null,null,null,null,null,null,null,null,null,null,null,null,null,null,null,null,null,null,null,null,null,null,"sokołowski","Ceranów"]
[null,null,null,null,null,null,null,null,null,null,null,null,null,null,null,null,null,null,null,null,null,null,null,null,null,"sokołowski","Jabłonna Lacka"]
[null,null,null,null,null,null,null,null,null,null,null,null,null,null,null,null,null,null,null,null,null,null,null,null,null,"sokołowski","Kosów Lacki"]
[null,null,null,null,null,null,null,null,null,null,null,null,null,null,null,null,null,null,null,null,null,null,null,null,null,"sokołowski","Repki"]
[null,null,null,null,null,null,null,null,null,null,null,null,null,null,null,null,null,null,null,null,null,null,null,null,null,"sokołowski","Sabnie"]
[null,null,null,null,null,null,null,null,null,null,null,null,null,null,null,null,null,null,null,null,null,null,null,null,null,"sokołowski","Sokołów Podlaski"]
[null,null,null,null,null,null,null,null,null,null,null,null,null,null,null,null,null,null,null,null,null,null,null,null,null,"sokołowski","Sterdyń"]
[null,null,null,null,null,null,null,null,null,null,null,null,null,null,null,null,null,null,null,null,null,null,null,null,null,"węgrowski","Węgrów"]
[null,null,null,null,null,null,null,null,null,null,null,null,null,null,null,null,null,null,null,null,null,null,null,null,null,"węgrowski","Grębków"]
[null,null,null,null,null,null,null,null,null,null,null,null,null,null,null,null,null,null,null,null,null,null,null,null,null,"węgrowski","Korytnica"]
[null,null,null,null,null,null,null,null,null,null,null,null,null,null,null,null,null,null,null,null,null,null,null,null,null,"węgrowski","Liw"]
[null,null,null,null,null,null,null,null,null,null,null,null,null,null,null,null,null,null,null,null,null,null,null,null,null,"węgrowski","Łochów"]
[null,null,null,null,null,null,null,null,null,null,null,null,null,null,null,null,null,null,null,null,null,null,null,null,null,"węgrowski","Miedzna"]
[null,null,null,null,null,null,null,null,null,null,null,null,null,null,null,null,null,null,null,null,null,null,null,null,null,"węgrowski","Sadowne"]
[null,null,null,null,null,null,null,null,null,null,null,null,null,null,null,null,null,null,null,null,null,null,null,null,null,"węgrowski","Stoczek"]
[null,null,null,null,null,null,null,null,null,null,null,null,null,null,null,null,null,null,null,null,null,null,null,null,null,"węgrowski","Wierzbno"]
[null,null,null,null,null,null,null,null,null,null,null,null,null,null,null,null,null,null,null,null,null,null,null,null,null,"Siedlce","Siedlce"]
[null,null,null,null,null,null,null,null,null,null,null,null,null,null,null,null,null,null,null,null,null,null,null,null,null,"grójecki","Belsk Duży"]
[null,null,null,null,null,null,null,null,null,null,null,null,null,null,null,null,null,null,null,null,null,null,null,null,null,"grójecki","Błędów"]
[null,null,null,null,null,null,null,null,null,null,null,null,null,null,null,null,null,null,null,null,null,null,null,null,null,"grójecki","Chynów"]
[null,null,null,null,null,null,null,null,null,null,null,null,null,null,null,null,null,null,null,null,null,null,null,null,null,"grójecki","Goszczyn"]
[null,null,null,null,null,null,null,null,null,null,null,null,null,null,null,null,null,null,null,null,null,null,null,null,null,"grójecki","Grójec"]
[null,null,null,null,null,null,null,null,null,null,null,null,null,null,null,null,null,null,null,null,null,null,null,null,null,"grójecki","Jasieniec"]
[null,null,null,null,null,null,null,null,null,null,null,null,null,null,null,null,null,null,null,null,null,null,null,null,null,"grójecki","Mogielnica"]
[null,null,null,null,null,null,null,null,null,null,null,null,null,null,null,null,null,null,null,null,null,null,null,null,null,"grójecki","Nowe Miasto nad Pilicą"]
[null,null,null,null,null,null,null,null,null,null,null,null,null,null,null,null,null,null,null,null,null,null,null,null,null,"grójecki","Pniewy"]
[null,null,null,null,null,null,null,null,null,null,null,null,null,null,null,null,null,null,null,null,null,null,null,null,null,"grójecki","Warka"]
[null,null,null,null,null,null,null,null,null,null,null,null,null,null,null,null,null,null,null,null,null,null,null,null,null,"sochaczewski","Sochaczew"]
[null,null,null,null,null,null,null,null,null,null,null,null,null,null,null,null,null,null,null,null,null,null,null,null,null,"sochaczewski","Brochów"]
[null,null,null,null,null,null,null,null,null,null,null,null,null,null,null,null,null,null,null,null,null,null,null,null,null,"sochaczewski","Iłów"]
[null,null,null,null,null,null,null,null,null,null,null,null,null,null,null,null,null,null,null,null,null,null,null,null,null,"sochaczewski","Młodzieszyn"]
[null,null,null,null,null,null,null,null,null,null,null,null,null,null,null,null,null,null,null,null,null,null,null,null,null,"sochaczewski","Nowa Sucha"]
[null,null,null,null,null,null,null,null,null,null,null,null,null,null,null,null,null,null,null,null,null,null,null,null,null,"sochaczewski","Rybno"]
[null,null,null,null,null,null,null,null,null,null,null,null,null,null,null,null,null,null,null,null,null,null,null,null,null,"sochaczewski","Sochaczew"]
[null,null,null,null,null,null,null,null,null,null,null,null,null,null,null,null,null,null,null,null,null,null,null,null,null,"sochaczewski","Teresin"]
[null,null,null,null,null,null,null,null,null,null,null,null,null,null,null,null,null,null,null,null,null,null,null,null,null,"żyrardowski","Żyrardów"]
[null,null,null,null,null,null,null,null,null,null,null,null,null,null,null,null,null,null,null,null,null,null,null,null,null,"żyrardowski","Mszczonów"]
[null,null,null,null,null,null,null,null,null,null,null,null,null,null,null,null,null,null,null,null,null,null,null,null,null,"żyrardowski","Puszcza Mariańska"]
[null,null,null,null,null,null,null,null,null,null,null,null,null,null,null,null,null,null,null,null,null,null,null,null,null,"żyrardowski","Radziejowice"]
[null,null,null,null,null,null,null,null,null,null,null,null,null,null,null,null,null,null,null,null,null,null,null,null,null,"żyrardowski","Wiskitki"]

{"sheet":"Załącznik 3 - kody PKD","index":4,"n_rows":1654,"n_cols":3,"rows_kept":1654,"cut":false,"hidden":false,"merged":[]}
[null,"Kody działalności według PKD"]
[]
[null,"Symbol","Nazwa"]
[null,"A","ROLNICTWO, LEŚNICTWO, ŁOWIECTWO I RYBACTWO"]
[null,"01","UPRAWY ROLNE, CHÓW I HODOWLA ZWIERZĄT, ŁOWIECTWO, WŁĄCZAJĄC DZIAŁALNOŚĆ USŁUGOWĄ"]
[null,"01.1","Uprawy rolne inne niż wieloletnie "]
[null,"01.11","Uprawa zbóż, roślin strączkowych i roślin oleistych na nasiona, z wyłączeniem ryżu"]
[null,"01.11.Z","Uprawa zbóż, roślin strączkowych i roślin oleistych na nasiona, z wyłączeniem ryżu"]
[null,"01.12","Uprawa ryżu"]
[null,"01.12.Z","Uprawa ryżu"]
[null,"01.13","Uprawa warzyw, włączając melony oraz uprawa roślin korzeniowych i roślin bulwiastych"]
[null,"01.13.Z","Uprawa warzyw, włączając melony oraz uprawa roślin korzeniowych i roślin bulwiastych"]
[null,"01.14","Uprawa trzciny cukrowej"]
[null,"01.14.Z","Uprawa trzciny cukrowej"]
[null,"01.15","Uprawa tytoniu"]
[null,"01.15.Z","Uprawa tytoniu"]
[null,"01.16","Uprawa roślin włóknistych"]
[null,"01.16.Z","Uprawa roślin włóknistych"]
[null,"01.19","Pozostałe uprawy rolne inne niż wieloletnie"]
[null,"01.19.Z","Pozostałe uprawy rolne inne niż wieloletnie"]
[null,"01.2","Uprawa roślin wieloletnich"]
[null,"01.21","Uprawa winogron"]
[null,"01.21.Z","Uprawa winogron"]
[null,"01.22","Uprawa drzew i krzewów owocowych tropikalnych i podzwrotnikowych"]
[null,"01.22.Z","Uprawa drzew i krzewów owocowych tropikalnych i podzwrotnikowych"]
[null,"01.23","Uprawa drzew i krzewów owocowych cytrusowych"]
[null,"01.23.Z","Uprawa drzew i krzewów owocowych cytrusowych"]
[null,"01.24","Uprawa drzew i krzewów owocowych ziarnkowych i pestkowych"]
[null,"01.24.Z","Uprawa drzew i krzewów owocowych ziarnkowych i pestkowych"]
[null,"01.25","Uprawa pozostałych drzew i krzewów owocowych oraz orzechów"]
[null,"01.25.Z","Uprawa pozostałych drzew i krzewów owocowych oraz orzechów"]
[null,"01.26","Uprawa drzew oleistych"]
[null,"01.26.Z","Uprawa drzew oleistych"]
[null,"01.27","Uprawa roślin wykorzystywanych do produkcji napojów"]
[null,"01.27.Z","Uprawa roślin wykorzystywanych do produkcji napojów"]
[null,"01.28","Uprawa roślin przyprawowych i aromatycznych oraz roślin wykorzystywanych do produkcji leków i wyrobów farmaceutycznych"]
[null,"01.28.Z","Uprawa roślin przyprawowych i aromatycznych oraz roślin wykorzystywanych do produkcji leków i wyrobów farmaceutycznych"]
[null,"01.29","Uprawa pozostałych roślin wieloletnich"]
[null,"01.29.Z","Uprawa pozostałych roślin wieloletnich"]
[null,"01.3","Rozmnażanie roślin"]
[null,"01.30","Rozmnażanie roślin"]
[null,"01.30.Z","Rozmnażanie roślin"]
[null,"01.4","Chów i hodowla zwierząt"]
[null,"01.41","Chów i hodowla bydła mlecznego"]
[null,"01.41.Z","Chów i hodowla bydła mlecznego"]
[null,"01.42","Chów i hodowla pozostałego bydła i bawołów"]
[null,"01.42.Z","Chów i hodowla pozostałego bydła i bawołów"]
[null,"01.43","Chów i hodowla koni i pozostałych zwierząt koniowatych"]
[null,"01.43.Z","Chów i hodowla koni i pozostałych zwierząt koniowatych"]
[null,"01.44","Chów i hodowla wielbłądów i zwierząt wielbłądowatych"]
[null,"01.44.Z","Chów i hodowla wielbłądów i zwierząt wielbłądowatych"]
[null,"01.45","Chów i hodowla owiec i kóz"]
[null,"01.45.Z","Chów i hodowla owiec i kóz"]
[null,"01.46","Chów i hodowla świń"]
[null,"01.46.Z","Chów i hodowla świń"]
[null,"01.47","Chów i hodowla drobiu"]
[null,"01.47.Z","Chów i hodowla drobiu"]
[null,"01.49","Chów i hodowla pozostałych zwierząt"]
[null,"01.49.Z","Chów i hodowla pozostałych zwierząt"]
[null,"01.5","Uprawy rolne połączone z chowem i hodowlą zwierząt (działalność mieszana)"]
[null,"01.50","Uprawy rolne połączone z chowem i hodowlą zwierząt (działalność mieszana)"]
[null,"01.50.Z","Uprawy rolne połączone z chowem i hodowlą zwierząt (działalność mieszana)"]
[null,"01.6","Działalność usługowa wspomagająca rolnictwo i następująca po zbiorach"]
[null,"01.61","Działalność usługowa wspomagająca produkcję roślinną"]
[null,"01.61.Z","Działalność usługowa wspomagająca produkcję roślinną"]
[null,"01.62","Działalność usługowa wspomagająca chów i hodowlę zwierząt gospodarskich"]
[null,"01.62.Z","Działalność usługowa wspomagająca chów i hodowlę zwierząt gospodarskich"]
[null,"01.63","Działalność usługowa następująca po zbiorach"]
[null,"01.63.Z","Działalność usługowa następująca po zbiorach"]
[null,"01.64","Obróbka nasion dla celów rozmnażania roślin"]
[null,"01.64.Z","Obróbka nasion dla celów rozmnażania roślin"]
[null,"01.7","Łowiectwo i pozyskiwanie zwierząt łownych, włączając działalność usługową"]
[null,"01.70","Łowiectwo i pozyskiwanie zwierząt łownych, włączając działalność usługową"]
[null,"01.70.Z","Łowiectwo i pozyskiwanie zwierząt łownych, włączając działalność usługową"]
[null,"02","LEŚNICTWO I POZYSKIWANIE DREWNA"]
[null,"02.1","Gospodarka leśna i pozostała działalność leśna, z wyłączeniem pozyskiwania produktów leśnych"]
[null,"02.10","Gospodarka leśna i pozostała działalność leśna, z wyłączeniem pozyskiwania produktów leśnych"]
[null,"02.10.Z","Gospodarka leśna i pozostała działalność leśna, z wyłączeniem pozyskiwania produktów leśnych"]
[null,"02.2","Pozyskiwanie drewna"]
[null,"02.20","Pozyskiwanie drewna"]
[null,"02.20.Z","Pozyskiwanie drewna"]
[null,"02.3","Pozyskiwanie dziko rosnących produktów leśnych, z wyłączeniem drewna"]
[null,"02.30","Pozyskiwanie dziko rosnących produktów leśnych, z wyłączeniem drewna"]
[null,"02.30.Z","Pozyskiwanie dziko rosnących produktów leśnych, z wyłączeniem drewna"]
[null,"02.4","Działalność usługowa związana z leśnictwem"]
[null,"02.40","Działalność usługowa związana z leśnictwem"]
[null,"02.40.Z","Działalność usługowa związana z leśnictwem"]
[null,"03","RYBACTWO"]
[null,"03.1","Rybołówstwo"]
[null,"03.11","Rybołówstwo w wodach morskich"]
[null,"03.11.Z","Rybołówstwo w wodach morskich"]
[null,"03.12","Rybołówstwo w wodach śródlądowych"]
[null,"03.12.Z","Rybołówstwo w wodach śródlądowych"]
[null,"03.2","Chów i hodowla ryb oraz pozostałych organizmów wodnych"]
[null,"03.21","Chów i hodowla ryb oraz pozostałych organizmów wodnych w wodach morskich"]
[null,"03.21.Z","Chów i hodowla ryb oraz pozostałych organizmów wodnych w wodach morskich"]
[null,"03.22","Chów i hodowla ryb oraz pozostałych organizmów wodnych w wodach śródlądowych"]
[null,"03.22.Z","Chów i hodowla ryb oraz pozostałych organizmów wodnych w wodach śródlądowych"]
[null,"B","GÓRNICTWO I WYDOBYWANIE"]
[null,"05","WYDOBYWANIE WĘGLA KAMIENNEGO I WĘGLA BRUNATNEGO (LIGNITU)"]
[null,"05.1","Wydobywanie węgla kamiennego"]
[null,"05.10","Wydobywanie węgla kamiennego"]
[null,"05.10.Z","Wydobywanie węgla kamiennego"]
[null,"05.2","Wydobywanie węgla brunatnego (lignitu)"]
[null,"05.20","Wydobywanie węgla brunatnego (lignitu)"]
[null,"05.20.Z","Wydobywanie węgla brunatnego (lignitu)"]
[null,"06","GÓRNICTWO ROPY NAFTOWEJ I GAZU ZIEMNEGO"]
[null,"06.1","Górnictwo ropy naftowej"]
[null,"06.10","Górnictwo ropy naftowej"]
[null,"06.10.Z","Górnictwo ropy naftowej"]
[null,"06.2","Górnictwo gazu ziemnego"]
[null,"06.20","Górnictwo gazu ziemnego"]
[null,"06.20.Z","Górnictwo gazu ziemnego"]
[null,"07","GÓRNICTWO RUD METALI"]
[null,"07.1","Górnictwo rud żelaza"]
[null,"07.10","Górnictwo rud żelaza"]
[null,"07.10.Z","Górnictwo rud żelaza"]
[null,"07.2","Górnictwo rud metali nieżelaznych"]
[null,"07.21","Górnictwo rud uranu i toru"]
[null,"07.21.Z","Górnictwo rud uranu i toru"]
[null,"07.29","Górnictwo pozostałych rud metali nieżelaznych"]
[null,"07.29.Z","Górnictwo pozostałych rud metali nieżelaznych"]
[null,"08","POZOSTAŁE GÓRNICTWO I WYDOBYWANIE"]
[null,"08.1","Wydobywanie kamienia, piasku i gliny"]
[null,"08.11","Wydobywanie kamieni ozdobnych oraz kamienia dla potrzeb budownictwa, skał wapiennych, gipsu, kredy i łupków"]
[null,"08.11.Z","Wydobywanie kamieni ozdobnych oraz kamienia dla potrzeb budownictwa, skał wapiennych, gipsu, kredy i łupków"]
[null,"08.12","Wydobywanie żwiru i piasku; wydobywanie gliny i kaolinu"]
[null,"08.12.Z","Wydobywanie żwiru i piasku; wydobywanie gliny i kaolinu"]
[null,"08.9","Górnictwo i wydobywanie, gdzie indziej niesklasyfikowane"]
[null,"08.91","Wydobywanie minerałów dla przemysłu chemicznego oraz do produkcji nawozów"]
[null,"08.91.Z","Wydobywanie minerałów dla przemysłu chemicznego oraz do produkcji nawozów"]
[null,"08.92","Wydobywanie torfu"]
[null,"08.92.Z","Wydobywanie torfu"]
[null,"08.93","Wydobywanie soli"]
[null,"08.93.Z","Wydobywanie soli"]
[null,"08.99","Pozostałe górnictwo i wydobywanie, gdzie indziej niesklasyfikowane"]
[null,"08.99.Z","Pozostałe górnictwo i wydobywanie, gdzie indziej niesklasyfikowane"]
[null,"09","DZIAŁALNOŚĆ USŁUGOWA WSPOMAGAJĄCA GÓRNICTWO I WYDOBYWANIE"]
[null,"09.1","Działalność usługowa wspomagająca eksploatację złóż ropy naftowej i gazu ziemnego"]
[null,"09.10","Działalność usługowa wspomagająca eksploatację złóż ropy naftowej i gazu ziemnego"]
[null,"09.10.Z","Działalność usługowa wspomagająca eksploatację złóż ropy naftowej i gazu ziemnego"]
[null,"09.9","Działalność usługowa wspomagająca pozostałe górnictwo i wydobywanie"]
[null,"09.90","Działalność usługowa wspomagająca pozostałe górnictwo i wydobywanie"]
[null,"09.90.Z","Działalność usługowa wspomagająca pozostałe górnictwo i wydobywanie"]
[null,"C","PRZETWÓRSTWO PRZEMYSŁOWE"]
[null,"10","PRODUKCJA ARTYKUŁÓW SPOŻYWCZYCH"]
[null,"10.1","Przetwarzanie i konserwowanie mięsa oraz produkcja wyrobów z mięsa"]
[null,"10.11","Przetwarzanie i konserwowanie mięsa, z wyłączeniem mięsa z drobiu"]
[null,"10.11.Z","Przetwarzanie i konserwowanie mięsa, z wyłączeniem mięsa z drobiu"]
[null,"10.12","Przetwarzanie i konserwowanie mięsa z drobiu"]
[null,"10.12.Z","Przetwarzanie i konserwowanie mięsa z drobiu"]
[null,"10.13","Produkcja wyrobów z mięsa, włączając wyroby z mięsa drobiowego"]
[null,"10.13.Z","Produkcja wyrobów z mięsa, włączając wyroby z mięsa drobiowego"]
[null,"10.2","Przetwarzanie i konserwowanie ryb, skorupiaków i mięczaków"]
[null,"10.20","Przetwarzanie i konserwowanie ryb, skorupiaków i mięczaków"]
[null,"10.20.Z","Przetwarzanie i konserwowanie ryb, skorupiaków i mięczaków"]
[null,"10.3","Przetwarzanie i konserwowanie owoców i warzyw"]
[null,"10.31","Przetwarzanie i konserwowanie ziemniaków"]
[null,"10.31.Z","Przetwarzanie i konserwowanie ziemniaków"]
[null,"10.32","Produkcja soków z owoców i warzyw"]
[null,"10.32.Z","Produkcja soków z owoców i warzyw"]
[null,"10.39","Pozostałe przetwarzanie i konserwowanie owoców i warzyw"]
[null,"10.39.Z","Pozostałe przetwarzanie i konserwowanie owoców i warzyw"]
[null,"10.4","Produkcja olejów i tłuszczów pochodzenia roślinnego i zwierzęcego"]
[null,"10.41","Produkcja olejów i pozostałych tłuszczów płynnych"]
[null,"10.41.Z","Produkcja olejów i pozostałych tłuszczów płynnych"]
[null,"10.42","Produkcja margaryny i podobnych tłuszczów jadalnych"]
[null,"10.42.Z","Produkcja margaryny i podobnych tłuszczów jadalnych"]
[null,"10.5","Wytwarzanie wyrobów mleczarskich"]
[null,"10.51","Przetwórstwo mleka i wyrób serów"]
[null,"10.51.Z","Przetwórstwo mleka i wyrób serów"]
[null,"10.52","Produkcja lodów"]
[null,"10.52.Z","Produkcja lodów"]
[null,"10.6","Wytwarzanie produktów przemiału zbóż, skrobi i wyrobów skrobiowych"]
[null,"10.61","Wytwarzanie produktów przemiału zbóż"]
[null,"10.61.Z","Wytwarzanie produktów przemiału zbóż"]
[null,"10.62","Wytwarzanie skrobi i wyrobów skrobiowych"]
[null,"10.62.Z","Wytwarzanie skrobi i wyrobów skrobiowych"]
[null,"10.7","Produkcja wyrobów piekarskich i mącznych"]
[null,"10.71","Produkcja pieczywa; produkcja świeżych wyrobów ciastkarskich i ciastek"]
[null,"10.71.Z","Produkcja pieczywa; produkcja świeżych wyrobów ciastkarskich i ciastek"]
[null,"10.72","Produkcja sucharów i herbatników; produkcja konserwowanych wyrobów ciastkarskich i ciastek"]
[null,"10.72.Z","Produkcja sucharów i herbatników; produkcja konserwowanych wyrobów ciastkarskich i ciastek"]
[null,"10.73","Produkcja makaronów, klusek, kuskusu i podobnych wyrobów mącznych"]
[null,"10.73.Z","Produkcja makaronów, klusek, kuskusu i podobnych wyrobów mącznych"]
[null,"10.8","Produkcja pozostałych artykułów spożywczych"]
[null,"10.81","Produkcja cukru"]
[null,"10.81.Z","Produkcja cukru"]
[null,"10.82","Produkcja kakao, czekolady i wyrobów cukierniczych"]
[null,"10.82.Z","Produkcja kakao, czekolady i wyrobów cukierniczych"]
[null,"10.83","Przetwórstwo herbaty i kawy"]
[null,"10.83.Z","Przetwórstwo herbaty i kawy"]
[null,"10.84","Produkcja przypraw"]
[null,"10.84.Z","Produkcja przypraw"]
[null,"10.85","Wytwarzanie gotowych posiłków i dań"]
[null,"10.85.Z","Wytwarzanie gotowych posiłków i dań"]
[null,"10.86","Produkcja artykułów spożywczych homogenizowanych i żywności dietetycznej"]
[null,"10.86.Z","Produkcja artykułów spożywczych homogenizowanych i żywności dietetycznej"]
[null,"10.89","Produkcja pozostałych artykułów spożywczych, gdzie indziej niesklasyfikowana"]
[null,"10.89.Z","Produkcja pozostałych artykułów spożywczych, gdzie indziej niesklasyfikowana"]
[null,"10.9","Produkcja gotowych paszy i karmy dla zwierząt"]
[null,"10.91","Produkcja gotowej paszy dla zwierząt gospodarskich"]
[null,"10.91.Z","Produkcja gotowej paszy dla zwierząt gospodarskich"]
[null,"10.92","Produkcja gotowej karmy dla zwierząt domowych"]
[null,"10.92.Z","Produkcja gotowej karmy dla zwierząt domowych"]
[null,"11","PRODUKCJA NAPOJÓW"]
[null,"11.0","PRODUKCJA NAPOJÓW"]
[null,"11.01","Destylowanie, rektyfikowanie i mieszanie alkoholi"]
[null,"11.01.Z","Destylowanie, rektyfikowanie i mieszanie alkoholi"]
[null,"11.02","Produkcja win gronowych"]
[null,"11.02.Z","Produkcja win gronowych"]
[null,"11.03","Produkcja cydru i pozostałych win owocowych"]
[null,"11.03.Z","Produkcja cydru i pozostałych win owocowych"]
[null,"11.04","Produkcja pozostałych niedestylowanych napojów fermentowanych"]
[null,"11.04.Z","Produkcja pozostałych niedestylowanych napojów fermentowanych"]
[null,"11.05","Produkcja piwa"]
[null,"11.05.Z","Produkcja piwa"]
[null,"11.06","Produkcja słodu"]
[null,"11.06.Z","Produkcja słodu"]
[null,"11.07","Produkcja napojów bezalkoholowych; produkcja wód mineralnych i pozostałych wód butelkowanych"]
[null,"11.07.Z","Produkcja napojów bezalkoholowych; produkcja wód mineralnych i pozostałych wód butelkowanych"]
[null,"12","PRODUKCJA WYROBÓW TYTONIOWYCH"]
[null,"12.0","PRODUKCJA WYROBÓW TYTONIOWYCH"]
[null,"12.00","PRODUKCJA WYROBÓW TYTONIOWYCH"]
[null,"12.00.Z","PRODUKCJA WYROBÓW TYTONIOWYCH"]
[null,"13","PRODUKCJA WYROBÓW TEKSTYLNYCH"]
[null,"13.1","Przygotowanie i przędzenie włókien tekstylnych"]
[null,"13.10","Przygotowanie i przędzenie włókien tekstylnych"]
[null,"13.10.A","Produkcja przędzy bawełnianej"]
[null,"13.10.B","Produkcja przędzy wełnianej"]
[null,"13.10.C","Produkcja przędzy z włókien chemicznych"]
[null,"13.10.D","Produkcja przędzy z pozostałych włókien tekstylnych, włączając produkcję nici"]
[null,"13.2","Produkcja tkanin"]
[null,"13.20","Produkcja tkanin"]
[null,"13.20.A","Produkcja tkanin bawełnianych"]
[null,"13.20.B","Produkcja tkanin wełnianych"]
[null,"13.20.C","Produkcja tkanin z włókien chemicznych"]
[null,"13.20.D","Produkcja pozostałych tkanin"]
[null,"13.3","Wykończanie wyrobów włókienniczych"]
[null,"13.30","Wykończanie wyrobów włókienniczych"]
[null,"13.30.Z","Wykończanie wyrobów włókienniczych"]
[null,"13.9","Produkcja pozostałych wyrobów tekstylnych"]
[null,"13.91","Produkcja dzianin metrażowych"]
[null,"13.91.Z","Produkcja dzianin metrażowych"]
[null,"13.92","Produkcja gotowych wyrobów tekstylnych"]
[null,"13.92.Z","Produkcja gotowych wyrobów tekstylnych"]
[null,"13.93","Produkcja dywanów i chodników"]
[null,"13.93.Z","Produkcja dywanów i chodników"]
[null,"13.94","Produkcja wyrobów powroźniczych, lin, szpagatów i wyrobów sieciowych"]
[null,"13.94.Z","Produkcja wyrobów powroźniczych, lin, szpagatów i wyrobów sieciowych"]
[null,"13.95","Produkcja włóknin i wyrobów wykonanych z włóknin, z wyłączeniem odzieży"]
[null,"13.95.Z","Produkcja włóknin i wyrobów wykonanych z włóknin, z wyłączeniem odzieży"]
[null,"13.96","Produkcja pozostałych technicznych i przemysłowych wyrobów tekstylnych"]
[null,"13.96.Z","Produkcja pozostałych technicznych i przemysłowych wyrobów tekstylnych"]
[null,"13.99","Produkcja pozostałych wyrobów tekstylnych, gdzie indziej niesklasyfikowana"]
[null,"13.99.Z","Produkcja pozostałych wyrobów tekstylnych, gdzie indziej niesklasyfikowana"]
[null,"14","PRODUKCJA ODZIEŻY"]
[null,"14.1","Produkcja odzieży, z wyłączeniem wyrobów futrzarskich"]
[null,"14.11","Produkcja odzieży skórzanej"]
[null,"14.11.Z","Produkcja odzieży skórzanej"]
[null,"14.12","Produkcja odzieży roboczej"]
[null,"14.12.Z","Produkcja odzieży roboczej"]
[null,"14.13","Produkcja pozostałej odzieży wierzchniej"]
[null,"14.13.Z","Produkcja pozostałej odzieży wierzchniej"]
[null,"14.14","Produkcja bielizny"]
[null,"14.14.Z","Produkcja bielizny"]
[null,"14.19","Produkcja pozostałej odzieży i dodatków do odzieży"]
[null,"14.19.Z","Produkcja pozostałej odzieży i dodatków do odzieży"]
[null,"14.2","Produkcja wyrobów futrzarskich"]
[null,"14.20","Produkcja wyrobów futrzarskich"]
[null,"14.20.Z","Produkcja wyrobów futrzarskich"]
[null,"14.3","Produkcja odzieży dzianej"]
[null,"14.31","Produkcja wyrobów pończoszniczych"]
[null,"14.31.Z","Produkcja wyrobów pończoszniczych"]
[null,"14.39","Produkcja pozostałej odzieży dzianej"]
[null,"14.39.Z","Produkcja pozostałej odzieży dzianej"]
[null,"15","PRODUKCJA SKÓR I WYROBÓW ZE SKÓR WYPRAWIONYCH"]
[null,"15.1","Wyprawa skór, garbowanie; wyprawa i barwienie skór futerkowych; produkcja toreb bagażowych, toreb ręcznych i podobnych wyrobów kaletniczych; produkcja wyrobów rymarskich"]
[null,"15.11","Wyprawa skór, garbowanie; wyprawa i barwienie skór futerkowych"]
[null,"15.11.Z","Wyprawa skór, garbowanie; wyprawa i barwienie skór futerkowych"]
[null,"15.12","Produkcja toreb bagażowych, toreb ręcznych i podobnych wyrobów kaletniczych; produkcja wyrobów rymarskich"]
[null,"15.12.Z","Produkcja toreb bagażowych, toreb ręcznych i podobnych wyrobów kaletniczych; produkcja wyrobów rymarskich"]
[null,"15.2","Produkcja obuwia"]
[null,"15.20","Produkcja obuwia"]
[null,"15.20.Z","Produkcja obuwia"]
[null,"16","PRODUKCJA WYROBÓW Z DREWNA ORAZ KORKA, Z WYŁĄCZENIEM MEBLI; PRODUKCJA WYROBÓW ZE SŁOMY I MATERIAŁÓW UŻYWANYCH DO WYPLATANIA"]
[null,"16.1","Produkcja wyrobów tartacznych"]
[null,"16.10","Produkcja wyrobów tartacznych"]
[null,"16.10.Z","Produkcja wyrobów tartacznych"]
[null,"16.2","Produkcja wyrobów z drewna, korka, słomy i materiałów używanych do wyplatania"]
[null,"16.21","Produkcja arkuszy fornirowych i płyt wykonanych na bazie drewna"]
[null,"16.21.Z","Produkcja arkuszy fornirowych i płyt wykonanych na bazie drewna"]
[null,"16.22","Produkcja gotowych parkietów podłogowych"]
[null,"16.22.Z","Produkcja gotowych parkietów podłogowych"]
[null,"16.23","Produkcja pozostałych wyrobów stolarskich i ciesielskich dla budownictwa"]
[null,"16.23.Z","Produkcja pozostałych wyrobów stolarskich i ciesielskich dla budownictwa"]
[null,"16.24","Produkcja opakowań drewnianych"]
[null,"16.24.Z","Produkcja opakowań drewnianych"]
[null,"16.29","Produkcja pozostałych wyrobów z drewna; produkcja wyrobów z korka, słomy i materiałów używanych do wyplatania"]
[null,"16.29.Z","Produkcja pozostałych wyrobów z drewna; produkcja wyrobów z korka, słomy i materiałów używanych do wyplatania"]
[null,"17","PRODUKCJA PAPIERU I WYROBÓW Z PAPIERU"]
[null,"17.1","Produkcja masy włóknistej, papieru i tektury"]
[null,"17.11","Produkcja masy włóknistej"]
[null,"17.11.Z","Produkcja masy włóknistej"]
[null,"17.12","Produkcja papieru i tektury"]
[null,"17.12.Z","Produkcja papieru i tektury"]
[null,"17.2","Produkcja wyrobów z papieru i tektury"]
[null,"17.21","Produkcja papieru falistego i tektury falistej oraz opakowań z papieru i tektury"]
[null,"17.21.Z","Produkcja papieru falistego i tektury falistej oraz opakowań z papieru i tektury"]
[null,"17.22","Produkcja artykułów gospodarstwa domowego, toaletowych i sanitarnych"]
[null,"17.22.Z","Produkcja artykułów gospodarstwa domowego, toaletowych i sanitarnych"]
[null,"17.23","Produkcja artykułów piśmiennych"]
[null,"17.23.Z","Produkcja artykułów piśmiennych"]
[null,"17.24","Produkcja tapet"]
[null,"17.24.Z","Produkcja tapet"]
[null,"17.29","Produkcja pozostałych wyrobów z papieru i tektury"]
[null,"17.29.Z","Produkcja pozostałych wyrobów z papieru i tektury"]
[null,"18","POLIGRAFIA I REPRODUKCJA ZAPISANYCH NOŚNIKÓW INFORMACJI"]
[null,"18.1","Drukowanie i działalność usługowa związana z poligrafią"]
[null,"18.11","Drukowanie gazet"]
[null,"18.11.Z","Drukowanie gazet"]
[null,"18.12","Pozostałe drukowanie"]
[null,"18.12.Z","Pozostałe drukowanie"]
[null,"18.13","Działalność usługowa związana z przygotowywaniem do druku"]
[null,"18.13.Z","Działalność usługowa związana z przygotowywaniem do druku"]
[null,"18.14","Introligatorstwo i podobne usługi"]
[null,"18.14.Z","Introligatorstwo i podobne usługi"]
[null,"18.2","Reprodukcja zapisanych nośników informacji"]
[null,"18.20","Reprodukcja zapisanych nośników informacji"]
[null,"18.20.Z","Reprodukcja zapisanych nośników informacji"]
[null,"19","WYTWARZANIE I PRZETWARZANIE KOKSU I PRODUKTÓW RAFINACJI ROPY NAFTOWEJ"]
[null,"19.1","Wytwarzanie i przetwarzanie koksu"]
[null,"19.10","Wytwarzanie i przetwarzanie koksu"]
[null,"19.10.Z","Wytwarzanie i przetwarzanie koksu"]
[null,"19.2","Wytwarzanie i przetwarzanie produktów rafinacji ropy naftowej"]
[null,"19.20","Wytwarzanie i przetwarzanie produktów rafinacji ropy naftowej"]
[null,"19.20.Z","Wytwarzanie i przetwarzanie produktów rafinacji ropy naftowej"]
[null,"20","PRODUKCJA CHEMIKALIÓW I WYROBÓW CHEMICZNYCH"]
[null,"20.1","Produkcja podstawowych chemikaliów, nawozów i związków azotowych, tworzyw sztucznych i kauczuku syntetycznego w formach podstawowych"]
[null,"20.11","Produkcja gazów technicznych"]
[null,"20.11.Z","Produkcja gazów technicznych"]
[null,"20.12","Produkcja barwników i pigmentów"]
[null,"20.12.Z","Produkcja barwników i pigmentów"]
[null,"20.13","Produkcja pozostałych podstawowych chemikaliów nieorganicznych"]
[null,"20.13.Z","Produkcja pozostałych podstawowych chemikaliów nieorganicznych"]
[null,"20.14","Produkcja pozostałych podstawowych chemikaliów organicznych"]
[null,"20.14.Z","Produkcja pozostałych podstawowych chemikaliów organicznych"]
[null,"20.15","Produkcja nawozów i związków azotowych"]
[null,"20.15.Z","Produkcja nawozów i związków azotowych"]
[null,"20.16","Produkcja tworzyw sztucznych w formach podstawowych"]
[null,"20.16.Z","Produkcja tworzyw sztucznych w formach podstawowych"]
[null,"20.17","Produkcja kauczuku syntetycznego w formach podstawowych"]
[null,"20.17.Z","Produkcja kauczuku syntetycznego w formach podstawowych"]
[null,"20.2","Produkcja pestycydów i pozostałych środków agrochemicznych"]
[null,"20.20","Produkcja pestycydów i pozostałych środków agrochemicznych"]
[null,"20.20.Z","Produkcja pestycydów i pozostałych środków agrochemicznych"]
[null,"20.3","Produkcja farb, lakierów i podobnych powłok, farb drukarskich i mas uszczelniających"]
[null,"20.30","Produkcja farb, lakierów i podobnych powłok, farb drukarskich i mas uszczelniających"]
[null,"20.30.Z","Produkcja farb, lakierów i podobnych powłok, farb drukarskich i mas uszczelniających"]
[null,"20.4","Produkcja mydła i detergentów, środków myjących i czyszczących, wyrobów kosmetycznych i toaletowych"]
[null,"20.41","Produkcja mydła i detergentów, środków myjących i czyszczących"]
[null,"20.41.Z","Produkcja mydła i detergentów, środków myjących i czyszczących"]
[null,"20.42","Produkcja wyrobów kosmetycznych i toaletowych"]
[null,"20.42.Z","Produkcja wyrobów kosmetycznych i toaletowych"]
[null,"20.5","Produkcja pozostałych wyrobów chemicznych"]
[null,"20.51","Produkcja materiałów wybuchowych"]
[null,"20.51.Z","Produkcja materiałów wybuchowych"]
[null,"20.52","Produkcja klejów"]
[null,"20.52.Z","Produkcja klejów"]
[null,"20.53","Produkcja olejków eterycznych"]
[null,"20.53.Z","Produkcja olejków eterycznych"]
[null,"20.59","Produkcja pozostałych wyrobów chemicznych, gdzie indziej niesklasyfikowana"]
[null,"20.59.Z","Produkcja pozostałych wyrobów chemicznych, gdzie indziej niesklasyfikowana"]
[null,"20.6","Produkcja włókien chemicznych"]
[null,"20.60","Produkcja włókien chemicznych"]
[null,"20.60.Z","Produkcja włókien chemicznych"]
[null,"21","PRODUKCJA PODSTAWOWYCH SUBSTANCJI FARMACEUTYCZNYCH ORAZ LEKÓW I POZOSTAŁYCH WYROBÓW FARMACEUTYCZNYCH"]
[null,"21.1","Produkcja podstawowych substancji farmaceutycznych"]
[null,"21.10","Produkcja podstawowych substancji farmaceutycznych"]
[null,"21.10.Z","Produkcja podstawowych substancji farmaceutycznych"]
[null,"21.2","Produkcja leków i pozostałych wyrobów farmaceutycznych"]
[null,"21.20","Produkcja leków i pozostałych wyrobów farmaceutycznych"]
[null,"21.20.Z","Produkcja leków i pozostałych wyrobów farmaceutycznych"]
[null,"22","PRODUKCJA WYROBÓW Z GUMY I TWORZYW SZTUCZNYCH"]
[null,"22.1","Produkcja wyrobów z gumy"]
[null,"22.11","Produkcja opon i dętek z gumy; bieżnikowanie i regenerowanie opon z gumy"]
[null,"22.11.Z","Produkcja opon i dętek z gumy; bieżnikowanie i regenerowanie opon z gumy"]
[null,"22.19","Produkcja pozostałych wyrobów z gumy"]
[null,"22.19.Z","Produkcja pozostałych wyrobów z gumy"]
[null,"22.2","Produkcja wyrobów z tworzyw sztucznych"]
[null,"22.21","Produkcja płyt, arkuszy, rur i kształtowników z tworzyw sztucznych"]
[null,"22.21.Z","Produkcja płyt, arkuszy, rur i kształtowników z tworzyw sztucznych"]
[null,"22.22","Produkcja opakowań z tworzyw sztucznych"]
[null,"22.22.Z","Produkcja opakowań z tworzyw sztucznych"]
[null,"22.23","Produkcja wyrobów dla budownictwa z tworzyw sztucznych"]
[null,"22.23.Z","Produkcja wyrobów dla budownictwa z tworzyw sztucznych"]
[null,"22.29","Produkcja pozostałych wyrobów z tworzyw sztucznych"]
[null,"22.29.Z","Produkcja pozostałych wyrobów z tworzyw sztucznych"]
[null,"23","PRODUKCJA WYROBÓW Z POZOSTAŁYCH MINERALNYCH SUROWCÓW NIEMETALICZNYCH"]
[null,"23.1","Produkcja szkła i wyrobów ze szkła"]
[null,"23.11","Produkcja szkła płaskiego"]
[null,"23.11.Z","Produkcja szkła płaskiego"]
[null,"23.12","Kształtowanie i obróbka szkła płaskiego"]
[null,"23.12.Z","Kształtowanie i obróbka szkła płaskiego"]
[null,"23.13","Produkcja szkła gospodarczego"]
[null,"23.13.Z","Produkcja szkła gospodarczego"]
[null,"23.14","Produkcja włókien szklanych"]
[null,"23.14.Z","Produkcja włókien szklanych"]
[null,"23.19","Produkcja i obróbka pozostałego szkła, włączając szkło techniczne"]
[null,"23.19.Z","Produkcja i obróbka pozostałego szkła, włączając szkło techniczne"]
[null,"23.2","Produkcja wyrobów ogniotrwałych"]
[null,"23.20","Produkcja wyrobów ogniotrwałych"]
[null,"23.20.Z","Produkcja wyrobów ogniotrwałych"]
[null,"23.3","Produkcja ceramicznych materiałów budowlanych"]
[null,"23.31","Produkcja ceramicznych kafli i płytek"]
[null,"23.31.Z","Produkcja ceramicznych kafli i płytek"]
[null,"23.32","Produkcja cegieł, dachówek i materiałów budowlanych, z wypalanej gliny"]
[null,"23.32.Z","Produkcja cegieł, dachówek i materiałów budowlanych, z wypalanej gliny"]
[null,"23.4","Produkcja pozostałych wyrobów z porcelany i ceramiki"]
[null,"23.41","Produkcja ceramicznych wyrobów stołowych i ozdobnych"]
[null,"23.41.Z","Produkcja ceramicznych wyrobów stołowych i ozdobnych"]
[null,"23.42","Produkcja ceramicznych wyrobów sanitarnych"]
[null,"23.42.Z","Produkcja ceramicznych wyrobów sanitarnych"]
[null,"23.43","Produkcja ceramicznych izolatorów i osłon izolacyjnych"]
[null,"23.43.Z","Produkcja ceramicznych izolatorów i osłon izolacyjnych"]
[null,"23.44","Produkcja pozostałych technicznych wyrobów ceramicznych"]
[null,"23.44.Z","Produkcja pozostałych technicznych wyrobów ceramicznych"]
[null,"23.49","Produkcja pozostałych wyrobów ceramicznych"]
[null,"23.49.Z","Produkcja pozostałych wyrobów ceramicznych"]
[null,"23.5","Produkcja cementu, wapna i gipsu"]
[null,"23.51","Produkcja cementu"]
[null,"23.51.Z","Produkcja cementu"]
[null,"23.52","Produkcja wapna i gipsu"]
[null,"23.52.Z","Produkcja wapna i gipsu"]
[null,"23.6","Produkcja wyrobów z betonu, cementu i gipsu"]
[null,"23.61","Produkcja wyrobów budowlanych z betonu"]
[null,"23.61.Z","Produkcja wyrobów budowlanych z betonu"]
[null,"23.62","Produkcja wyrobów budowlanych z gipsu"]
[null,"23.62.Z","Produkcja wyrobów budowlanych z gipsu"]
[null,"23.63","Produkcja masy betonowej prefabrykowanej"]
[null,"23.63.Z","Produkcja masy betonowej prefabrykowanej"]
[null,"23.64","Produkcja zaprawy murarskiej"]
[null,"23.64.Z","Produkcja zaprawy murarskiej"]
[null,"23.65","Produkcja cementu wzmocnionego włóknem"]
[null,"23.65.Z","Produkcja cementu wzmocnionego włóknem"]
[null,"23.69","Produkcja pozostałych wyrobów z betonu, gipsu i cementu"]
[null,"23.69.Z","Produkcja pozostałych wyrobów z betonu, gipsu i cementu"]
[null,"23.7","Cięcie, formowanie i wykańczanie kamienia"]
[null,"23.70","Cięcie, formowanie i wykańczanie kamienia"]
[null,"23.70.Z","Cięcie, formowanie i wykańczanie kamienia"]
[null,"23.9","Produkcja wyrobów ściernych i pozostałych wyrobów z mineralnych surowców niemetalicznych, gdzie indziej niesklasyfikowana"]
[null,"23.91","Produkcja wyrobów ściernych"]
[null,"23.91.Z","Produkcja wyrobów ściernych"]
[null,"23.99","Produkcja pozostałych wyrobów z mineralnych surowców niemetalicznych, gdzie indziej niesklasyfikowana"]
[null,"23.99.Z","Produkcja pozostałych wyrobów z mineralnych surowców niemetalicznych, gdzie indziej niesklasyfikowana"]
[null,"24","PRODUKCJA METALI"]
[null,"24.1","Produkcja surówki, żelazostopów, żeliwa i stali oraz wyrobów hutniczych"]
[null,"24.10","Produkcja surówki, żelazostopów, żeliwa i stali oraz wyrobów hutniczych"]
[null,"24.10.Z","Produkcja surówki, żelazostopów, żeliwa i stali oraz wyrobów hutniczych"]
[null,"24.2","Produkcja rur, przewodów, kształtowników zamkniętych i łączników, ze stali"]
[null,"24.20","Produkcja rur, przewodów, kształtowników zamkniętych i łączników, ze stali"]
[null,"24.20.Z","Produkcja rur, przewodów, kształtowników zamkniętych i łączników, ze stali"]
[null,"24.3","Produkcja pozostałych wyrobów ze stali poddanej wstępnej obróbce"]
[null,"24.31","Produkcja prętów ciągnionych na zimno"]
[null,"24.31.Z","Produkcja prętów ciągnionych na zimno"]
[null,"24.32","Produkcja wyrobów płaskich walcowanych na zimno"]
[null,"24.32.Z","Produkcja wyrobów płaskich walcowanych na zimno"]
[null,"24.33","Produkcja wyrobów formowanych na zimno"]
[null,"24.33.Z","Produkcja wyrobów formowanych na zimno"]
[null,"24.34","Produkcja drutu"]
[null,"24.34.Z","Produkcja drutu"]
[null,"24.4","Produkcja metali szlachetnych i innych metali nieżelaznych"]
[null,"24.41","Produkcja metali szlachetnych"]
[null,"24.41.Z","Produkcja metali szlachetnych"]
[null,"24.42","Produkcja aluminium"]
[null,"24.42.A","Produkcja aluminium hutniczego"]
[null,"24.42.B","Produkcja wyrobów z aluminium i stopów aluminium"]
[null,"24.43","Produkcja ołowiu, cynku i cyny"]
[null,"24.43.Z","Produkcja ołowiu, cynku i cyny"]
[null,"24.44","Produkcja miedzi"]
[null,"24.44.Z","Produkcja miedzi"]
[null,"24.45","Produkcja pozostałych metali nieżelaznych"]
[null,"24.45.Z","Produkcja pozostałych metali nieżelaznych"]
[null,"24.46","Wytwarzanie paliw jądrowych"]
[null,"24.46.Z","Wytwarzanie paliw jądrowych"]
[null,"24.5","Odlewnictwo metali"]
[null,"24.51","Odlewnictwo żeliwa"]
[null,"24.51.Z","Odlewnictwo żeliwa"]
[null,"24.52","Odlewnictwo staliwa"]
[null,"24.52.Z","Odlewnictwo staliwa"]
[null,"24.53","Odlewnictwo metali lekkich"]
[null,"24.53.Z","Odlewnictwo metali lekkich"]
[null,"24.54","Odlewnictwo pozostałych metali nieżelaznych"]
[null,"24.54.A","Odlewnictwo miedzi i stopów miedzi"]
[null,"24.54.B","Odlewnictwo pozostałych metali nieżelaznych, gdzie indziej niesklasyfikowane"]
[null,"25","PRODUKCJA METALOWYCH WYROBÓW GOTOWYCH, Z WYŁĄCZENIEM MASZYN I URZĄDZEŃ"]
[null,"25.1","Produkcja metalowych elementów konstrukcyjnych"]
[null,"25.11","Produkcja konstrukcji metalowych i ich części"]
[null,"25.11.Z","Produkcja konstrukcji metalowych i ich części"]
[null,"25.12","Produkcja metalowych elementów stolarki budowlanej"]
[null,"25.12.Z","Produkcja metalowych elementów stolarki budowlanej"]
[null,"25.2","Produkcja zbiorników, cystern i pojemników metalowych"]
[null,"25.21","Produkcja grzejników i kotłów centralnego ogrzewania"]
[null,"25.21.Z","Produkcja grzejników i kotłów centralnego ogrzewania"]
[null,"25.29","Produkcja pozostałych zbiorników, cystern i pojemników metalowych"]
[null,"25.29.Z","Produkcja pozostałych zbiorników, cystern i pojemników metalowych"]
[null,"25.3","Produkcja wytwornic pary, z wyłączeniem kotłów do centralnego ogrzewania gorącą wodą"]
[null,"25.30","Produkcja wytwornic pary, z wyłączeniem kotłów do centralnego ogrzewania gorącą wodą"]
[null,"25.30.Z","Produkcja wytwornic pary, z wyłączeniem kotłów do centralnego ogrzewania gorącą wodą"]
[null,"25.4","Produkcja broni i amunicji"]
[null,"25.40","Produkcja broni i amunicji"]
[null,"25.40.Z","Produkcja broni i amunicji"]
[null,"25.5","Kucie, prasowanie, wytłaczanie i walcowanie metali; metalurgia proszków"]
[null,"25.50","Kucie, prasowanie, wytłaczanie i walcowanie metali; metalurgia proszków"]
[null,"25.50.Z","Kucie, prasowanie, wytłaczanie i walcowanie metali; metalurgia proszków"]
[null,"25.6","Obróbka metali i nakładanie powłok na metale; obróbka mechaniczna elementów metalowych"]
[null,"25.61","Obróbka metali i nakładanie powłok na metale"]
[null,"25.61.Z","Obróbka metali i nakładanie powłok na metale"]
[null,"25.62","Obróbka mechaniczna elementów metalowych"]
[null,"25.62.Z","Obróbka mechaniczna elementów metalowych"]
[null,"25.7","Produkcja wyrobów nożowniczych, sztućców, narzędzi i wyrobów metalowych ogólnego przeznaczenia"]
[null,"25.71","Produkcja wyrobów nożowniczych i sztućców"]
[null,"25.71.Z","Produkcja wyrobów nożowniczych i sztućców"]
[null,"25.72","Produkcja zamków i zawiasów"]
[null,"25.72.Z","Produkcja zamków i zawiasów"]
[null,"25.73","Produkcja narzędzi"]
[null,"25.73.Z","Produkcja narzędzi"]
[null,"25.9","Produkcja pozostałych gotowych wyrobów metalowych"]
[null,"25.91","Produkcja pojemników metalowych"]
[null,"25.91.Z","Produkcja pojemników metalowych"]
[null,"25.92","Produkcja opakowań z metali "]
[null,"25.92.Z","Produkcja opakowań z metali "]
[null,"25.93","Produkcja wyrobów z drutu, łańcuchów i sprężyn"]
[null,"25.93.Z","Produkcja wyrobów z drutu, łańcuchów i sprężyn"]
[null,"25.94","Produkcja złączy i śrub"]
[null,"25.94.Z","Produkcja złączy i śrub"]
[null,"25.99","Produkcja pozostałych gotowych wyrobów metalowych, gdzie indziej niesklasyfikowana"]
[null,"25.99.Z","Produkcja pozostałych gotowych wyrobów metalowych, gdzie indziej niesklasyfikowana"]
[null,"26","PRODUKCJA KOMPUTERÓW, WYROBÓW ELEKTRONICZNYCH I OPTYCZNYCH"]
[null,"26.1","Produkcja elektronicznych elementów i obwodów drukowanych"]
[null,"26.11","Produkcja elementów elektronicznych"]
[null,"26.11.Z","Produkcja elementów elektronicznych"]
[null,"26.12","Produkcja elektronicznych obwodów drukowanych"]
[null,"26.12.Z","Produkcja elektronicznych obwodów drukowanych"]
[null,"26.2","Produkcja komputerów i urządzeń peryferyjnych"]
[null,"26.20","Produkcja komputerów i urządzeń peryferyjnych"]
[null,"26.20.Z","Produkcja komputerów i urządzeń peryferyjnych"]
[null,"26.3","Produkcja sprzętu (tele)komunikacyjnego"]
[null,"26.30","Produkcja sprzętu (tele)komunikacyjnego"]
[null,"26.30.Z","Produkcja sprzętu (tele)komunikacyjnego"]
[null,"26.4","Produkcja elektronicznego sprzętu powszechnego użytku"]
[null,"26.40","Produkcja elektronicznego sprzętu powszechnego użytku"]
[null,"26.40.Z","Produkcja elektronicznego sprzętu powszechnego użytku"]
[null,"26.5","Produkcja instrumentów i przyrządów pomiarowych, kontrolnych i nawigacyjnych; produkcja zegarków i zegarów"]
[null,"26.51","Produkcja instrumentów i przyrządów pomiarowych, kontrolnych i nawigacyjnych"]
[null,"26.51.Z","Produkcja instrumentów i przyrządów pomiarowych, kontrolnych i nawigacyjnych"]
[null,"26.52","Produkcja zegarków i zegarów"]
[null,"26.52.Z","Produkcja zegarków i zegarów"]
[null,"26.6","Produkcja urządzeń napromieniowujących, sprzętu elektromedycznego i elektroterapeutycznego"]
[null,"26.60","Produkcja urządzeń napromieniowujących, sprzętu elektromedycznego i elektroterapeutycznego"]
[null,"26.60.Z","Produkcja urządzeń napromieniowujących, sprzętu elektromedycznego i elektroterapeutycznego"]
[null,"26.7","Produkcja instrumentów optycznych i sprzętu fotograficznego"]
[null,"26.70","Produkcja instrumentów optycznych i sprzętu fotograficznego"]
[null,"26.70.Z","Produkcja instrumentów optycznych i sprzętu fotograficznego"]
[null,"26.8","Produkcja magnetycznych i optycznych niezapisanych nośników informacji"]
[null,"26.80","Produkcja magnetycznych i optycznych niezapisanych nośników informacji"]
[null,"26.80.Z","Produkcja magnetycznych i optycznych niezapisanych nośników informacji"]
[null,"27","PRODUKCJA URZĄDZEŃ ELEKTRYCZNYCH"]
[null,"27.1","Produkcja elektrycznych silników, prądnic, transformatorów, aparatury rozdzielczej i sterowniczej energii elektrycznej"]
[null,"27.11","Produkcja elektrycznych silników, prądnic i transformatorów"]
[null,"27.11.Z","Produkcja elektrycznych silników, prądnic i transformatorów"]
[null,"27.12","Produkcja aparatury rozdzielczej i sterowniczej energii elektrycznej"]
[null,"27.12.Z","Produkcja aparatury rozdzielczej i sterowniczej energii elektrycznej"]
[null,"27.2","Produkcja baterii i akumulatorów"]
[null,"27.20","Produkcja baterii i akumulatorów"]
[null,"27.20.Z","Produkcja baterii i akumulatorów"]
[null,"27.3","Produkcja izolowanych przewodów i kabli oraz sprzętu instalacyjnego"]
[null,"27.31","Produkcja kabli światłowodowych"]
[null,"27.31.Z","Produkcja kabli światłowodowych"]
[null,"27.32","Produkcja pozostałych elektronicznych i elektrycznych przewodów i kabli"]
[null,"27.32.Z","Produkcja pozostałych elektronicznych i elektrycznych przewodów i kabli"]
[null,"27.33","Produkcja sprzętu instalacyjnego"]
[null,"27.33.Z","Produkcja sprzętu instalacyjnego"]
[null,"27.4","Produkcja elektrycznego sprzętu oświetleniowego"]
[null,"27.40","Produkcja elektrycznego sprzętu oświetleniowego"]
[null,"27.40.Z","Produkcja elektrycznego sprzętu oświetleniowego"]
[null,"27.5","Produkcja sprzętu gospodarstwa domowego"]
[null,"27.51","Produkcja elektrycznego sprzętu gospodarstwa domowego"]
[null,"27.51.Z","Produkcja elektrycznego sprzętu gospodarstwa domowego"]
[null,"27.52","Produkcja nieelektrycznego sprzętu gospodarstwa domowego"]
[null,"27.52.Z","Produkcja nieelektrycznego sprzętu gospodarstwa domowego"]
[null,"27.9","Produkcja pozostałego sprzętu elektrycznego"]
[null,"27.90","Produkcja pozostałego sprzętu elektrycznego"]
[null,"27.90.Z","Produkcja pozostałego sprzętu elektrycznego"]
[null,"28","PRODUKCJA MASZYN I URZĄDZEŃ, GDZIE INDZIEJ NIESKLASYFIKOWANA"]
[null,"28.1","Produkcja maszyn ogólnego przeznaczenia"]
[null,"28.11","Produkcja silników i turbin, z wyłączeniem silników lotniczych, samochodowych i motocyklowych"]
[null,"28.11.Z","Produkcja silników i turbin, z wyłączeniem silników lotniczych, samochodowych i motocyklowych"]
[null,"28.12","Produkcja sprzętu i wyposażenia do napędu hydraulicznego i pneumatycznego"]
[null,"28.12.Z","Produkcja sprzętu i wyposażenia do napędu hydraulicznego i pneumatycznego"]
[null,"28.13","Produkcja pozostałych pomp i sprężarek"]
[null,"28.13.Z","Produkcja pozostałych pomp i sprężarek"]
[null,"28.14","Produkcja pozostałych kurków i zaworów"]
[null,"28.14.Z","Produkcja pozostałych kurków i zaworów"]
[null,"28.15","Produkcja łożysk, kół zębatych, przekładni zębatych i elementów napędowych"]
[null,"28.15.Z","Produkcja łożysk, kół zębatych, przekładni zębatych i elementów napędowych"]
[null,"28.2","Produkcja pozostałych maszyn ogólnego przeznaczenia"]
[null,"28.21","Produkcja pieców, palenisk i palników piecowych"]
[null,"28.21.Z","Produkcja pieców, palenisk i palników piecowych"]
[null,"28.22","Produkcja urządzeń dźwigowych i chwytaków"]
[null,"28.22.Z","Produkcja urządzeń dźwigowych i chwytaków"]
[null,"28.23","Produkcja maszyn i sprzętu biurowego, z wyłączeniem komputerów i urządzeń peryferyjnych"]
[null,"28.23.Z","Produkcja maszyn i sprzętu biurowego, z wyłączeniem komputerów i urządzeń peryferyjnych"]
[null,"28.24","Produkcja narzędzi ręcznych mechanicznych"]
[null,"28.24.Z","Produkcja narzędzi ręcznych mechanicznych"]
[null,"28.25","Produkcja przemysłowych urządzeń chłodniczych i wentylacyjnych"]
[null,"28.25.Z","Produkcja przemysłowych urządzeń chłodniczych i wentylacyjnych"]
[null,"28.29","Produkcja pozostałych maszyn ogólnego przeznaczenia, gdzie indziej niesklasyfikowana"]
[null,"28.29.Z","Produkcja pozostałych maszyn ogólnego przeznaczenia, gdzie indziej niesklasyfikowana"]
[null,"28.3","Produkcja maszyn dla rolnictwa i leśnictwa"]
[null,"28.30","Produkcja maszyn dla rolnictwa i leśnictwa"]
[null,"28.30.Z","Produkcja maszyn dla rolnictwa i leśnictwa"]
[null,"28.4","Produkcja maszyn i narzędzi mechanicznych"]
[null,"28.41","Produkcja maszyn do obróbki metalu"]
[null,"28.41.Z","Produkcja maszyn do obróbki metalu"]
[null,"28.49","Produkcja pozostałych narzędzi mechanicznych"]
[null,"28.49.Z","Produkcja pozostałych narzędzi mechanicznych"]
[null,"28.9","Produkcja pozostałych maszyn specjalnego przeznaczenia"]
[null,"28.91","Produkcja maszyn dla metalurgii"]
[null,"28.91.Z","Produkcja maszyn dla metalurgii"]
[null,"28.92","Produkcja maszyn dla górnictwa i do wydobywania oraz budownictwa"]
[null,"28.92.Z","Produkcja maszyn dla górnictwa i do wydobywania oraz budownictwa"]
[null,"28.93","Produkcja maszyn stosowanych w przetwórstwie żywności, tytoniu i produkcji napojów"]
[null,"28.93.Z","Produkcja maszyn stosowanych w przetwórstwie żywności, tytoniu i produkcji napojów"]
[null,"28.94","Produkcja maszyn dla przemysłu tekstylnego, odzieżowego i skórzanego"]
[null,"28.94.Z","Produkcja maszyn dla przemysłu tekstylnego, odzieżowego i skórzanego"]
[null,"28.95","Produkcja maszyn dla przemysłu papierniczego"]
[null,"28.95.Z","Produkcja maszyn dla przemysłu papierniczego"]
[null,"28.96","Produkcja maszyn do obróbki gumy lub tworzyw sztucznych oraz wytwarzania wyrobów z tych materiałów"]
[null,"28.96.Z","Produkcja maszyn do obróbki gumy lub tworzyw sztucznych oraz wytwarzania wyrobów z tych materiałów"]
[null,"28.99","Produkcja pozostałych maszyn specjalnego przeznaczenia, gdzie indziej niesklasyfikowana"]
[null,"28.99.Z","Produkcja pozostałych maszyn specjalnego przeznaczenia, gdzie indziej niesklasyfikowana"]
[null,"29","PRODUKCJA POJAZDÓW SAMOCHODOWYCH, PRZYCZEP I NACZEP, Z WYŁĄCZENIEM MOTOCYKLI"]
[null,"29.1","Produkcja pojazdów samochodowych, z wyłączeniem motocykli"]
[null,"29.10","Produkcja pojazdów samochodowych, z wyłączeniem motocykli"]
[null,"29.10.A","Produkcja silników do pojazdów samochodowych (z wyłączeniem motocykli) oraz do ciągników rolniczych"]
[null,"29.10.B","Produkcja samochodów osobowych"]
[null,"29.10.C","Produkcja autobusów"]
[null,"29.10.D","Produkcja pojazdów samochodowych przeznaczonych do przewozu towarów"]
[null,"29.10.E","Produkcja pozostałych pojazdów samochodowych, z wyłączeniem motocykli"]
[null,"29.2","Produkcja nadwozi do pojazdów silnikowych; produkcja przyczep i naczep"]
[null,"29.20","Produkcja nadwozi do pojazdów silnikowych; produkcja przyczep i naczep"]
[null,"29.20.Z","Produkcja nadwozi do pojazdów silnikowych; produkcja przyczep i naczep"]
[null,"29.3","Produkcja części i akcesoriów do pojazdów silnikowych"]
[null,"29.31","Produkcja wyposażenia elektrycznego i elektronicznego do pojazdów silnikowych"]
[null,"29.31.Z","Produkcja wyposażenia elektrycznego i elektronicznego do pojazdów silnikowych"]
[null,"29.32","Produkcja pozostałych części i akcesoriów do pojazdów silnikowych, z wyłączeniem motocykli"]
[null,"29.32.Z","Produkcja pozostałych części i akcesoriów do pojazdów silnikowych, z wyłączeniem motocykli"]
[null,"30","PRODUKCJA POZOSTAŁEGO SPRZĘTU TRANSPORTOWEGO"]
[null,"30.1","Produkcja statków i łodzi"]
[null,"30.11","Produkcja statków i konstrukcji pływających"]
[null,"30.11.Z","Produkcja statków i konstrukcji pływających"]
[null,"30.12","Produkcja łodzi wycieczkowych i sportowych"]
[null,"30.12.Z","Produkcja łodzi wycieczkowych i sportowych"]
[null,"30.2","Produkcja lokomotyw kolejowych oraz taboru szynowego"]
[null,"30.20","Produkcja lokomotyw kolejowych oraz taboru szynowego"]
[null,"30.20.Z","Produkcja lokomotyw kolejowych oraz taboru szynowego"]
[null,"30.3","Produkcja statków powietrznych, statków kosmicznych i podobnych maszyn"]
[null,"30.30","Produkcja statków powietrznych, statków kosmicznych i podobnych maszyn"]
[null,"30.30.Z","Produkcja statków powietrznych, statków kosmicznych i podobnych maszyn"]
[null,"30.4","Produkcja wojskowych pojazdów bojowych"]
[null,"30.40","Produkcja wojskowych pojazdów bojowych"]
[null,"30.40.Z","Produkcja wojskowych pojazdów bojowych"]
[null,"30.9","Produkcja sprzętu transportowego, gdzie indziej niesklasyfikowana"]
[null,"30.91","Produkcja motocykli"]
[null,"30.91.Z","Produkcja motocykli"]
[null,"30.92","Produkcja rowerów i wózków inwalidzkich"]
[null,"30.92.Z","Produkcja rowerów i wózków inwalidzkich"]
[null,"30.99","Produkcja pozostałego sprzętu transportowego, gdzie indziej niesklasyfikowana"]
[null,"30.99.Z","Produkcja pozostałego sprzętu transportowego, gdzie indziej niesklasyfikowana"]
[null,"31","PRODUKCJA MEBLI"]
[null,"31.0","PRODUKCJA MEBLI"]
[null,"31.01","Produkcja mebli biurowych i sklepowych"]
[null,"31.01.Z","Produkcja mebli biurowych i sklepowych"]
[null,"31.02","Produkcja mebli kuchennych"]
[null,"31.02.Z","Produkcja mebli kuchennych"]
[null,"31.03","Produkcja materaców"]
[null,"31.03.Z","Produkcja materaców"]
[null,"31.09","Produkcja pozostałych mebli"]
[null,"31.09.Z","Produkcja pozostałych mebli"]
[null,"32","POZOSTAŁA PRODUKCJA WYROBÓW"]
[null,"32.1","Produkcja wyrobów jubilerskich, biżuterii i podobnych wyrobów"]
[null,"32.11","Produkcja monet"]
[null,"32.11.Z","Produkcja monet"]
[null,"32.12","Produkcja wyrobów jubilerskich i podobnych"]
[null,"32.12.Z","Produkcja wyrobów jubilerskich i podobnych"]
[null,"32.13","Produkcja sztucznej biżuterii i wyrobów podobnych"]
[null,"32.13.Z","Produkcja sztucznej biżuterii i wyrobów podobnych"]
[null,"32.2","Produkcja instrumentów muzycznych"]
[null,"32.20","Produkcja instrumentów muzycznych"]
[null,"32.20.Z","Produkcja instrumentów muzycznych"]
[null,"32.3","Produkcja sprzętu sportowego"]
[null,"32.30","Produkcja sprzętu sportowego"]
[null,"32.30.Z","Produkcja sprzętu sportowego"]
[null,"32.4","Produkcja gier i zabawek"]
[null,"32.40","Produkcja gier i zabawek"]
[null,"32.40.Z","Produkcja gier i zabawek"]
[null,"32.5","Produkcja urządzeń, instrumentów oraz wyrobów medycznych, włączając dentystyczne"]
[null,"32.50","Produkcja urządzeń, instrumentów oraz wyrobów medycznych, włączając dentystyczne"]
[null,"32.50.Z","Produkcja urządzeń, instrumentów oraz wyrobów medycznych, włączając dentystyczne"]
[null,"32.9","Produkcja wyrobów, gdzie indziej niesklasyfikowana"]
[null,"32.91","Produkcja mioteł, szczotek i pędzli"]
[null,"32.91.Z","Produkcja mioteł, szczotek i pędzli"]
[null,"32.99","Produkcja pozostałych wyrobów, gdzie indziej niesklasyfikowana"]
[null,"32.99.Z","Produkcja pozostałych wyrobów, gdzie indziej niesklasyfikowana"]
[null,"33","NAPRAWA, KONSERWACJA I INSTALOWANIE MASZYN I URZĄDZEŃ"]
[null,"33.1","Naprawa i konserwacja metalowych wyrobów gotowych, maszyn i urządzeń"]
[null,"33.11","Naprawa i konserwacja metalowych wyrobów gotowych"]
[null,"33.11.Z","Naprawa i konserwacja metalowych wyrobów gotowych"]
[null,"33.12","Naprawa i konserwacja maszyn"]
[null,"33.12.Z","Naprawa i konserwacja maszyn"]
[null,"33.13","Naprawa i konserwacja urządzeń elektronicznych i optycznych"]
[null,"33.13.Z","Naprawa i konserwacja urządzeń elektronicznych i optycznych"]
[null,"33.14","Naprawa i konserwacja urządzeń elektrycznych"]
[null,"33.14.Z","Naprawa i konserwacja urządzeń elektrycznych"]
[null,"33.15","Naprawa i konserwacja statków i łodzi"]
[null,"33.15.Z","Naprawa i konserwacja statków i łodzi"]
[null,"33.16","Naprawa i konserwacja statków powietrznych i statków kosmicznych"]
[null,"33.16.Z","Naprawa i konserwacja statków powietrznych i statków kosmicznych"]
[null,"33.17","Naprawa i konserwacja pozostałego sprzętu transportowego"]
[null,"33.17.Z","Naprawa i konserwacja pozostałego sprzętu transportowego"]
[null,"33.19","Naprawa i konserwacja pozostałego sprzętu i wyposażenia"]
[null,"33.19.Z","Naprawa i konserwacja pozostałego sprzętu i wyposażenia"]
[null,"33.2","Instalowanie maszyn przemysłowych, sprzętu i wyposażenia"]
[null,"33.20","Instalowanie maszyn przemysłowych, sprzętu i wyposażenia"]
[null,"33.20.Z","Instalowanie maszyn przemysłowych, sprzętu i wyposażenia"]
[null,"D","WYTWARZANIE I ZAOPATRYWANIE W ENERGIĘ ELEKTRYCZNĄ, GAZ, PARĘ WODNĄ, GORĄCĄ WODĘ I POWIETRZE DO UKŁADÓW KLIMATYZACYJNYCH"]
[null,"35","WYTWARZANIE I ZAOPATRYWANIE W ENERGIĘ ELEKTRYCZNĄ, GAZ, PARĘ WODNĄ, GORĄCĄ WODĘ I POWIETRZE DO UKŁADÓW KLIMATYZACYJNYCH"]
[null,"35.1","Wytwarzanie, przesyłanie, dystrybucja i handel energią elektryczną"]
[null,"35.11","Wytwarzanie energii elektrycznej"]
[null,"35.11.Z","Wytwarzanie energii elektrycznej"]
[null,"35.12","Przesyłanie energii elektrycznej"]
[null,"35.12.Z","Przesyłanie energii elektrycznej"]
[null,"35.13","Dystrybucja energii elektrycznej"]
[null,"35.13.Z","Dystrybucja energii elektrycznej"]
[null,"35.14","Handel energią elektryczną"]
[null,"35.14.Z","Handel energią elektryczną"]
[null,"35.2","Wytwarzanie paliw gazowych; dystrybucja i handel paliwami gazowymi w systemie sieciowym"]
[null,"35.21","Wytwarzanie paliw gazowych"]
[null,"35.21.Z","Wytwarzanie paliw gazowych"]
[null,"35.22","Dystrybucja paliw gazowych w systemie sieciowym"]
[null,"35.22.Z","Dystrybucja paliw gazowych w systemie sieciowym"]
[null,"35.23","Handel paliwami gazowymi w systemie sieciowym"]
[null,"35.23.Z","Handel paliwami gazowymi w systemie sieciowym"]
[null,"35.3","Wytwarzanie i zaopatrywanie w parę wodną, gorącą wodę i powietrze do układów klimatyzacyjnych"]
[null,"35.30","Wytwarzanie i zaopatrywanie w parę wodną, gorącą wodę i powietrze do układów klimatyzacyjnych"]
[null,"35.30.Z","Wytwarzanie i zaopatrywanie w parę wodną, gorącą wodę i powietrze do układów klimatyzacyjnych"]
[null,"E","DOSTAWA WODY; GOSPODAROWANIE ŚCIEKAMI I ODPADAMI ORAZ DZIAŁALNOŚĆ ZWIĄZANA Z REKULTYWACJĄ"]
[null,"36","POBÓR, UZDATNIANIE I DOSTARCZANIE WODY"]
[null,"36.0","POBÓR, UZDATNIANIE I DOSTARCZANIE WODY"]
[null,"36.00","POBÓR, UZDATNIANIE I DOSTARCZANIE WODY"]
[null,"36.00.Z","POBÓR, UZDATNIANIE I DOSTARCZANIE WODY"]
[null,"37","ODPROWADZANIE I OCZYSZCZANIE ŚCIEKÓW"]
[null,"37.0","ODPROWADZANIE I OCZYSZCZANIE ŚCIEKÓW"]
[null,"37.00","ODPROWADZANIE I OCZYSZCZANIE ŚCIEKÓW"]
[null,"37.00.Z","ODPROWADZANIE I OCZYSZCZANIE ŚCIEKÓW"]
[null,"38","DZIAŁALNOŚĆ ZWIĄZANA ZE ZBIERANIEM, PRZETWARZANIEM I UNIESZKODLIWIANIEM ODPADÓW; ODZYSK SUROWCÓW"]
[null,"38.1","Zbieranie odpadów"]
[null,"38.11","Zbieranie odpadów innych niż niebezpieczne"]
[null,"38.11.Z","Zbieranie odpadów innych niż niebezpieczne"]
[null,"38.12","Zbieranie odpadów niebezpiecznych"]
[null,"38.12.Z","Zbieranie odpadów niebezpiecznych"]
[null,"38.2","Przetwarzanie i unieszkodliwianie odpadów"]
[null,"38.21","Obróbka i usuwanie odpadów innych niż niebezpieczne"]
[null,"38.21.Z","Obróbka i usuwanie odpadów innych niż niebezpieczne"]
[null,"38.22","Przetwarzanie i unieszkodliwianie odpadów niebezpiecznych"]
[null,"38.22.Z","Przetwarzanie i unieszkodliwianie odpadów niebezpiecznych"]
[null,"38.3","Odzysk surowców"]
[null,"38.31","Demontaż wyrobów zużytych"]
[null,"38.31.Z","Demontaż wyrobów zużytych"]
[null,"38.32","Odzysk surowców z materiałów segregowanych"]
[null,"38.32.Z","Odzysk surowców z materiałów segregowanych"]
[null,"39","DZIAŁALNOŚĆ ZWIĄZANA Z REKULTYWACJĄ I POZOSTAŁA DZIAŁALNOŚĆ USŁUGOWA ZWIĄZANA Z GOSPODARKĄ ODPADAMI"]
[null,"39.0","DZIAŁALNOŚĆ ZWIĄZANA Z REKULTYWACJĄ I POZOSTAŁA DZIAŁALNOŚĆ USŁUGOWA ZWIĄZANA Z GOSPODARKĄ ODPADAMI"]
[null,"39.00","DZIAŁALNOŚĆ ZWIĄZANA Z REKULTYWACJĄ I POZOSTAŁA DZIAŁALNOŚĆ USŁUGOWA ZWIĄZANA Z GOSPODARKĄ ODPADAMI"]
[null,"39.00.Z","DZIAŁALNOŚĆ ZWIĄZANA Z REKULTYWACJĄ I POZOSTAŁA DZIAŁALNOŚĆ USŁUGOWA ZWIĄZANA Z GOSPODARKĄ ODPADAMI"]
[null,"F","BUDOWNICTWO"]
[null,"41","ROBOTY BUDOWLANE ZWIĄZANE ZE WZNOSZENIEM BUDYNKÓW"]
[null,"41.1","Realizacja projektów budowlanych związanych ze wznoszeniem budynków"]
[null,"41.10","Realizacja projektów budowlanych związanych ze wznoszeniem budynków"]
[null,"41.10.Z","Realizacja projektów budowlanych związanych ze wznoszeniem budynków"]
[null,"41.2","Roboty budowlane związane ze wznoszeniem budynków mieszkalnych i niemieszkalnych"]
[null,"41.20","Roboty budowlane związane ze wznoszeniem budynków mieszkalnych i niemieszkalnych"]
[null,"41.20.Z","Roboty budowlane związane ze wznoszeniem budynków mieszkalnych i niemieszkalnych"]
[null,"42","ROBOTY ZWIĄZANE Z BUDOWĄ OBIEKTÓW INŻYNIERII LĄDOWEJ I WODNEJ"]
[null,"42.1","Roboty związane z budową dróg kołowych i szynowych"]
[null,"42.11","Roboty związane z budową dróg i autostrad"]
[null,"42.11.Z","Roboty związane z budową dróg i autostrad"]
[null,"42.12","Roboty związane z budową dróg szynowych i kolei podziemnej"]
[null,"42.12.Z","Roboty związane z budową dróg szynowych i kolei podziemnej"]
[null,"42.13","Roboty związane z budową mostów i tuneli"]
[null,"42.13.Z","Roboty związane z budową mostów i tuneli"]
[null,"42.2","Roboty związane z budową rurociągów, linii telekomunikacyjnych i elektroenergetycznych"]
[null,"42.21","Roboty związane z budową rurociągów przesyłowych i sieci rozdzielczych"]
[null,"42.21.Z","Roboty związane z budową rurociągów przesyłowych i sieci rozdzielczych"]
[null,"42.22","Roboty związane z budową linii telekomunikacyjnych i elektroenergetycznych"]
[null,"42.22.Z","Roboty związane z budową linii telekomunikacyjnych i elektroenergetycznych"]
[null,"42.9","Roboty związane z budową pozostałych obiektów inżynierii lądowej i wodnej"]
[null,"42.91","Roboty związane z budową obiektów inżynierii wodnej"]
[null,"42.91.Z","Roboty związane z budową obiektów inżynierii wodnej"]
[null,"42.99","Roboty związane z budową pozostałych obiektów inżynierii lądowej i wodnej, gdzie indziej niesklasyfikowane"]
[null,"42.99.Z","Roboty związane z budową pozostałych obiektów inżynierii lądowej i wodnej, gdzie indziej niesklasyfikowane"]
[null,"43","ROBOTY BUDOWLANE SPECJALISTYCZNE"]
[null,"43.1","Rozbiórka i przygotowanie terenu pod budowę"]
[null,"43.11","Rozbiórka i burzenie obiektów budowlanych"]
[null,"43.11.Z","Rozbiórka i burzenie obiektów budowlanych"]
[null,"43.12","Przygotowanie terenu pod budowę"]
[null,"43.12.Z","Przygotowanie terenu pod budowę"]
[null,"43.13","Wykonywanie wykopów i wierceń geologiczno-inżynierskich"]
[null,"43.13.Z","Wykonywanie wykopów i wierceń geologiczno-inżynierskich"]
[null,"43.2","Wykonywanie instalacji elektrycznych, wodno-kanalizacyjnych i pozostałych instalacji budowlanych"]
[null,"43.21","Wykonywanie instalacji elektrycznych"]
[null,"43.21.Z","Wykonywanie instalacji elektrycznych"]
[null,"43.22","Wykonywanie instalacji wodno-kanalizacyjnych, cieplnych, gazowych i klimatyzacyjnych"]
[null,"43.22.Z","Wykonywanie instalacji wodno-kanalizacyjnych, cieplnych, gazowych i klimatyzacyjnych"]
[null,"43.29","Wykonywanie pozostałych instalacji budowlanych"]
[null,"43.29.Z","Wykonywanie pozostałych instalacji budowlanych"]
[null,"43.3","Wykonywanie robót budowlanych wykończeniowych"]
[null,"43.31","Tynkowanie"]
[null,"43.31.Z","Tynkowanie"]
[null,"43.32","Zakładanie stolarki budowlanej"]
[null,"43.32.Z","Zakładanie stolarki budowlanej"]
[null,"43.33","Posadzkarstwo; tapetowanie i oblicowywanie ścian"]
[null,"43.33.Z","Posadzkarstwo; tapetowanie i oblicowywanie ścian"]
[null,"43.34","Malowanie i szklenie"]
[null,"43.34.Z","Malowanie i szklenie"]
[null,"43.39","Wykonywanie pozostałych robót budowlanych wykończeniowych"]
[null,"43.39.Z","Wykonywanie pozostałych robót budowlanych wykończeniowych"]
[null,"43.9","Pozostałe specjalistyczne roboty budowlane"]
[null,"43.91","Wykonywanie konstrukcji i pokryć dachowych"]
[null,"43.91.Z","Wykonywanie konstrukcji i pokryć dachowych"]
[null,"43.99","Pozostałe specjalistyczne roboty budowlane, gdzie indziej niesklasyfikowane"]
[null,"43.99.Z","Pozostałe specjalistyczne roboty budowlane, gdzie indziej niesklasyfikowane"]
[null,"G","HANDEL HURTOWY I DETALICZNY; NAPRAWA POJAZDÓW SAMOCHODOWYCH, WŁĄCZAJĄC MOTOCYKLE"]
[null,"45","HANDEL HURTOWY I DETALICZNY POJAZDAMI SAMOCHODOWYMI; NAPRAWA POJAZDÓW SAMOCHODOWYCH"]
[null,"45.1","Sprzedaż hurtowa i detaliczna pojazdów samochodowych, z wyłączeniem motocykli"]
[null,"45.11","Sprzedaż hurtowa i detaliczna samochodów osobowych i furgonetek"]
[null,"45.11.Z","Sprzedaż hurtowa i detaliczna samochodów osobowych i furgonetek"]
[null,"45.19","Sprzedaż hurtowa i detaliczna pozostałych pojazdów samochodowych, z wyłączeniem motocykli"]
[null,"45.19.Z","Sprzedaż hurtowa i detaliczna pozostałych pojazdów samochodowych, z wyłączeniem motocykli"]
[null,"45.2","Konserwacja i naprawa pojazdów samochodowych, z wyłączeniem motocykli"]
[null,"45.20","Konserwacja i naprawa pojazdów samochodowych, z wyłączeniem motocykli"]
[null,"45.20.Z","Konserwacja i naprawa pojazdów samochodowych, z wyłączeniem motocykli"]
[null,"45.3","Sprzedaż hurtowa i detaliczna części i akcesoriów do pojazdów samochodowych, z wyłączeniem motocykli"]
[null,"45.31","Sprzedaż hurtowa części i akcesoriów do pojazdów samochodowych, z wyłączeniem motocykli"]
[null,"45.31.Z","Sprzedaż hurtowa części i akcesoriów do pojazdów samochodowych, z wyłączeniem motocykli"]
[null,"45.32","Sprzedaż detaliczna części i akcesoriów do pojazdów samochodowych, z wyłączeniem motocykli"]
[null,"45.32.Z","Sprzedaż detaliczna części i akcesoriów do pojazdów samochodowych, z wyłączeniem motocykli"]
[null,"45.4","Sprzedaż hurtowa i detaliczna motocykli, ich naprawa i konserwacja oraz sprzedaż hurtowa i detaliczna części i akcesoriów do nich"]
[null,"45.40","Sprzedaż hurtowa i detaliczna motocykli, ich naprawa i konserwacja oraz sprzedaż hurtowa i detaliczna części i akcesoriów do nich"]
[null,"45.40.Z","Sprzedaż hurtowa i detaliczna motocykli, ich naprawa i konserwacja oraz sprzedaż hurtowa i detaliczna części i akcesoriów do nich"]
[null,"46","HANDEL HURTOWY, Z WYŁĄCZENIEM HANDLU POJAZDAMI SAMOCHODOWYMI"]
[null,"46.1","Sprzedaż hurtowa realizowana na zlecenie"]
[null,"46.11","Działalność agentów zajmujących się sprzedażą płodów rolnych, żywych zwierząt, surowców dla przemysłu tekstylnego i półproduktów"]
[null,"46.11.Z","Działalność agentów zajmujących się sprzedażą płodów rolnych, żywych zwierząt, surowców dla przemysłu tekstylnego i półproduktów"]
[null,"46.12","Działalność agentów zajmujących się sprzedażą paliw, rud, metali i chemikaliów przemysłowych"]
[null,"46.12.Z","Działalność agentów zajmujących się sprzedażą paliw, rud, metali i chemikaliów przemysłowych"]
[null,"46.13","Działalność agentów zajmujących się sprzedażą drewna i materiałów budowlanych"]
[null,"46.13.Z","Działalność agentów zajmujących się sprzedażą drewna i materiałów budowlanych"]
[null,"46.14","Działalność agentów zajmujących się sprzedażą maszyn, urządzeń przemysłowych, statków i samolotów"]
[null,"46.14.Z","Działalność agentów zajmujących się sprzedażą maszyn, urządzeń przemysłowych, statków i samolotów"]
[null,"46.15","Działalność agentów zajmujących się sprzedażą mebli, artykułów gospodarstwa domowego i drobnych wyrobów metalowych"]
[null,"46.15.Z","Działalność agentów zajmujących się sprzedażą mebli, artykułów gospodarstwa domowego i drobnych wyrobów metalowych"]
[null,"46.16","Działalność agentów zajmujących się sprzedażą wyrobów tekstylnych, odzieży, wyrobów futrzarskich, obuwia i artykułów skórzanych"]
[null,"46.16.Z","Działalność agentów zajmujących się sprzedażą wyrobów tekstylnych, odzieży, wyrobów futrzarskich, obuwia i artykułów skórzanych"]
[null,"46.17","Działalność agentów zajmujących się sprzedażą żywności, napojów i wyrobów tytoniowych"]
[null,"46.17.Z","Działalność agentów zajmujących się sprzedażą żywności, napojów i wyrobów tytoniowych"]
[null,"46.18","Działalność agentów specjalizujących się w sprzedaży pozostałych określonych towarów"]
[null,"46.18.Z","Działalność agentów specjalizujących się w sprzedaży pozostałych określonych towarów"]
[null,"46.19","Działalność agentów zajmujących się sprzedażą towarów różnego rodzaju"]
[null,"46.19.Z","Działalność agentów zajmujących się sprzedażą towarów różnego rodzaju"]
[null,"46.2","Sprzedaż hurtowa płodów rolnych i żywych zwierząt"]
[null,"46.21","Sprzedaż hurtowa zboża, nieprzetworzonego tytoniu, nasion i pasz dla zwierząt"]
[null,"46.21.Z","Sprzedaż hurtowa zboża, nieprzetworzonego tytoniu, nasion i pasz dla zwierząt"]
[null,"46.22","Sprzedaż hurtowa kwiatów i roślin"]
[null,"46.22.Z","Sprzedaż hurtowa kwiatów i roślin"]
[null,"46.23","Sprzedaż hurtowa żywych zwierząt"]
[null,"46.23.Z","Sprzedaż hurtowa żywych zwierząt"]
[null,"46.24","Sprzedaż hurtowa skór"]
[null,"46.24.Z","Sprzedaż hurtowa skór"]
[null,"46.3","Sprzedaż hurtowa żywności, napojów i wyrobów tytoniowych"]
[null,"46.31","Sprzedaż hurtowa owoców i warzyw"]
[null,"46.31.Z","Sprzedaż hurtowa owoców i warzyw"]
[null,"46.32","Sprzedaż hurtowa mięsa i wyrobów z mięsa"]
[null,"46.32.Z","Sprzedaż hurtowa mięsa i wyrobów z mięsa"]
[null,"46.33","Sprzedaż hurtowa mleka, wyrobów mleczarskich, jaj, olejów i tłuszczów jadalnych"]
[null,"46.33.Z","Sprzedaż hurtowa mleka, wyrobów mleczarskich, jaj, olejów i tłuszczów jadalnych"]
[null,"46.34","Sprzedaż hurtowa napojów alkoholowych i bezalkoholowych"]
[null,"46.34.A","Sprzedaż hurtowa napojów alkoholowych"]
[null,"46.34.B","Sprzedaż hurtowa napojów bezalkoholowych"]
[null,"46.35","Sprzedaż hurtowa wyrobów tytoniowych"]
[null,"46.35.Z","Sprzedaż hurtowa wyrobów tytoniowych"]
[null,"46.36","Sprzedaż hurtowa cukru, czekolady, wyrobów cukierniczych i piekarskich"]
[null,"46.36.Z","Sprzedaż hurtowa cukru, czekolady, wyrobów cukierniczych i piekarskich"]
[null,"46.37","Sprzedaż hurtowa herbaty, kawy, kakao i przypraw"]
[null,"46.37.Z","Sprzedaż hurtowa herbaty, kawy, kakao i przypraw"]
[null,"46.38","Sprzedaż hurtowa pozostałej żywności, włączając ryby, skorupiaki i mięczaki"]
[null,"46.38.Z","Sprzedaż hurtowa pozostałej żywności, włączając ryby, skorupiaki i mięczaki"]
[null,"46.39","Sprzedaż hurtowa niewyspecjalizowana żywności, napojów i wyrobów tytoniowych"]
[null,"46.39.Z","Sprzedaż hurtowa niewyspecjalizowana żywności, napojów i wyrobów tytoniowych"]
[null,"46.4","Sprzedaż hurtowa artykułów użytku domowego"]
[null,"46.41","Sprzedaż hurtowa wyrobów tekstylnych"]
[null,"46.41.Z","Sprzedaż hurtowa wyrobów tekstylnych"]
[null,"46.42","Sprzedaż hurtowa odzieży i obuwia"]
[null,"46.42.Z","Sprzedaż hurtowa odzieży i obuwia"]
[null,"46.43","Sprzedaż hurtowa elektrycznych artykułów użytku domowego"]
[null,"46.43.Z","Sprzedaż hurtowa elektrycznych artykułów użytku domowego"]
[null,"46.44","Sprzedaż hurtowa wyrobów porcelanowych, ceramicznych i szklanych oraz środków czyszczących"]
[null,"46.44.Z","Sprzedaż hurtowa wyrobów porcelanowych, ceramicznych i szklanych oraz środków czyszczących"]
[null,"46.45","Sprzedaż hurtowa perfum i kosmetyków"]
[null,"46.45.Z","Sprzedaż hurtowa perfum i kosmetyków"]
[null,"46.46","Sprzedaż hurtowa wyrobów farmaceutycznych i medycznych"]
[null,"46.46.Z","Sprzedaż hurtowa wyrobów farmaceutycznych i medycznych"]
[null,"46.47","Sprzedaż hurtowa mebli, dywanów i sprzętu oświetleniowego"]
[null,"46.47.Z","Sprzedaż hurtowa mebli, dywanów i sprzętu oświetleniowego"]
[null,"46.48","Sprzedaż hurtowa zegarków, zegarów i biżuterii"]
[null,"46.48.Z","Sprzedaż hurtowa zegarków, zegarów i biżuterii"]
[null,"46.49","Sprzedaż hurtowa pozostałych artykułów użytku domowego"]
[null,"46.49.Z","Sprzedaż hurtowa pozostałych artykułów użytku domowego"]
[null,"46.5","Sprzedaż hurtowa narzędzi technologii informacyjnej i komunikacyjnej"]
[null,"46.51","Sprzedaż hurtowa komputerów, urządzeń peryferyjnych i oprogramowania"]
[null,"46.51.Z","Sprzedaż hurtowa komputerów, urządzeń peryferyjnych i oprogramowania"]
[null,"46.52","Sprzedaż hurtowa sprzętu elektronicznego i telekomunikacyjnego oraz części do niego"]
[null,"46.52.Z","Sprzedaż hurtowa sprzętu elektronicznego i telekomunikacyjnego oraz części do niego"]
[null,"46.6","Sprzedaż hurtowa maszyn, urządzeń i dodatkowego wyposażenia"]
[null,"46.61","Sprzedaż hurtowa maszyn i urządzeń rolniczych oraz dodatkowego wyposażenia"]
[null,"46.61.Z","Sprzedaż hurtowa maszyn i urządzeń rolniczych oraz dodatkowego wyposażenia"]
[null,"46.62","Sprzedaż hurtowa obrabiarek"]
[null,"46.62.Z","Sprzedaż hurtowa obrabiarek"]
[null,"46.63","Sprzedaż hurtowa maszyn wykorzystywanych w górnictwie, budownictwie oraz inżynierii lądowej i wodnej"]
[null,"46.63.Z","Sprzedaż hurtowa maszyn wykorzystywanych w górnictwie, budownictwie oraz inżynierii lądowej i wodnej"]
[null,"46.64","Sprzedaż hurtowa maszyn dla przemysłu tekstylnego oraz maszyn do szycia i maszyn dziewiarskich"]
[null,"46.64.Z","Sprzedaż hurtowa maszyn dla przemysłu tekstylnego oraz maszyn do szycia i maszyn dziewiarskich"]
[null,"46.65","Sprzedaż hurtowa mebli biurowych"]
[null,"46.65.Z","Sprzedaż hurtowa mebli biurowych"]
[null,"46.66","Sprzedaż hurtowa pozostałych maszyn i urządzeń biurowych"]
[null,"46.66.Z","Sprzedaż hurtowa pozostałych maszyn i urządzeń biurowych"]
[null,"46.69","Sprzedaż hurtowa pozostałych maszyn i urządzeń"]
[null,"46.69.Z","Sprzedaż hurtowa pozostałych maszyn i urządzeń"]
[null,"46.7","Pozostała wyspecjalizowana sprzedaż hurtowa"]
[null,"46.71","Sprzedaż hurtowa paliw i produktów pochodnych"]
[null,"46.71.Z","Sprzedaż hurtowa paliw i produktów pochodnych"]
[null,"46.72","Sprzedaż hurtowa metali i rud metali"]
[null,"46.72.Z","Sprzedaż hurtowa metali i rud metali"]
[null,"46.73","Sprzedaż hurtowa drewna, materiałów budowlanych i wyposażenia sanitarnego"]
[null,"46.73.Z","Sprzedaż hurtowa drewna, materiałów budowlanych i wyposażenia sanitarnego"]
[null,"46.74","Sprzedaż hurtowa wyrobów metalowych oraz sprzętu i dodatkowego wyposażenia hydraulicznego i grzejnego"]
[null,"46.74.Z","Sprzedaż hurtowa wyrobów metalowych oraz sprzętu i dodatkowego wyposażenia hydraulicznego i grzejnego"]
[null,"46.75","Sprzedaż hurtowa wyrobów chemicznych"]
[null,"46.75.Z","Sprzedaż hurtowa wyrobów chemicznych"]
[null,"46.76","Sprzedaż hurtowa pozostałych półproduktów"]
[null,"46.76.Z","Sprzedaż hurtowa pozostałych półproduktów"]
[null,"46.77","Sprzedaż hurtowa odpadów i złomu"]
[null,"46.77.Z","Sprzedaż hurtowa odpadów i złomu"]
[null,"46.9","Sprzedaż hurtowa niewyspecjalizowana"]
[null,"46.90","Sprzedaż hurtowa niewyspecjalizowana"]
[null,"46.90.Z","Sprzedaż hurtowa niewyspecjalizowana"]
[null,"47","HANDEL DETALICZNY, Z WYŁĄCZENIEM HANDLU DETALICZNEGO POJAZDAMI SAMOCHODOWYMI"]
[null,"47.1","Sprzedaż detaliczna prowadzona w niewyspecjalizowanych sklepach"]
[null,"47.11","Sprzedaż detaliczna prowadzona w niewyspecjalizowanych sklepach z przewagą żywności, napojów i wyrobów tytoniowych"]
[null,"47.11.Z","Sprzedaż detaliczna prowadzona w niewyspecjalizowanych sklepach z przewagą żywności, napojów i wyrobów tytoniowych"]
[null,"47.19","Pozostała sprzedaż detaliczna prowadzona w niewyspecjalizowanych sklepach"]
[null,"47.19.Z","Pozostała sprzedaż detaliczna prowadzona w niewyspecjalizowanych sklepach"]
[null,"47.2","Sprzedaż detaliczna żywności, napojów i wyrobów tytoniowych prowadzona w wyspecjalizowanych sklepach"]
[null,"47.21","Sprzedaż detaliczna owoców i warzyw prowadzona w wyspecjalizowanych sklepach"]
[null,"47.21.Z","Sprzedaż detaliczna owoców i warzyw prowadzona w wyspecjalizowanych sklepach"]
[null,"47.22","Sprzedaż detaliczna mięsa i wyrobów z mięsa prowadzona w wyspecjalizowanych sklepach"]
[null,"47.22.Z","Sprzedaż detaliczna mięsa i wyrobów z mięsa prowadzona w wyspecjalizowanych sklepach"]
[null,"47.23","Sprzedaż detaliczna ryb, skorupiaków i mięczaków prowadzona w wyspecjalizowanych sklepach"]
[null,"47.23.Z","Sprzedaż detaliczna ryb, skorupiaków i mięczaków prowadzona w wyspecjalizowanych sklepach"]
[null,"47.24","Sprzedaż detaliczna pieczywa, ciast, wyrobów ciastkarskich i cukierniczych prowadzona w wyspecjalizowanych sklepach"]
[null,"47.24.Z","Sprzedaż detaliczna pieczywa, ciast, wyrobów ciastkarskich i cukierniczych prowadzona w wyspecjalizowanych sklepach"]
[null,"47.25","Sprzedaż detaliczna napojów alkoholowych i bezalkoholowych prowadzona w wyspecjalizowanych sklepach"]
[null,"47.25.Z","Sprzedaż detaliczna napojów alkoholowych i bezalkoholowych prowadzona w wyspecjalizowanych sklepach"]
[null,"47.26","Sprzedaż detaliczna wyrobów tytoniowych prowadzona w wyspecjalizowanych sklepach"]
[null,"47.26.Z","Sprzedaż detaliczna wyrobów tytoniowych prowadzona w wyspecjalizowanych sklepach"]
[null,"47.29","Sprzedaż detaliczna pozostałej żywności prowadzona w wyspecjalizowanych sklepach"]
[null,"47.29.Z","Sprzedaż detaliczna pozostałej żywności prowadzona w wyspecjalizowanych sklepach"]
[null,"47.3","Sprzedaż detaliczna paliw do pojazdów silnikowych na stacjach paliw"]
[null,"47.30","Sprzedaż detaliczna paliw do pojazdów silnikowych na stacjach paliw"]
[null,"47.30.Z","Sprzedaż detaliczna paliw do pojazdów silnikowych na stacjach paliw"]
[null,"47.4","Sprzedaż detaliczna narzędzi technologii informacyjnej i komunikacyjnej prowadzona w wyspecjalizowanych sklepach"]
[null,"47.41","Sprzedaż detaliczna komputerów, urządzeń peryferyjnych i oprogramowania prowadzona w wyspecjalizowanych sklepach"]
[null,"47.41.Z","Sprzedaż detaliczna komputerów, urządzeń peryferyjnych i oprogramowania prowadzona w wyspecjalizowanych sklepach"]
[null,"47.42","Sprzedaż detaliczna sprzętu telekomunikacyjnego prowadzona w wyspecjalizowanych sklepach"]
[null,"47.42.Z","Sprzedaż detaliczna sprzętu telekomunikacyjnego prowadzona w wyspecjalizowanych sklepach"]
[null,"47.43","Sprzedaż detaliczna sprzętu audiowizualnego prowadzona w wyspecjalizowanych sklepach"]
[null,"47.43.Z","Sprzedaż detaliczna sprzętu audiowizualnego prowadzona w wyspecjalizowanych sklepach"]
[null,"47.5","Sprzedaż detaliczna artykułów użytku domowego prowadzona w wyspecjalizowanych sklepach"]
[null,"47.51","Sprzedaż detaliczna wyrobów tekstylnych prowadzona w wyspecjalizowanych sklepach"]
[null,"47.51.Z","Sprzedaż detaliczna wyrobów tekstylnych prowadzona w wyspecjalizowanych sklepach"]
[null,"47.52","Sprzedaż detaliczna drobnych wyrobów metalowych, farb i szkła prowadzona w wyspecjalizowanych sklepach"]
[null,"47.52.Z","Sprzedaż detaliczna drobnych wyrobów metalowych, farb i szkła prowadzona w wyspecjalizowanych sklepach"]
[null,"47.53","Sprzedaż detaliczna dywanów, chodników i innych pokryć podłogowych oraz pokryć ściennych prowadzona w wyspecjalizowanych sklepach"]
[null,"47.53.Z","Sprzedaż detaliczna dywanów, chodników i innych pokryć podłogowych oraz pokryć ściennych prowadzona w wyspecjalizowanych sklepach"]
[null,"47.54","Sprzedaż detaliczna elektrycznego sprzętu gospodarstwa domowego prowadzona w wyspecjalizowanych sklepach"]
[null,"47.54.Z","Sprzedaż detaliczna elektrycznego sprzętu gospodarstwa domowego prowadzona w wyspecjalizowanych sklepach"]
[null,"47.59","Sprzedaż detaliczna mebli, sprzętu oświetleniowego i pozostałych artykułów użytku domowego prowadzona w wyspecjalizowanych sklepach"]
[null,"47.59.Z","Sprzedaż detaliczna mebli, sprzętu oświetleniowego i pozostałych artykułów użytku domowego prowadzona w wyspecjalizowanych sklepach"]
[null,"47.6","Sprzedaż detaliczna wyrobów związanych z kulturą i rekreacją prowadzona w wyspecjalizowanych sklepach"]
[null,"47.61","Sprzedaż detaliczna książek prowadzona w wyspecjalizowanych sklepach"]
[null,"47.61.Z","Sprzedaż detaliczna książek prowadzona w wyspecjalizowanych sklepach"]
[null,"47.62","Sprzedaż detaliczna gazet i artykułów piśmiennych prowadzona w wyspecjalizowanych sklepach"]
[null,"47.62.Z","Sprzedaż detaliczna gazet i artykułów piśmiennych prowadzona w wyspecjalizowanych sklepach"]
[null,"47.63","Sprzedaż detaliczna nagrań dźwiękowych i audiowizualnych prowadzona w wyspecjalizowanych sklepach"]
[null,"47.63.Z","Sprzedaż detaliczna nagrań dźwiękowych i audiowizualnych prowadzona w wyspecjalizowanych sklepach"]
[null,"47.64","Sprzedaż detaliczna sprzętu sportowego prowadzona w wyspecjalizowanych sklepach"]
[null,"47.64.Z","Sprzedaż detaliczna sprzętu sportowego prowadzona w wyspecjalizowanych sklepach"]
[null,"47.65","Sprzedaż detaliczna gier i zabawek prowadzona w wyspecjalizowanych sklepach"]
[null,"47.65.Z","Sprzedaż detaliczna gier i zabawek prowadzona w wyspecjalizowanych sklepach"]
[null,"47.7","Sprzedaż detaliczna pozostałych wyrobów prowadzona w wyspecjalizowanych sklepach"]
[null,"47.71","Sprzedaż detaliczna odzieży prowadzona w wyspecjalizowanych sklepach"]
[null,"47.71.Z","Sprzedaż detaliczna odzieży prowadzona w wyspecjalizowanych sklepach"]
[null,"47.72","Sprzedaż detaliczna obuwia i wyrobów skórzanych prowadzona w wyspecjalizowanych sklepach"]
[null,"47.72.Z","Sprzedaż detaliczna obuwia i wyrobów skórzanych prowadzona w wyspecjalizowanych sklepach"]
[null,"47.73","Sprzedaż detaliczna wyrobów farmaceutycznych prowadzona w wyspecjalizowanych sklepach"]
[null,"47.73.Z","Sprzedaż detaliczna wyrobów farmaceutycznych prowadzona w wyspecjalizowanych sklepach"]
[null,"47.74","Sprzedaż detaliczna wyrobów medycznych, włączając ortopedyczne, prowadzona w wyspecjalizowanych sklepach"]
[null,"47.74.Z","Sprzedaż detaliczna wyrobów medycznych, włączając ortopedyczne, prowadzona w wyspecjalizowanych sklepach"]
[null,"47.75","Sprzedaż detaliczna kosmetyków i artykułów toaletowych prowadzona w wyspecjalizowanych sklepach"]
[null,"47.75.Z","Sprzedaż detaliczna kosmetyków i artykułów toaletowych prowadzona w wyspecjalizowanych sklepach"]
[null,"47.76","Sprzedaż detaliczna kwiatów, roślin, nasion, nawozów, żywych zwierząt domowych, karmy dla zwierząt domowych prowadzona w wyspecjalizowanych sklepach"]
[null,"47.76.Z","Sprzedaż detaliczna kwiatów, roślin, nasion, nawozów, żywych zwierząt domowych, karmy dla zwierząt domowych prowadzona w wyspecjalizowanych sklepach"]
[null,"47.77","Sprzedaż detaliczna zegarków, zegarów i biżuterii prowadzona w wyspecjalizowanych sklepach"]
[null,"47.77.Z","Sprzedaż detaliczna zegarków, zegarów i biżuterii prowadzona w wyspecjalizowanych sklepach"]
[null,"47.78","Sprzedaż detaliczna pozostałych nowych wyrobów prowadzona w wyspecjalizowanych sklepach"]
[null,"47.78.Z","Sprzedaż detaliczna pozostałych nowych wyrobów prowadzona w wyspecjalizowanych sklepach"]
[null,"47.79","Sprzedaż detaliczna artykułów używanych prowadzona w wyspecjalizowanych sklepach"]
[null,"47.79.Z","Sprzedaż detaliczna artykułów używanych prowadzona w wyspecjalizowanych sklepach"]
[null,"47.8","Sprzedaż detaliczna prowadzona na straganach i targowiskach"]
[null,"47.81","Sprzedaż detaliczna żywności, napojów i wyrobów tytoniowych prowadzona na straganach i targowiskach"]
[null,"47.81.Z","Sprzedaż detaliczna żywności, napojów i wyrobów tytoniowych prowadzona na straganach i targowiskach"]
[null,"47.82","Sprzedaż detaliczna wyrobów tekstylnych, odzieży i obuwia prowadzona na straganach i targowiskach"]
[null,"47.82.Z","Sprzedaż detaliczna wyrobów tekstylnych, odzieży i obuwia prowadzona na straganach i targowiskach"]
[null,"47.89","Sprzedaż detaliczna pozostałych wyrobów prowadzona na straganach i targowiskach"]
[null,"47.89.Z","Sprzedaż detaliczna pozostałych wyrobów prowadzona na straganach i targowiskach"]
[null,"47.9","Sprzedaż detaliczna prowadzona poza siecią sklepową, straganami i targowiskami"]
[null,"47.91","Sprzedaż detaliczna prowadzona przez domy sprzedaży wysyłkowej lub Internet"]
[null,"47.91.Z","Sprzedaż detaliczna prowadzona przez domy sprzedaży wysyłkowej lub Internet"]
[null,"47.99","Pozostała sprzedaż detaliczna prowadzona poza siecią sklepową, straganami i targowiskami"]
[null,"47.99.Z","Pozostała sprzedaż detaliczna prowadzona poza siecią sklepową, straganami i targowiskami"]
[null,"H","TRANSPORT I GOSPODARKA MAGAZYNOWA"]
[null,"49","TRANSPORT LĄDOWY ORAZ TRANSPORT RUROCIĄGOWY"]
[null,"49.1","Transport kolejowy pasażerski międzymiastowy"]
[null,"49.10","Transport kolejowy pasażerski międzymiastowy"]
[null,"49.10.Z","Transport kolejowy pasażerski międzymiastowy"]
[null,"49.2","Transport kolejowy towarów"]
[null,"49.20","Transport kolejowy towarów"]
[null,"49.20.Z","Transport kolejowy towarów"]
[null,"49.3","Pozostały transport lądowy pasażerski"]
[null,"49.31","Transport lądowy pasażerski, miejski i podmiejski"]
[null,"49.31.Z","Transport lądowy pasażerski, miejski i podmiejski"]
[null,"49.32","Działalność taksówek osobowych"]
[null,"49.32.Z","Działalność taksówek osobowych"]
[null,"49.39","Pozostały transport lądowy pasażerski, gdzie indziej niesklasyfikowany"]
[null,"49.39.Z","Pozostały transport lądowy pasażerski, gdzie indziej niesklasyfikowany"]
[null,"49.4","Transport drogowy towarów oraz działalność usługowa związana z przeprowadzkami"]
[null,"49.41","Transport drogowy towarów"]
[null,"49.41.Z","Transport drogowy towarów"]
[null,"49.42","Działalność usługowa związana z przeprowadzkami"]
[null,"49.42.Z","Działalność usługowa związana z przeprowadzkami"]
[null,"49.5","Transport rurociągowy"]
[null,"49.50","Transport rurociągowy"]
[null,"49.50.A","Transport rurociągami paliw gazowych"]
[null,"49.50.B","Transport rurociągowy pozostałych towarów"]
[null,"50","TRANSPORT WODNY"]
[null,"50.1","Transport morski i przybrzeżny pasażerski"]
[null,"50.10","Transport morski i przybrzeżny pasażerski"]
[null,"50.10.Z","Transport morski i przybrzeżny pasażerski"]
[null,"50.2","Transport morski i przybrzeżny towarów"]
[null,"50.20","Transport morski i przybrzeżny towarów"]
[null,"50.20.Z","Transport morski i przybrzeżny towarów"]
[null,"50.3","Transport wodny śródlądowy pasażerski "]
[null,"50.30","Transport wodny śródlądowy pasażerski "]
[null,"50.30.Z","Transport wodny śródlądowy pasażerski "]
[null,"50.4","Transport wodny śródlądowy towarów"]
[null,"50.40","Transport wodny śródlądowy towarów"]
[null,"50.40.Z","Transport wodny śródlądowy towarów"]
[null,"51","TRANSPORT LOTNICZY"]
[null,"51.1","Transport lotniczy pasażerski"]
[null,"51.10","Transport lotniczy pasażerski"]
[null,"51.10.Z","Transport lotniczy pasażerski"]
[null,"51.2","Transport lotniczy towarów i transport kosmiczny"]
[null,"51.21","Transport lotniczy towarów"]
[null,"51.21.Z","Transport lotniczy towarów"]
[null,"51.22","Transport kosmiczny"]
[null,"51.22.Z","Transport kosmiczny"]
[null,"52","MAGAZYNOWANIE I DZIAŁALNOŚĆ USŁUGOWA WSPOMAGAJĄCA TRANSPORT"]
[null,"52.1","Magazynowanie i przechowywanie towarów"]
[null,"52.10","Magazynowanie i przechowywanie towarów"]
[null,"52.10.A","Magazynowanie i przechowywanie paliw gazowych"]
[null,"52.10.B","Magazynowanie i przechowywanie pozostałych towarów"]
[null,"52.2","Działalność usługowa wspomagająca transport"]
[null,"52.21","Działalność usługowa wspomagająca transport lądowy"]
[null,"52.21.Z","Działalność usługowa wspomagająca transport lądowy"]
[null,"52.22","Działalność usługowa wspomagająca transport wodny"]
[null,"52.22.A","Działalność usługowa wspomagająca transport morski"]
[null,"52.22.B","Działalność usługowa wspomagająca transport śródlądowy"]
[null,"52.23","Działalność usługowa wspomagająca transport lotniczy"]
[null,"52.23.Z","Działalność usługowa wspomagająca transport lotniczy"]
[null,"52.24","Przeładunek towarów"]
[null,"52.24.A","Przeładunek towarów w portach morskich"]
[null,"52.24.B","Przeładunek towarów w portach śródlądowych"]
[null,"52.24.C","Przeładunek towarów w pozostałych punktach przeładunkowych"]
[null,"52.29","Pozostała działalność usługowa wspomagająca transport"]
[null,"52.29.A","Działalność morskich agencji transportowych"]
[null,"52.29.B","Działalność śródlądowych agencji transportowych"]
[null,"52.29.C","Działalność pozostałych agencji transportowych"]
[null,"53","DZIAŁALNOŚĆ POCZTOWA I KURIERSKA"]
[null,"53.1","Działalność pocztowa objęta obowiązkiem świadczenia usług powszechnych (operatora publicznego)"]
[null,"53.10","Działalność pocztowa objęta obowiązkiem świadczenia usług powszechnych (operatora publicznego)"]
[null,"53.10.Z","Działalność pocztowa objęta obowiązkiem świadczenia usług powszechnych (operatora publicznego)"]
[null,"53.2","Pozostała działalność pocztowa i kurierska"]
[null,"53.20","Pozostała działalność pocztowa i kurierska"]
[null,"53.20.Z","Pozostała działalność pocztowa i kurierska"]
[null,"I","DZIAŁALNOŚĆ ZWIĄZANA Z ZAKWATEROWANIEM I USŁUGAMI GASTRONOMICZNYMI"]
[null,"55","ZAKWATEROWANIE"]
[null,"55.1","Hotele i podobne obiekty zakwaterowania"]
[null,"55.10","Hotele i podobne obiekty zakwaterowania"]
[null,"55.10.Z","Hotele i podobne obiekty zakwaterowania"]
[null,"55.2","Obiekty noclegowe turystyczne i miejsca krótkotrwałego zakwaterowania"]
[null,"55.20","Obiekty noclegowe turystyczne i miejsca krótkotrwałego zakwaterowania"]
[null,"55.20.Z","Obiekty noclegowe turystyczne i miejsca krótkotrwałego zakwaterowania"]
[null,"55.3","Pola kempingowe (włączając pola dla pojazdów kempingowych) i pola namiotowe"]
[null,"55.30","Pola kempingowe (włączając pola dla pojazdów kempingowych) i pola namiotowe"]
[null,"55.30.Z","Pola kempingowe (włączając pola dla pojazdów kempingowych) i pola namiotowe"]
[null,"55.9","Pozostałe zakwaterowanie"]
[null,"55.90","Pozostałe zakwaterowanie"]
[null,"55.90.Z","Pozostałe zakwaterowanie"]
[null,"56","DZIAŁALNOŚĆ USŁUGOWA ZWIĄZANA Z WYŻYWIENIEM"]
[null,"56.1","Restauracje i pozostałe placówki gastronomiczne"]
[null,"56.10","Restauracje i pozostałe placówki gastronomiczne"]
[null,"56.10.A","Restauracje i inne stałe placówki gastronomiczne"]
[null,"56.10.B","Ruchome placówki gastronomiczne"]
[null,"56.2","Przygotowywanie żywności dla odbiorców zewnętrznych (katering) i pozostała gastronomiczna działalność usługowa"]
[null,"56.21","Przygotowywanie i dostarczanie żywności dla odbiorców zewnętrznych (katering)"]
[null,"56.21.Z","Przygotowywanie i dostarczanie żywności dla odbiorców zewnętrznych (katering)"]
[null,"56.29","Pozostała usługowa działalność gastronomiczna"]
[null,"56.29.Z","Pozostała usługowa działalność gastronomiczna"]
[null,"56.3","Przygotowywanie i podawanie napojów"]
[null,"56.30","Przygotowywanie i podawanie napojów"]
[null,"56.30.Z","Przygotowywanie i podawanie napojów"]
[null,"J","INFORMACJA I KOMUNIKACJA"]
[null,"58","DZIAŁALNOŚĆ WYDAWNICZA"]
[null,"58.1","Wydawanie książek i periodyków oraz pozostała działalność wydawnicza, z wyłączeniem w zakresie oprogramowania"]
[null,"58.11","Wydawanie książek"]
[null,"58.11.Z","Wydawanie książek"]
[null,"58.12","Wydawanie wykazów oraz list (np. adresowych, telefonicznych)"]
[null,"58.12.Z","Wydawanie wykazów oraz list (np. adresowych, telefonicznych)"]
[null,"58.13","Wydawanie gazet"]
[null,"58.13.Z","Wydawanie gazet"]
[null,"58.14","Wydawanie czasopism i pozostałych periodyków"]
[null,"58.14.Z","Wydawanie czasopism i pozostałych periodyków"]
[null,"58.19","Pozostała działalność wydawnicza"]
[null,"58.19.Z","Pozostała działalność wydawnicza"]
[null,"58.2","Działalność wydawnicza w zakresie oprogramowania"]
[null,"58.21","Działalność wydawnicza w zakresie gier komputerowych"]
[null,"58.21.Z","Działalność wydawnicza w zakresie gier komputerowych"]
[null,"58.29","Działalność wydawnicza w zakresie pozostałego oprogramowania"]
[null,"58.29.Z","Działalność wydawnicza w zakresie pozostałego oprogramowania"]
[null,"59","DZIAŁALNOŚĆ ZWIĄZANA Z PRODUKCJĄ FILMÓW, NAGRAŃ WIDEO, PROGRAMÓW TELEWIZYJNYCH, NAGRAŃ DŹWIĘKOWYCH I MUZYCZNYCH"]
[null,"59.1","Działalność związana z filmami, nagraniami wideo i programami telewizyjnymi"]
[null,"59.11","Działalność związana z produkcją filmów, nagrań wideo i programów telewizyjnych"]
[null,"59.11.Z","Działalność związana z produkcją filmów, nagrań wideo i programów telewizyjnych"]
[null,"59.12","Działalność postprodukcyjna związana z filmami, nagraniami wideo i programami telewizyjnymi"]
[null,"59.12.Z","Działalność postprodukcyjna związana z filmami, nagraniami wideo i programami telewizyjnymi"]
[null,"59.13","Działalność związana z dystrybucją filmów, nagrań wideo i programów telewizyjnych"]
[null,"59.13.Z","Działalność związana z dystrybucją filmów, nagrań wideo i programów telewizyjnych"]
[null,"59.14","Działalność związana z projekcją filmów"]
[null,"59.14.Z","Działalność związana z projekcją filmów"]
[null,"59.2","Działalność w zakresie nagrań dźwiękowych i muzycznych"]
[null,"59.20","Działalność w zakresie nagrań dźwiękowych i muzycznych"]
[null,"59.20.Z","Działalność w zakresie nagrań dźwiękowych i muzycznych"]
[null,"60","NADAWANIE PROGRAMÓW OGÓLNODOSTĘPNYCH I ABONAMENTOWYCH"]
[null,"60.1","Nadawanie programów radiofonicznych"]
[null,"60.10","Nadawanie programów radiofonicznych"]
[null,"60.10.Z","Nadawanie programów radiofonicznych"]
[null,"60.2","Nadawanie programów telewizyjnych ogólnodostępnych i abonamentowych"]
[null,"60.20","Nadawanie programów telewizyjnych ogólnodostępnych i abonamentowych"]
[null,"60.20.Z","Nadawanie programów telewizyjnych ogólnodostępnych i abonamentowych"]
[null,"61","TELEKOMUNIKACJA"]
[null,"61.1","Działalność w zakresie telekomunikacji przewodowej"]
[null,"61.10","Działalność w zakresie telekomunikacji przewodowej"]
[null,"61.10.Z","Działalność w zakresie telekomunikacji przewodowej"]
[null,"61.2","Działalność w zakresie telekomunikacji bezprzewodowej, z wyłączeniem telekomunikacji satelitarnej"]
[null,"61.20","Działalność w zakresie telekomunikacji bezprzewodowej, z wyłączeniem telekomunikacji satelitarnej"]
[null,"61.20.Z","Działalność w zakresie telekomunikacji bezprzewodowej, z wyłączeniem telekomunikacji satelitarnej"]
[null,"61.3","Działalność w zakresie telekomunikacji satelitarnej"]
[null,"61.30","Działalność w zakresie telekomunikacji satelitarnej"]
[null,"61.30.Z","Działalność w zakresie telekomunikacji satelitarnej"]
[null,"61.9","Działalność w zakresie pozostałej telekomunikacji"]
[null,"61.90","Działalność w zakresie pozostałej telekomunikacji"]
[null,"61.90.Z","Działalność w zakresie pozostałej telekomunikacji"]
[null,"62","DZIAŁALNOŚĆ ZWIĄZANA Z OPROGRAMOWANIEM I DORADZTWEM W ZAKRESIE INFORMATYKI ORAZ DZIAŁALNOŚĆ POWIĄZANA"]
[null,"62.0","DZIAŁALNOŚĆ ZWIĄZANA Z OPROGRAMOWANIEM I DORADZTWEM W ZAKRESIE INFORMATYKI ORAZ DZIAŁALNOŚĆ POWIĄZANA"]
[null,"62.01","Działalność związana z oprogramowaniem"]
[null,"62.01.Z","Działalność związana z oprogramowaniem"]
[null,"62.02","Działalność związana z doradztwem w zakresie informatyki"]
[null,"62.02.Z","Działalność związana z doradztwem w zakresie informatyki"]
[null,"62.03","Działalność związana z zarządzaniem urządzeniami informatycznymi"]
[null,"62.03.Z","Działalność związana z zarządzaniem urządzeniami informatycznymi"]
[null,"62.09","Pozostała działalność usługowa w zakresie technologii informatycznych i komputerowych"]
[null,"62.09.Z","Pozostała działalność usługowa w zakresie technologii informatycznych i komputerowych"]
[null,"63","DZIAŁALNOŚĆ USŁUGOWA W ZAKRESIE INFORMACJI"]
[null,"63.1","Przetwarzanie danych; zarządzanie stronami internetowymi (hosting) i podobna działalność; działalność portali internetowych"]
[null,"63.11","Przetwarzanie danych; zarządzanie stronami internetowymi (hosting) i podobna działalność"]
[null,"63.11.Z","Przetwarzanie danych; zarządzanie stronami internetowymi (hosting) i podobna działalność"]
[null,"63.12","Działalność portali internetowych"]
[null,"63.12.Z","Działalność portali internetowych"]
[null,"63.9","Pozostała działalność usługowa w zakresie informacji"]
[null,"63.91","Działalność agencji informacyjnych"]
[null,"63.91.Z","Działalność agencji informacyjnych"]
[null,"63.99","Pozostała działalność usługowa w zakresie informacji, gdzie indziej niesklasyfikowana"]
[null,"63.99.Z","Pozostała działalność usługowa w zakresie informacji, gdzie indziej niesklasyfikowana"]
[null,"K","DZIAŁALNOŚĆ FINANSOWA I UBEZPIECZENIOWA"]
[null,"64","FINANSOWA DZIAŁALNOŚĆ USŁUGOWA, Z WYŁĄCZENIEM UBEZPIECZEŃ I FUNDUSZÓW EMERYTALNYCH"]
[null,"64.1","Pośrednictwo pieniężne"]
[null,"64.11","Działalność banku centralnego"]
[null,"64.11.Z","Działalność banku centralnego"]
[null,"64.19","Pozostałe pośrednictwo pieniężne"]
[null,"64.19.Z","Pozostałe pośrednictwo pieniężne"]
[null,"64.2","Działalność holdingów finansowych"]
[null,"64.20","Działalność holdingów finansowych"]
[null,"64.20.Z","Działalność holdingów finansowych"]
[null,"64.3","Działalność trustów, funduszów i podobnych instytucji finansowych"]
[null,"64.30","Działalność trustów, funduszów i podobnych instytucji finansowych"]
[null,"64.30.Z","Działalność trustów, funduszów i podobnych instytucji finansowych"]
[null,"64.9","Pozostała finansowa działalność usługowa, z wyłączeniem ubezpieczeń i funduszów emerytalnych"]
[null,"64.91","Leasing finansowy"]
[null,"64.91.Z","Leasing finansowy"]
[null,"64.92","Pozostałe formy udzielania kredytów"]
[null,"64.92.Z","Pozostałe formy udzielania kredytów"]
[null,"64.99","Pozostała finansowa działalność usługowa, gdzie indziej niesklasyfikowana, z wyłączeniem ubezpieczeń i funduszów emerytalnych"]
[null,"64.99.Z","Pozostała finansowa działalność usługowa, gdzie indziej niesklasyfikowana, z wyłączeniem ubezpieczeń i funduszów emerytalnych"]
[null,"65","UBEZPIECZENIA, REASEKURACJA ORAZ FUNDUSZE EMERYTALNE, Z WYŁĄCZENIEM OBOWIĄZKOWEGO UBEZPIECZENIA SPOŁECZNEGO"]
[null,"65.1","Ubezpieczenia"]
[null,"65.11","Ubezpieczenia na życie"]
[null,"65.11.Z","Ubezpieczenia na życie"]
[null,"65.12","Pozostałe ubezpieczenia osobowe oraz ubezpieczenia majątkowe"]
[null,"65.12.Z","Pozostałe ubezpieczenia osobowe oraz ubezpieczenia majątkowe"]
[null,"65.2","Reasekuracja"]
[null,"65.20","Reasekuracja"]
[null,"65.20.Z","Reasekuracja"]
[null,"65.3","Fundusze emerytalne"]
[null,"65.30","Fundusze emerytalne"]
[null,"65.30.Z","Fundusze emerytalne"]
[null,"66","DZIAŁALNOŚĆ WSPOMAGAJĄCA USŁUGI FINANSOWE ORAZ UBEZPIECZENIA I FUNDUSZE EMERYTALNE"]
[null,"66.1","Działalność wspomagająca usługi finansowe, z wyłączeniem ubezpieczeń i funduszów emerytalnych"]
[null,"66.11","Zarządzanie rynkami finansowymi"]
[null,"66.11.Z","Zarządzanie rynkami finansowymi"]
[null,"66.12","Działalność maklerska związana z rynkiem papierów wartościowych i towarów giełdowych"]
[null,"66.12.Z","Działalność maklerska związana z rynkiem papierów wartościowych i towarów giełdowych"]
[null,"66.19","Pozostała działalność wspomagająca usługi finansowe, z wyłączeniem ubezpieczeń i funduszów emerytalnych"]
[null,"66.19.Z","Pozostała działalność wspomagająca usługi finansowe, z wyłączeniem ubezpieczeń i funduszów emerytalnych"]
[null,"66.2","Działalność wspomagająca ubezpieczenia i fundusze emerytalne"]
[null,"66.21","Działalność związana z oceną ryzyka i szacowaniem poniesionych strat"]
[null,"66.21.Z","Działalność związana z oceną ryzyka i szacowaniem poniesionych strat"]
[null,"66.22","Działalność agentów i brokerów ubezpieczeniowych"]
[null,"66.22.Z","Działalność agentów i brokerów ubezpieczeniowych"]
[null,"66.29","Pozostała działalność wspomagająca ubezpieczenia i fundusze emerytalne"]
[null,"66.29.Z","Pozostała działalność wspomagająca ubezpieczenia i fundusze emerytalne"]
[null,"66.3","Działalność związana z zarządzaniem funduszami"]
[null,"66.30","Działalność związana z zarządzaniem funduszami"]
[null,"66.30.Z","Działalność związana z zarządzaniem funduszami"]
[null,"L","DZIAŁALNOŚĆ ZWIĄZANA Z OBSŁUGĄ RYNKU NIERUCHOMOŚCI"]
[null,"68","DZIAŁALNOŚĆ ZWIĄZANA Z OBSŁUGĄ RYNKU NIERUCHOMOŚCI"]
[null,"68.1","Kupno i sprzedaż nieruchomości na własny rachunek"]
[null,"68.10","Kupno i sprzedaż nieruchomości na własny rachunek"]
[null,"68.10.Z","Kupno i sprzedaż nieruchomości na własny rachunek"]
[null,"68.2","Wynajem i zarządzanie nieruchomościami własnymi lub dzierżawionymi"]
[null,"68.20","Wynajem i zarządzanie nieruchomościami własnymi lub dzierżawionymi"]
[null,"68.20.Z","Wynajem i zarządzanie nieruchomościami własnymi lub dzierżawionymi"]
[null,"68.3","Działalność związana z obsługą rynku nieruchomości wykonywana na zlecenie"]
[null,"68.31","Pośrednictwo w obrocie nieruchomościami"]
[null,"68.31.Z","Pośrednictwo w obrocie nieruchomościami"]
[null,"68.32","Zarządzanie nieruchomościami wykonywane na zlecenie"]
[null,"68.32.Z","Zarządzanie nieruchomościami wykonywane na zlecenie"]
[null,"M","DZIAŁALNOŚĆ PROFESJONALNA, NAUKOWA I TECHNICZNA"]
[null,"69","DZIAŁALNOŚĆ PRAWNICZA, RACHUNKOWO-KSIĘGOWA I DORADZTWO PODATKOWE"]
[null,"69.1","Działalność prawnicza"]
[null,"69.10","Działalność prawnicza"]
[null,"69.10.Z","Działalność prawnicza"]
[null,"69.2","Działalność rachunkowo-księgowa; doradztwo podatkowe"]
[null,"69.20","Działalność rachunkowo-księgowa; doradztwo podatkowe"]
[null,"69.20.Z","Działalność rachunkowo-księgowa; doradztwo podatkowe"]
[null,"70","DZIAŁALNOŚĆ FIRM CENTRALNYCH (HEAD OFFICES); DORADZTWO ZWIĄZANE Z ZARZĄDZANIEM"]
[null,"70.1","Działalność firm centralnych (head offices) i holdingów, z wyłączeniem holdingów finansowych"]
[null,"70.10","Działalność firm centralnych (head offices) i holdingów, z wyłączeniem holdingów finansowych"]
[null,"70.10.Z","Działalność firm centralnych (head offices) i holdingów, z wyłączeniem holdingów finansowych"]
[null,"70.2","Doradztwo związane z zarządzaniem"]
[null,"70.21","Stosunki międzyludzkie (public relations) i komunikacja"]
[null,"70.21.Z","Stosunki międzyludzkie (public relations) i komunikacja"]
[null,"70.22","Pozostałe doradztwo w zakresie prowadzenia działalności gospodarczej i zarządzania"]
[null,"70.22.Z","Pozostałe doradztwo w zakresie prowadzenia działalności gospodarczej i zarządzania"]
[null,"71","DZIAŁALNOŚĆ W ZAKRESIE ARCHITEKTURY I INŻYNIERII; BADANIA I ANALIZY TECHNICZNE"]
[null,"71.1","Działalność w zakresie architektury i inżynierii oraz związane z nią doradztwo techniczne"]
[null,"71.11","Działalność w zakresie architektury"]
[null,"71.11.Z","Działalność w zakresie architektury"]
[null,"71.12","Działalność w zakresie inżynierii i związane z nią doradztwo techniczne"]
[null,"71.12.Z","Działalność w zakresie inżynierii i związane z nią doradztwo techniczne"]
[null,"71.2","Badania i analizy techniczne"]
[null,"71.20","Badania i analizy techniczne"]
[null,"71.20.A","Badania i analizy związane z jakością żywności"]
[null,"71.20.B","Pozostałe badania i analizy techniczne"]
[null,"72","BADANIA NAUKOWE I PRACE ROZWOJOWE"]
[null,"72.1","Badania naukowe i prace rozwojowe w dziedzinie nauk przyrodniczych i technicznych"]
[null,"72.11","Badania naukowe i prace rozwojowe w dziedzinie biotechnologii"]
[null,"72.11.Z","Badania naukowe i prace rozwojowe w dziedzinie biotechnologii"]
[null,"72.19","Badania naukowe i prace rozwojowe w dziedzinie pozostałych nauk przyrodniczych i technicznych"]
[null,"72.19.Z","Badania naukowe i prace rozwojowe w dziedzinie pozostałych nauk przyrodniczych i technicznych"]
[null,"72.2","Badania naukowe i prace rozwojowe w dziedzinie nauk społecznych i humanistycznych"]
[null,"72.20","Badania naukowe i prace rozwojowe w dziedzinie nauk społecznych i humanistycznych"]
[null,"72.20.Z","Badania naukowe i prace rozwojowe w dziedzinie nauk społecznych i humanistycznych"]
[null,"73","REKLAMA, BADANIE RYNKU I OPINII PUBLICZNEJ"]
[null,"73.1","Reklama"]
[null,"73.11","Działalność agencji reklamowych"]
[null,"73.11.Z","Działalność agencji reklamowych"]
[null,"73.12","Działalność związana z reprezentowaniem mediów"]
[null,"73.12.A","Pośrednictwo w sprzedaży czasu i miejsca na cele reklamowe w radio i telewizji"]
[null,"73.12.B","Pośrednictwo w sprzedaży miejsca na cele reklamowe w mediach drukowanych"]
[null,"73.12.C","Pośrednictwo w sprzedaży miejsca na cele reklamowe w mediach elektronicznych (Internet)"]
[null,"73.12.D","Pośrednictwo w sprzedaży miejsca na cele reklamowe w pozostałych mediach"]
[null,"73.2","Badanie rynku i opinii publicznej"]
[null,"73.20","Badanie rynku i opinii publicznej"]
[null,"73.20.Z","Badanie rynku i opinii publicznej"]
[null,"74","POZOSTAŁA DZIAŁALNOŚĆ PROFESJONALNA, NAUKOWA I TECHNICZNA"]
[null,"74.1","Działalność w zakresie specjalistycznego projektowania"]
[null,"74.10","Działalność w zakresie specjalistycznego projektowania"]
[null,"74.10.Z","Działalność w zakresie specjalistycznego projektowania"]
[null,"74.2","Działalność fotograficzna"]
[null,"74.20","Działalność fotograficzna"]
[null,"74.20.Z","Działalność fotograficzna"]
[null,"74.3","Działalność związana z tłumaczeniami"]
[null,"74.30","Działalność związana z tłumaczeniami"]
[null,"74.30.Z","Działalność związana z tłumaczeniami"]
[null,"74.9","Pozostała działalność profesjonalna, naukowa i techniczna, gdzie indziej niesklasyfikowana"]
[null,"74.90","Pozostała działalność profesjonalna, naukowa i techniczna, gdzie indziej niesklasyfikowana"]
[null,"74.90.Z","Pozostała działalność profesjonalna, naukowa i techniczna, gdzie indziej niesklasyfikowana"]
[null,"75","DZIAŁALNOŚĆ WETERYNARYJNA"]
[null,"75.0","DZIAŁALNOŚĆ WETERYNARYJNA"]
[null,"75.00","DZIAŁALNOŚĆ WETERYNARYJNA"]
[null,"75.00.Z","DZIAŁALNOŚĆ WETERYNARYJNA"]
[null,"N","DZIAŁALNOŚĆ W ZAKRESIE USŁUG ADMINISTROWANIA I DZIAŁALNOŚĆ WSPIERAJĄCA"]
[null,"77","WYNAJEM I DZIERŻAWA"]
[null,"77.1","Wynajem i dzierżawa pojazdów samochodowych, z wyłączeniem motocykli"]
[null,"77.11","Wynajem i dzierżawa samochodów osobowych i furgonetek"]
[null,"77.11.Z","Wynajem i dzierżawa samochodów osobowych i furgonetek"]
[null,"77.12","Wynajem i dzierżawa pozostałych pojazdów samochodowych, z wyłączeniem motocykli"]
[null,"77.12.Z","Wynajem i dzierżawa pozostałych pojazdów samochodowych, z wyłączeniem motocykli"]
[null,"77.2","Wypożyczanie i dzierżawa artykułów użytku osobistego i domowego"]
[null,"77.21","Wypożyczanie i dzierżawa sprzętu rekreacyjnego i sportowego"]
[null,"77.21.Z","Wypożyczanie i dzierżawa sprzętu rekreacyjnego i sportowego"]
[null,"77.22","Wypożyczanie kaset wideo, płyt CD, DVD itp."]
[null,"77.22.Z","Wypożyczanie kaset wideo, płyt CD, DVD itp."]
[null,"77.29","Wypożyczanie i dzierżawa pozostałych artykułów użytku osobistego i domowego"]
[null,"77.29.Z","Wypożyczanie i dzierżawa pozostałych artykułów użytku osobistego i domowego"]
[null,"77.3","Wynajem i dzierżawa pozostałych maszyn, urządzeń oraz dóbr materialnych"]
[null,"77.31","Wynajem i dzierżawa maszyn i urządzeń rolniczych"]
[null,"77.31.Z","Wynajem i dzierżawa maszyn i urządzeń rolniczych"]
[null,"77.32","Wynajem i dzierżawa maszyn i urządzeń budowlanych"]
[null,"77.32.Z","Wynajem i dzierżawa maszyn i urządzeń budowlanych"]
[null,"77.33","Wynajem i dzierżawa maszyn i urządzeń biurowych, włączając komputery"]
[null,"77.33.Z","Wynajem i dzierżawa maszyn i urządzeń biurowych, włączając komputery"]
[null,"77.34","Wynajem i dzierżawa środków transportu wodnego"]
[null,"77.34.Z","Wynajem i dzierżawa środków transportu wodnego"]
[null,"77.35","Wynajem i dzierżawa środków transportu lotniczego"]
[null,"77.35.Z","Wynajem i dzierżawa środków transportu lotniczego"]
[null,"77.39","Wynajem i dzierżawa pozostałych maszyn, urządzeń oraz dóbr materialnych, gdzie indziej niesklasyfikowane"]
[null,"77.39.Z","Wynajem i dzierżawa pozostałych maszyn, urządzeń oraz dóbr materialnych, gdzie indziej niesklasyfikowane"]
[null,"77.4","Dzierżawa własności intelektualnej i podobnych produktów, z wyłączeniem prac chronionych prawem autorskim"]
[null,"77.40","Dzierżawa własności intelektualnej i podobnych produktów, z wyłączeniem prac chronionych prawem autorskim"]
[null,"77.40.Z","Dzierżawa własności intelektualnej i podobnych produktów, z wyłączeniem prac chronionych prawem autorskim"]
[null,"78","DZIAŁALNOŚĆ ZWIĄZANA Z ZATRUDNIENIEM"]
[null,"78.1","Działalność związana z wyszukiwaniem miejsc pracy i pozyskiwaniem pracowników"]
[null,"78.10","Działalność związana z wyszukiwaniem miejsc pracy i pozyskiwaniem pracowników"]
[null,"78.10.Z","Działalność związana z wyszukiwaniem miejsc pracy i pozyskiwaniem pracowników"]
[null,"78.2","Działalność agencji pracy tymczasowej"]
[null,"78.20","Działalność agencji pracy tymczasowej"]
[null,"78.20.Z","Działalność agencji pracy tymczasowej"]
[null,"78.3","Pozostała działalność związana z udostępnianiem pracowników"]
[null,"78.30","Pozostała działalność związana z udostępnianiem pracowników"]
[null,"78.30.Z","Pozostała działalność związana z udostępnianiem pracowników"]
[null,"79","DZIAŁALNOŚĆ ORGANIZATORÓW TURYSTYKI, POŚREDNIKÓW I AGENTÓW TURYSTYCZNYCH ORAZ POZOSTAŁA DZIAŁALNOŚĆ USŁUGOWA W ZAKRESIE REZERWACJI I DZIAŁALNOŚCI Z NIĄ ZWIĄZANE"]
[null,"79.1","Działalność agentów i pośredników turystycznych oraz organizatorów turystyki"]
[null,"79.11","Działalność agentów i pośredników turystycznych"]
[null,"79.11.A","Działalność agentów turystycznych"]
[null,"79.11.B","Działalność pośredników turystycznych"]
[null,"79.12","Działalność organizatorów turystyki"]
[null,"79.12.Z","Działalność organizatorów turystyki"]
[null,"79.9","Pozostała działalność usługowa w zakresie rezerwacji i działalności z nią związane"]
[null,"79.90","Pozostała działalność usługowa w zakresie rezerwacji i działalności z nią związane"]
[null,"79.90.A","Działalność pilotów wycieczek i przewodników turystycznych"]
[null,"79.90.B","Działalność w zakresie informacji turystycznej"]
[null,"79.90.C","Pozostała działalność usługowa w zakresie rezerwacji, gdzie indziej niesklasyfikowana"]
[null,"80","DZIAŁALNOŚĆ DETEKTYWISTYCZNA I OCHRONIARSKA"]
[null,"80.1","Działalność ochroniarska, z wyłączeniem obsługi systemów bezpieczeństwa"]
[null,"80.10","Działalność ochroniarska, z wyłączeniem obsługi systemów bezpieczeństwa"]
[null,"80.10.Z","Działalność ochroniarska, z wyłączeniem obsługi systemów bezpieczeństwa"]
[null,"80.2","Działalność ochroniarska w zakresie obsługi systemów bezpieczeństwa"]
[null,"80.20","Działalność ochroniarska w zakresie obsługi systemów bezpieczeństwa"]
[null,"80.20.Z","Działalność ochroniarska w zakresie obsługi systemów bezpieczeństwa"]
[null,"80.3","Działalność detektywistyczna"]
[null,"80.30","Działalność detektywistyczna"]
[null,"80.30.Z","Działalność detektywistyczna"]
[null,"81","DZIAŁALNOŚĆ USŁUGOWA ZWIĄZANA Z UTRZYMANIEM PORZĄDKU W BUDYNKACH I ZAGOSPODAROWANIEM TERENÓW ZIELENI"]
[null,"81.1","Działalność pomocnicza związana z utrzymaniem porządku w budynkach"]
[null,"81.10","Działalność pomocnicza związana z utrzymaniem porządku w budynkach"]
[null,"81.10.Z","Działalność pomocnicza związana z utrzymaniem porządku w budynkach"]
[null,"81.2","Sprzątanie obiektów"]
[null,"81.21","Niespecjalistyczne sprzątanie budynków i obiektów przemysłowych"]
[null,"81.21.Z","Niespecjalistyczne sprzątanie budynków i obiektów przemysłowych"]
[null,"81.22","Specjalistyczne sprzątanie budynków i obiektów przemysłowych"]
[null,"81.22.Z","Specjalistyczne sprzątanie budynków i obiektów przemysłowych"]
[null,"81.29","Pozostałe sprzątanie"]
[null,"81.29.Z","Pozostałe sprzątanie"]
[null,"81.3","Działalność usługowa związana z zagospodarowaniem terenów zieleni"]
[null,"81.30","Działalność usługowa związana z zagospodarowaniem terenów zieleni"]
[null,"81.30.Z","Działalność usługowa związana z zagospodarowaniem terenów zieleni"]
[null,"82","DZIAŁALNOŚĆ ZWIĄZANA Z ADMINISTRACYJNĄ OBSŁUGĄ BIURA I POZOSTAŁA DZIAŁALNOŚĆ WSPOMAGAJĄCA PROWADZENIE DZIAŁALNOŚCI GOSPODARCZEJ"]
[null,"82.1","Działalność związana z administracyjną obsługą biura, włączając działalność wspomagającą"]
[null,"82.11","Działalność usługowa związana z administracyjną obsługą biura"]
[null,"82.11.Z","Działalność usługowa związana z administracyjną obsługą biura"]
[null,"82.19","Wykonywanie fotokopii, przygotowywanie dokumentów i pozostała specjalistyczna działalność wspomagająca prowadzenie biura"]
[null,"82.19.Z","Wykonywanie fotokopii, przygotowywanie dokumentów i pozostała specjalistyczna działalność wspomagająca prowadzenie biura"]
[null,"82.2","Działalność centrów telefonicznych (call center)"]
[null,"82.20","Działalność centrów telefonicznych (call center)"]
[null,"82.20.Z","Działalność centrów telefonicznych (call center)"]
[null,"82.3","Działalność związana z organizacją targów, wystaw i kongresów"]
[null,"82.30","Działalność związana z organizacją targów, wystaw i kongresów"]
[null,"82.30.Z","Działalność związana z organizacją targów, wystaw i kongresów"]
[null,"82.9","Działalność komercyjna, gdzie indziej niesklasyfikowana"]
[null,"82.91","Działalność świadczona przez agencje inkasa i biura kredytowe"]
[null,"82.91.Z","Działalność świadczona przez agencje inkasa i biura kredytowe"]
[null,"82.92","Działalność związana z pakowaniem"]
[null,"82.92.Z","Działalność związana z pakowaniem"]
[null,"82.99","Pozostała działalność wspomagająca prowadzenie działalności gospodarczej, gdzie indziej niesklasyfikowana"]
[null,"82.99.Z","Pozostała działalność wspomagająca prowadzenie działalności gospodarczej, gdzie indziej niesklasyfikowana"]
[null,"O","ADMINISTRACJA PUBLICZNA I OBRONA NARODOWA; OBOWIĄZKOWE ZABEZPIECZENIA SPOŁECZNE"]
[null,"84","ADMINISTRACJA PUBLICZNA I OBRONA NARODOWA; OBOWIĄZKOWE ZABEZPIECZENIA SPOŁECZNE"]
[null,"84.1","Administracja publiczna oraz polityka gospodarcza i społeczna"]
[null,"84.11","Kierowanie podstawowymi rodzajami działalności publicznej"]
[null,"84.11.Z","Kierowanie podstawowymi rodzajami działalności publicznej"]
[null,"84.12","Kierowanie w zakresie działalności związanej z ochroną zdrowia, edukacją, kulturą oraz pozostałymi usługami społecznymi, z wyłączeniem zabezpieczeń społecznych"]
[null,"84.12.Z","Kierowanie w zakresie działalności związanej z ochroną zdrowia, edukacją, kulturą oraz pozostałymi usługami społecznymi, z wyłączeniem zabezpieczeń społecznych"]
[null,"84.13","Kierowanie w zakresie efektywności gospodarowania"]
[null,"84.13.Z","Kierowanie w zakresie efektywności gospodarowania"]
[null,"84.2","Usługi na rzecz całego społeczeństwa"]
[null,"84.21","Sprawy zagraniczne"]
[null,"84.21.Z","Sprawy zagraniczne"]
[null,"84.22","Obrona narodowa"]
[null,"84.22.Z","Obrona narodowa"]
[null,"84.23","Wymiar sprawiedliwości"]
[null,"84.23.Z","Wymiar sprawiedliwości"]
[null,"84.24","Bezpieczeństwo państwa, porządek i bezpieczeństwo publiczne"]
[null,"84.24.Z","Bezpieczeństwo państwa, porządek i bezpieczeństwo publiczne"]
[null,"84.25","Ochrona przeciwpożarowa"]
[null,"84.25.Z","Ochrona przeciwpożarowa"]
[null,"84.3","Obowiązkowe zabezpieczenia społeczne"]
[null,"84.30","Obowiązkowe zabezpieczenia społeczne"]
[null,"84.30.Z","Obowiązkowe zabezpieczenia społeczne"]
[null,"P","EDUKACJA"]
[null,"85","EDUKACJA"]
[null,"85.1","Placówki wychowania przedszkolnego"]
[null,"85.10","Placówki wychowania przedszkolnego"]
[null,"85.10.Z","Placówki wychowania przedszkolnego"]
[null,"85.2","Szkoły podstawowe"]
[null,"85.20","Szkoły podstawowe"]
[null,"85.20.Z","Szkoły podstawowe"]
[null,"85.3","Gimnazja, szkoły ponadgimnazjalne i szkoły ponadpodstawowe, z wyłączeniem szkół policealnych"]
[null,"85.31","Gimnazja i licea ogólnokształcące"]
[null,"85.31.A","Gimnazja"]
[null,"85.31.B","Licea ogólnokształcące"]
[null,"85.32","Szkoły prowadzące kształcenie zawodowe, z wyłączeniem szkół policealnych"]
[null,"85.32.A","Technika"]
[null,"85.32.B","Branżowe szkoły I stopnia"]
[null,"85.32.C","Szkoły specjalne przysposabiające do pracy"]
[null,"85.32.D","Branżowe szkoły II stopnia"]
[null,"85.4","Szkoły policealne oraz wyższe"]
[null,"85.41","Szkoły policealne, kolegia pracowników służb społecznych i placówki doskonalenia nauczycieli"]
[null,"85.41.A","Szkoły policealne"]
[null,"85.41.B","Kolegia pracowników służb społecznych"]
[null,"85.41.C","Placówki doskonalenia nauczycieli"]
[null,"85.42","Szkoły wyższe"]
[null,"85.42.Z","Szkoły wyższe"]
[null,"85.5","Pozaszkolne formy edukacji"]
[null,"85.51","Pozaszkolne formy edukacji sportowej oraz zajęć sportowych i rekreacyjnych"]
[null,"85.51.Z","Pozaszkolne formy edukacji sportowej oraz zajęć sportowych i rekreacyjnych"]
[null,"85.52","Pozaszkolne formy edukacji artystycznej"]
[null,"85.52.Z","Pozaszkolne formy edukacji artystycznej"]
[null,"85.53","Pozaszkolne formy edukacji z zakresu nauki jazdy i pilotażu"]
[null,"85.53.Z","Pozaszkolne formy edukacji z zakresu nauki jazdy i pilotażu"]
[null,"85.59","Pozaszkolne formy edukacji, gdzie indziej niesklasyfikowane"]
[null,"85.59.A","Nauka języków obcych"]
[null,"85.59.B","Pozostałe pozaszkolne formy edukacji, gdzie indziej niesklasyfikowane"]
[null,"85.6","Działalność wspomagająca edukację"]
[null,"85.60","Działalność wspomagająca edukację"]
[null,"85.60.Z","Działalność wspomagająca edukację"]
[null,"Q","OPIEKA ZDROWOTNA I POMOC SPOŁECZNA"]
[null,"86","OPIEKA ZDROWOTNA"]
[null,"86.1","Działalność szpitali"]
[null,"86.10","Działalność szpitali"]
[null,"86.10.Z","Działalność szpitali"]
[null,"86.2","Praktyka lekarska"]
[null,"86.21","Praktyka lekarska ogólna"]
[null,"86.21.Z","Praktyka lekarska ogólna"]
[null,"86.22","Praktyka lekarska specjalistyczna"]
[null,"86.22.Z","Praktyka lekarska specjalistyczna"]
[null,"86.23","Praktyka lekarska dentystyczna"]
[null,"86.23.Z","Praktyka lekarska dentystyczna"]
[null,"86.9","Pozostała działalność w zakresie opieki zdrowotnej"]
[null,"86.90","Pozostała działalność w zakresie opieki zdrowotnej"]
[null,"86.90.A","Działalność fizjoterapeutyczna"]
[null,"86.90.B","Działalność pogotowia ratunkowego"]
[null,"86.90.C","Praktyka pielęgniarek i położnych"]
[null,"86.90.D","Działalność paramedyczna"]
[null,"86.90.E","Pozostała działalność w zakresie opieki zdrowotnej, gdzie indziej niesklasyfikowana"]
[null,"87","POMOC SPOŁECZNA Z ZAKWATEROWANIEM"]
[null,"87.1","Pomoc społeczna z zakwaterowaniem zapewniająca opiekę pielęgniarską"]
[null,"87.10","Pomoc społeczna z zakwaterowaniem zapewniająca opiekę pielęgniarską"]
[null,"87.10.Z","Pomoc społeczna z zakwaterowaniem zapewniająca opiekę pielęgniarską"]
[null,"87.2","Pomoc społeczna z zakwaterowaniem dla osób z zaburzeniami psychicznymi"]
[null,"87.20","Pomoc społeczna z zakwaterowaniem dla osób z zaburzeniami psychicznymi"]
[null,"87.20.Z","Pomoc społeczna z zakwaterowaniem dla osób z zaburzeniami psychicznymi"]
[null,"87.3","Pomoc społeczna z zakwaterowaniem dla osób w podeszłym wieku i osób niepełnosprawnych"]
[null,"87.30","Pomoc społeczna z zakwaterowaniem dla osób w podeszłym wieku i osób niepełnosprawnych"]
[null,"87.30.Z","Pomoc społeczna z zakwaterowaniem dla osób w podeszłym wieku i osób niepełnosprawnych"]
[null,"87.9","Pozostała pomoc społeczna z zakwaterowaniem"]
[null,"87.90","Pozostała pomoc społeczna z zakwaterowaniem"]
[null,"87.90.Z","Pozostała pomoc społeczna z zakwaterowaniem"]
[null,"88","POMOC SPOŁECZNA BEZ ZAKWATEROWANIA"]
[null,"88.1","Pomoc społeczna bez zakwaterowania dla osób w podeszłym wieku i osób niepełnosprawnych"]
[null,"88.10","Pomoc społeczna bez zakwaterowania dla osób w podeszłym wieku i osób niepełnosprawnych"]
[null,"88.10.Z","Pomoc społeczna bez zakwaterowania dla osób w podeszłym wieku i osób niepełnosprawnych"]
[null,"88.9","Pozostała pomoc społeczna bez zakwaterowania"]
[null,"88.91","Opieka dzienna nad dziećmi"]
[null,"88.91.Z","Opieka dzienna nad dziećmi"]
[null,"88.99","Pozostała pomoc społeczna bez zakwaterowania, gdzie indziej niesklasyfikowana"]
[null,"88.99.Z","Pozostała pomoc społeczna bez zakwaterowania, gdzie indziej niesklasyfikowana"]
[null,"R","DZIAŁALNOŚĆ ZWIĄZANA Z KULTURĄ, ROZRYWKĄ I REKREACJĄ"]
[null,"90","DZIAŁALNOŚĆ TWÓRCZA ZWIĄZANA Z KULTURĄ I ROZRYWKĄ"]
[null,"90.0","DZIAŁALNOŚĆ TWÓRCZA ZWIĄZANA Z KULTURĄ I ROZRYWKĄ"]
[null,"90.01","Działalność związana z wystawianiem przedstawień artystycznych"]
[null,"90.01.Z","Działalność związana z wystawianiem przedstawień artystycznych"]
[null,"90.02","Działalność wspomagająca wystawianie przedstawień artystycznych"]
[null,"90.02.Z","Działalność wspomagająca wystawianie przedstawień artystycznych"]
[null,"90.03","Artystyczna i literacka działalność twórcza"]
[null,"90.03.Z","Artystyczna i literacka działalność twórcza"]
[null,"90.04","Działalność obiektów kulturalnych"]
[null,"90.04.Z","Działalność obiektów kulturalnych"]
[null,"91","DZIAŁALNOŚĆ BIBLIOTEK, ARCHIWÓW, MUZEÓW ORAZ POZOSTAŁA DZIAŁALNOŚĆ ZWIĄZANA Z KULTURĄ"]
[null,"91.0","DZIAŁALNOŚĆ BIBLIOTEK, ARCHIWÓW, MUZEÓW ORAZ POZOSTAŁA DZIAŁALNOŚĆ ZWIĄZANA Z KULTURĄ"]
[null,"91.01","Działalność bibliotek i archiwów"]
[null,"91.01.A","Działalność bibliotek"]
[null,"91.01.B","Działalność archiwów"]
[null,"91.02","Działalność muzeów"]
[null,"91.02.Z","Działalność muzeów"]
[null,"91.03","Działalność historycznych miejsc i budynków oraz podobnych atrakcji turystycznych"]
[null,"91.03.Z","Działalność historycznych miejsc i budynków oraz podobnych atrakcji turystycznych"]
[null,"91.04","Działalność ogrodów botanicznych i zoologicznych oraz obszarów i obiektów ochrony przyrody"]
[null,"91.04.Z","Działalność ogrodów botanicznych i zoologicznych oraz obszarów i obiektów ochrony przyrody"]
[null,"92","DZIAŁALNOŚĆ ZWIĄZANA Z GRAMI LOSOWYMI I ZAKŁADAMI WZAJEMNYMI"]
[null,"92.0","DZIAŁALNOŚĆ ZWIĄZANA Z GRAMI LOSOWYMI I ZAKŁADAMI WZAJEMNYMI"]
[null,"92.00","DZIAŁALNOŚĆ ZWIĄZANA Z GRAMI LOSOWYMI I ZAKŁADAMI WZAJEMNYMI"]
[null,"92.00.Z","DZIAŁALNOŚĆ ZWIĄZANA Z GRAMI LOSOWYMI I ZAKŁADAMI WZAJEMNYMI"]
[null,"93","DZIAŁALNOŚĆ SPORTOWA, ROZRYWKOWA I REKREACYJNA"]
[null,"93.1","Działalność związana ze sportem"]
[null,"93.11","Działalność obiektów sportowych"]
[null,"93.11.Z","Działalność obiektów sportowych"]
[null,"93.12","Działalność klubów sportowych"]
[null,"93.12.Z","Działalność klubów sportowych"]
[null,"93.13","Działalność obiektów służących poprawie kondycji fizycznej"]
[null,"93.13.Z","Działalność obiektów służących poprawie kondycji fizycznej"]
[null,"93.19","Pozostała działalność związana ze sportem"]
[null,"93.19.Z","Pozostała działalność związana ze sportem"]
[null,"93.2","Działalność rozrywkowa i rekreacyjna"]
[null,"93.21","Działalność wesołych miasteczek i parków rozrywki"]
[null,"93.21.Z","Działalność wesołych miasteczek i parków rozrywki"]
[null,"93.29","Pozostała działalność rozrywkowa i rekreacyjna"]
[null,"93.29.Z","Pozostała działalność rozrywkowa i rekreacyjna"]
[null,"S","POZOSTAŁA DZIAŁALNOŚĆ USŁUGOWA"]
[null,"94","DZIAŁALNOŚĆ ORGANIZACJI CZŁONKOWSKICH"]
[null,"94.1","Działalność organizacji komercyjnych, pracodawców oraz organizacji profesjonalnych"]
[null,"94.11","Działalność organizacji komercyjnych i pracodawców"]
[null,"94.11.Z","Działalność organizacji komercyjnych i pracodawców"]
[null,"94.12","Działalność organizacji profesjonalnych"]
[null,"94.12.Z","Działalność organizacji profesjonalnych"]
[null,"94.2","Działalność związków zawodowych"]
[null,"94.20","Działalność związków zawodowych"]
[null,"94.20.Z","Działalność związków zawodowych"]
[null,"94.9","Działalność pozostałych organizacji członkowskich"]
[null,"94.91","Działalność organizacji religijnych"]
[null,"94.91.Z","Działalność organizacji religijnych"]
[null,"94.92","Działalność organizacji politycznych"]
[null,"94.92.Z","Działalność organizacji politycznych"]
[null,"94.99","Działalność pozostałych organizacji członkowskich, gdzie indziej niesklasyfikowana"]
[null,"94.99.Z","Działalność pozostałych organizacji członkowskich, gdzie indziej niesklasyfikowana"]
[null,"95","NAPRAWA I KONSERWACJA KOMPUTERÓW I ARTYKUŁÓW UŻYTKU OSOBISTEGO I DOMOWEGO"]
[null,"95.1","Naprawa i konserwacja komputerów i sprzętu komunikacyjnego"]
[null,"95.11","Naprawa i konserwacja komputerów i urządzeń peryferyjnych"]
[null,"95.11.Z","Naprawa i konserwacja komputerów i urządzeń peryferyjnych"]
[null,"95.12","Naprawa i konserwacja sprzętu (tele)komunikacyjnego"]
[null,"95.12.Z","Naprawa i konserwacja sprzętu (tele)komunikacyjnego"]
[null,"95.2","Naprawa i konserwacja artykułów użytku osobistego i domowego"]
[null,"95.21","Naprawa i konserwacja elektronicznego sprzętu powszechnego użytku"]
[null,"95.21.Z","Naprawa i konserwacja elektronicznego sprzętu powszechnego użytku"]
[null,"95.22","Naprawa i konserwacja urządzeń gospodarstwa domowego oraz sprzętu użytku domowego i ogrodniczego"]
[null,"95.22.Z","Naprawa i konserwacja urządzeń gospodarstwa domowego oraz sprzętu użytku domowego i ogrodniczego"]
[null,"95.23","Naprawa obuwia i wyrobów skórzanych"]
[null,"95.23.Z","Naprawa obuwia i wyrobów skórzanych"]
[null,"95.24","Naprawa i konserwacja mebli i wyposażenia domowego"]
[null,"95.24.Z","Naprawa i konserwacja mebli i wyposażenia domowego"]
[null,"95.25","Naprawa zegarów, zegarków oraz biżuterii"]
[null,"95.25.Z","Naprawa zegarów, zegarków oraz biżuterii"]
[null,"95.29","Naprawa pozostałych artykułów użytku osobistego i domowego"]
[null,"95.29.Z","Naprawa pozostałych artykułów użytku osobistego i domowego"]
[null,"96","POZOSTAŁA INDYWIDUALNA DZIAŁALNOŚĆ USŁUGOWA"]
[null,"96.0","POZOSTAŁA INDYWIDUALNA DZIAŁALNOŚĆ USŁUGOWA"]
[null,"96.01","Pranie i czyszczenie wyrobów włókienniczych i futrzarskich"]
[null,"96.01.Z","Pranie i czyszczenie wyrobów włókienniczych i futrzarskich"]
[null,"96.02","Fryzjerstwo i pozostałe zabiegi kosmetyczne"]
[null,"96.02.Z","Fryzjerstwo i pozostałe zabiegi kosmetyczne"]
[null,"96.03","Pogrzeby i działalność pokrewna"]
[null,"96.03.Z","Pogrzeby i działalność pokrewna"]
[null,"96.04","Działalność usługowa związana z poprawą kondycji fizycznej"]
[null,"96.04.Z","Działalność usługowa związana z poprawą kondycji fizycznej"]
[null,"96.09","Pozostała działalność usługowa, gdzie indziej niesklasyfikowana"]
[null,"96.09.Z","Pozostała działalność usługowa, gdzie indziej niesklasyfikowana"]
[null,"T","GOSPODARSTWA DOMOWE ZATRUDNIAJĄCE PRACOWNIKÓW; GOSPODARSTWA DOMOWE PRODUKUJĄCE WYROBY I ŚWIADCZĄCE USŁUGI NA WŁASNE POTRZEBY"]
[null,"97","GOSPODARSTWA DOMOWE ZATRUDNIAJĄCE PRACOWNIKÓW"]
[null,"97.0","GOSPODARSTWA DOMOWE ZATRUDNIAJĄCE PRACOWNIKÓW"]
[null,"97.00","GOSPODARSTWA DOMOWE ZATRUDNIAJĄCE PRACOWNIKÓW"]
[null,"97.00.Z","GOSPODARSTWA DOMOWE ZATRUDNIAJĄCE PRACOWNIKÓW"]
[null,"98","GOSPODARSTWA DOMOWE PRODUKUJĄCE WYROBY I ŚWIADCZĄCE USŁUGI NA WŁASNE POTRZEBY"]
[null,"98.1","Gospodarstwa domowe produkujące wyroby na własne potrzeby"]
[null,"98.10","Gospodarstwa domowe produkujące wyroby na własne potrzeby"]
[null,"98.10.Z","Gospodarstwa domowe produkujące wyroby na własne potrzeby"]
[null,"98.2","Gospodarstwa domowe świadczące usługi na własne potrzeby"]
[null,"98.20","Gospodarstwa domowe świadczące usługi na własne potrzeby"]
[null,"98.20.Z","Gospodarstwa domowe świadczące usługi na własne potrzeby"]
[null,"U","ORGANIZACJE I ZESPOŁY EKSTERYTORIALNE"]
[null,"99","ORGANIZACJE I ZESPOŁY EKSTERYTORIALNE"]
[null,"99.0","ORGANIZACJE I ZESPOŁY EKSTERYTORIALNE"]
[null,"99.00","ORGANIZACJE I ZESPOŁY EKSTERYTORIALNE"]
[null,"99.00.Z","ORGANIZACJE I ZESPOŁY EKSTERYTORIALNE"]